{"text_format":"1","workbook":"xlsx","n_sheets":9,"sheets":["Budowa","Remont","SŁOWNIK","DANE","DANE - TERC","DANE - K1 lit.A","DANE - K2 lit.C","DANE - K4 lit.B","DANE - pkt 9"],"not_rendered":{"charts":0,"images":0,"macros":1,"external_links":0,"defined_names":38,"comments":0,"pivot_tables":0},"unopened":[],"bounds":{"document_bytes":16777216,"sheet_cells":100000,"rows_first":2000,"rows_last":500,"rows_between":2000,"halvings":0,"cell_chars":16384,"cell_head_chars":4096},"cells_cut":0,"cells_raw":0,"read":"whole","date_system":"1900"}

{"sheet":"Budowa","index":0,"n_rows":235,"n_cols":54,"rows_kept":235,"cut":false,"hidden":false,"merged":[[89,30,89,47],[90,12,90,13],[90,14,90,15],[90,30,90,47],[89,14,89,15],[90,18,90,19],[89,21,89,22],[77,18,77,19],[77,21,77,22],[77,23,77,24],[7,30,8,47],[9,30,9,47],[10,30,10,47],[11,30,11,47],[12,30,12,47],[13,30,13,47],[14,30,14,47],[56,30,56,47],[57,30,57,47],[32,30,32,47],[55,30,55,47],[54,30,54,47],[15,30,15,47],[16,30,16,47],[17,30,17,47],[86,1,86,7],[86,9,86,10],[86,12,86,13],[86,14,86,15],[86,30,86,47],[85,18,85,19],[85,9,85,10],[85,1,85,7],[85,23,85,24],[86,18,86,19],[86,21,86,22],[86,23,86,24],[80,8,80,16],[80,17,80,25],[81,30,81,47],[83,30,83,47],[84,8,84,16],[84,17,84,25],[84,30,84,47],[83,18,83,19],[80,30,80,47],[81,18,81,19],[81,21,81,22],[81,23,81,24],[82,18,82,19],[82,21,82,22],[82,23,82,24],[82,30,82,47],[77,1,77,7],[70,1,70,7],[82,9,82,10],[82,12,82,13],[82,14,82,15],[70,18,70,19],[70,21,70,22],[70,23,70,24],[71,18,71,19],[81,1,81,7],[81,9,81,10],[81,12,81,13],[81,14,81,15],[72,8,72,16],[72,17,72,25],[73,1,73,7],[74,1,74,7],[74,9,74,10],[74,12,74,13],[73,9,73,10],[73,12,73,13],[73,14,73,15],[78,14,78,15],[79,1,79,7],[200,23,200,25],[200,30,200,47],[204,23,205,25],[203,2,203,22],[199,2,199,22],[204,2,204,22],[203,23,203,25],[200,2,200,22],[204,30,204,47],[199,23,199,25],[199,30,199,47],[172,30,172,47],[173,30,173,47],[184,30,184,47],[183,30,183,47],[177,1,177,25],[187,8,187,13],[188,8,188,13],[189,8,189,13],[187,19,187,25],[187,1,187,7],[179,1,179,4],[179,6,179,25],[180,1,180,25],[183,1,183,25],[129,0,133,0],[117,30,117,47],[120,30,120,47],[121,30,121,47],[122,30,122,47],[136,3,136,20],[137,3,137,20],[138,3,138,20],[136,21,136,22],[120,1,120,25],[130,2,130,25],[138,21,138,22],[123,30,126,47],[129,2,129,20],[138,23,138,24],[132,21,132,22],[137,21,137,22],[135,1,135,25],[136,0,141,0],[136,1,139,1],[139,3,139,20],[141,2,141,20],[141,21,141,22],[141,23,141,24],[18,30,18,47],[19,30,19,47],[21,30,21,47],[22,30,22,47],[39,30,39,47],[34,30,34,47],[35,30,35,47],[36,30,36,47],[37,30,37,47],[20,30,20,47],[3,30,3,47],[29,30,29,47],[60,30,60,47],[61,30,61,47],[62,30,62,47],[76,30,76,47],[125,3,125,10],[58,30,58,47],[59,30,59,47],[38,30,38,47],[64,30,64,47],[73,30,73,47],[74,30,74,47],[75,30,75,47],[63,30,63,47],[69,30,69,47],[70,30,70,47],[71,30,71,47],[72,30,72,47],[65,30,65,47],[66,30,66,47],[67,30,67,47],[68,30,68,47],[40,30,40,47],[30,30,30,47],[31,30,31,47],[190,30,190,47],[182,30,182,47],[179,30,179,47],[167,30,167,47],[150,30,150,47],[127,30,127,47],[23,30,23,47],[24,30,24,47],[25,30,25,47],[26,30,26,47],[27,30,27,47],[28,30,28,47],[148,30,148,47],[142,30,142,47],[143,30,143,47],[144,30,144,47],[145,30,145,47],[141,30,141,47],[137,30,137,47],[85,30,85,47],[87,30,87,47],[88,30,88,47],[212,2,212,13],[213,2,213,13],[217,1,217,25],[165,1,165,25],[33,30,33,47],[43,30,43,47],[166,30,166,47],[177,30,177,47],[178,30,178,47],[180,30,180,47],[181,30,181,47],[174,30,174,47],[95,30,95,47],[41,30,41,47],[42,30,42,47],[44,30,45,47],[47,30,53,47],[77,30,77,47],[78,30,78,47],[79,30,79,47],[91,30,91,47],[96,30,96,47],[106,30,106,47],[215,1,215,25],[198,30,198,47],[234,30,234,47],[231,30,231,47],[230,30,230,47],[232,30,232,47],[224,30,224,47],[222,30,222,47],[233,30,233,47],[229,30,229,47],[203,30,203,47],[223,30,223,47],[218,30,218,47],[219,30,219,47],[220,30,220,47],[221,30,221,47],[225,30,228,47],[212,30,212,47],[205,30,205,47],[13,16,13,21],[13,22,13,25],[186,30,186,47],[191,30,191,47],[187,30,189,47],[175,30,175,47],[176,30,176,47],[171,30,171,47],[216,30,216,47],[209,30,209,47],[210,30,210,47],[211,30,211,47],[192,30,192,47],[206,30,206,47],[207,30,207,47],[208,30,208,47],[193,30,193,47],[194,30,194,47],[195,30,195,47],[196,30,196,47],[201,30,201,47],[202,30,202,47],[197,30,197,47],[213,30,213,47],[36,20,36,25],[34,0,34,9],[7,26,12,28],[22,12,23,15],[22,3,23,11],[15,1,15,25],[16,0,16,25],[18,11,18,17],[19,11,19,17],[20,0,20,25],[7,0,7,12],[8,13,8,25],[7,13,7,25],[8,0,14,12],[9,13,9,25],[10,13,10,15],[11,13,11,15],[12,13,12,15],[13,13,13,15],[14,13,14,15],[10,16,10,25],[11,16,11,25],[12,16,12,25],[14,16,14,25],[22,0,23,2],[24,1,24,25],[25,8,25,15],[25,0,25,7],[30,10,30,17],[31,10,31,17],[33,0,33,9],[32,10,32,17],[32,18,32,25],[32,1,32,9],[33,10,33,17],[30,1,30,9],[19,18,19,25],[28,10,28,17],[28,1,28,9],[33,18,33,25],[40,20,40,25],[38,20,38,25],[28,18,28,25],[40,1,40,19],[31,18,31,25],[37,1,37,3],[26,8,26,14],[26,16,26,24],[26,0,26,6],[22,22,22,25],[22,17,22,21],[29,1,29,9],[29,10,29,17],[29,18,29,25],[30,18,30,25],[34,10,34,25],[35,1,35,25],[36,1,36,19],[23,22,23,25],[23,17,23,21],[53,0,53,2],[57,1,57,7],[55,8,55,16],[57,8,57,16],[57,17,57,25],[56,17,56,25],[51,0,51,2],[56,1,56,7],[56,8,56,16],[55,0,55,7],[5,0,5,25],[6,0,6,25],[0,1,0,25],[49,20,49,25],[50,20,50,25],[49,3,49,7],[49,8,49,12],[52,3,52,7],[52,8,52,12],[52,13,52,19],[49,13,49,19],[50,3,50,7],[50,8,50,12],[50,13,50,19],[49,0,49,2],[50,0,50,2],[17,1,17,25],[31,1,31,9],[27,1,27,25],[47,8,47,12],[47,13,47,19],[25,16,25,25],[39,4,39,25],[18,18,18,25],[41,4,41,25],[41,1,41,3],[46,3,46,7],[46,8,46,12],[45,0,46,2],[37,4,37,25],[48,8,48,12],[48,13,48,19],[48,20,48,25],[47,3,47,7],[47,20,47,25],[45,13,46,19],[48,3,48,7],[39,1,39,3],[38,1,38,19],[44,0,44,25],[45,3,45,12],[42,20,42,25],[42,1,42,19],[43,1,43,25],[47,0,47,2],[48,0,48,2],[60,1,60,7],[55,17,55,25],[61,1,61,7],[73,21,73,22],[73,23,73,24],[69,14,69,15],[58,8,58,16],[63,1,63,7],[63,8,63,16],[63,17,63,25],[60,8,60,25],[59,1,59,7],[59,8,59,16],[59,17,59,25],[65,1,65,7],[68,8,68,16],[68,17,68,25],[67,17,67,24],[69,18,69,19],[69,21,69,22],[69,23,69,24],[74,14,74,15],[69,12,69,13],[58,1,58,7],[69,1,69,7],[69,9,69,10],[71,1,71,7],[71,9,71,10],[70,9,70,10],[70,12,70,13],[70,14,70,15],[62,1,62,7],[62,8,62,24],[64,1,64,7],[67,1,67,7],[65,8,65,16],[65,17,65,25],[67,8,67,15],[66,17,66,24],[66,8,66,15],[61,8,61,25],[64,8,64,16],[64,17,64,25],[66,1,66,7],[58,17,58,25],[185,1,185,25],[182,1,182,4],[182,6,182,25],[188,14,188,18],[189,14,189,18],[189,1,189,7],[178,3,178,25],[54,1,54,25],[82,1,82,7],[76,1,76,7],[76,8,76,16],[76,17,76,25],[77,9,77,10],[77,12,77,13],[77,14,77,15],[73,18,73,19],[78,23,78,24],[79,18,79,19],[75,9,75,10],[75,18,75,19],[74,18,74,19],[74,21,74,22],[74,23,74,24],[78,1,78,7],[78,9,78,10],[78,12,78,13],[75,1,75,7],[78,18,78,19],[78,21,78,22],[79,9,79,10],[80,1,80,7],[21,1,21,25],[18,1,18,3],[19,1,19,3],[18,4,18,6],[19,4,19,6],[18,7,18,10],[19,7,19,10],[52,20,52,25],[53,3,53,12],[53,13,53,19],[53,20,53,25],[52,0,52,2],[45,20,46,25],[51,3,51,7],[51,8,51,12],[51,13,51,19],[51,20,51,25],[223,1,223,25],[221,1,221,25],[190,1,190,25],[192,23,192,25],[220,0,220,22],[212,22,212,25],[220,23,220,25],[218,0,218,22],[218,23,218,25],[219,1,219,25],[216,1,216,25],[201,2,201,22],[201,23,201,25],[193,2,193,22],[193,23,194,25],[194,2,194,22],[195,23,196,25],[202,2,202,22],[202,23,202,25],[205,2,205,22],[197,2,197,22],[197,23,197,25],[198,2,198,22],[198,23,198,25],[234,0,234,25],[228,2,228,25],[231,0,231,22],[231,23,231,25],[232,1,232,25],[224,0,224,22],[224,23,224,25],[225,1,225,25],[229,0,229,22],[229,23,229,25],[230,1,230,25],[226,2,226,25],[227,2,227,25],[233,0,233,25],[208,1,208,25],[222,0,222,22],[213,22,213,25],[214,2,214,25],[89,1,89,7],[99,2,99,23],[90,21,90,22],[181,1,181,2],[181,3,181,25],[186,1,186,25],[125,11,125,25],[112,24,112,25],[111,24,111,25],[106,3,106,23],[107,3,107,23],[104,3,104,23],[90,1,90,7],[90,9,90,10],[89,18,89,19],[102,2,102,25],[98,24,98,25],[222,23,222,25],[101,1,101,25],[89,9,89,10],[196,2,196,22],[184,1,184,2],[184,3,184,25],[172,1,172,2],[109,3,109,23],[128,1,128,25],[126,1,126,25],[111,3,111,23],[133,21,133,22],[132,23,132,24],[133,23,133,24],[129,23,129,24],[131,23,131,24],[115,1,115,2],[115,3,115,25],[119,1,119,2],[119,3,119,25],[124,1,125,2],[192,2,192,22],[166,3,166,25],[161,1,161,25],[188,1,188,7],[175,1,175,2],[175,3,175,25],[211,1,211,25],[207,0,207,25],[206,1,206,25],[209,1,209,25],[210,1,210,25],[144,24,144,25],[145,24,145,25],[144,2,144,23],[145,2,145,23],[146,24,146,25],[147,24,147,25],[146,2,146,23],[147,2,147,23],[150,1,150,4],[164,1,164,25],[195,2,195,22],[188,19,188,25],[189,19,189,25],[187,14,187,18],[173,1,173,25],[176,1,176,25],[178,1,178,2],[191,1,191,25],[169,1,169,2],[174,1,174,25],[167,1,167,4],[166,1,166,2],[105,30,105,47],[127,1,127,4],[127,6,127,25],[94,5,94,25],[105,24,105,25],[106,24,106,25],[107,24,107,25],[113,1,113,4],[113,6,113,25],[114,1,114,25],[97,1,97,25],[109,24,109,25],[110,24,110,25],[103,3,103,23],[112,3,112,23],[110,3,110,23],[108,2,108,25],[123,1,123,25],[121,1,121,25],[171,1,171,25],[157,1,157,25],[104,24,104,25],[92,1,92,4],[95,1,95,25],[103,24,103,25],[93,30,93,47],[94,30,94,47],[97,30,97,47],[172,3,172,25],[163,3,163,25],[170,1,170,25],[155,1,155,3],[155,4,155,25],[162,1,162,25],[167,6,167,25],[163,1,163,2],[158,2,158,25],[159,1,159,25],[156,1,156,25],[169,3,169,25],[133,3,133,20],[142,1,142,25],[87,1,87,7],[83,1,83,7],[83,9,83,10],[84,1,84,7],[96,1,96,4],[89,12,89,13],[94,1,94,4],[98,2,98,23],[89,23,89,24],[85,12,85,13],[85,14,85,15],[88,1,88,7],[90,23,90,24],[87,9,87,10],[91,18,91,19],[88,8,88,16],[88,17,88,25],[91,1,91,7],[91,9,91,10],[87,18,87,19],[85,21,85,22],[100,2,100,23],[92,5,92,25],[117,1,117,25],[124,3,124,10],[139,21,139,22],[140,21,140,22],[140,2,140,20],[150,6,150,25],[140,23,140,24],[139,23,139,24],[148,24,148,25],[149,24,149,25],[143,1,143,25],[122,1,122,12],[124,11,124,25],[118,1,118,25],[122,13,122,25],[131,3,131,20],[132,3,132,20],[134,1,134,25],[136,23,136,24],[137,23,137,24],[129,21,129,22],[131,21,131,22],[148,2,148,23],[149,2,149,23],[151,1,151,25],[153,1,153,25],[168,30,168,47],[169,30,169,47],[170,30,170,47],[165,30,165,47],[162,30,162,47],[163,30,163,47],[164,30,164,47],[157,30,157,47],[158,30,158,47],[159,30,159,47],[160,30,160,47],[161,30,161,47],[154,30,156,47],[151,30,151,47],[152,30,152,47],[153,30,153,47],[154,1,154,25],[160,1,160,2],[160,3,160,25],[168,1,168,25],[152,1,152,25],[118,30,119,47],[107,30,107,47],[108,30,108,47],[109,30,109,47],[110,30,110,47],[111,30,111,47],[112,30,112,47],[149,30,149,47],[146,30,146,47],[113,30,113,47],[147,30,147,47],[138,30,138,47],[139,30,139,47],[140,30,140,47],[128,30,128,47],[129,30,129,47],[130,30,130,47],[131,30,131,47],[132,30,132,47],[133,30,133,47],[134,30,134,47],[135,30,135,47],[136,30,136,47],[0,30,0,47],[1,1,1,25],[2,1,2,25],[3,1,3,25],[4,1,4,25],[4,30,4,47],[1,30,2,47],[5,30,6,47],[114,30,116,47],[105,3,105,23],[93,1,93,4],[93,5,93,25],[116,1,116,25],[104,30,104,47],[99,30,99,47],[98,30,98,47],[92,30,92,47],[100,30,100,47],[101,30,101,47],[102,30,102,47],[103,30,103,47],[100,24,100,25],[99,24,99,25],[96,6,96,25]]}
["!"," UWAGA: ",null,null,null,null,null,null,null,null,null,null,null,null,null,null,null,null,null,null,null,null,null,null,null,null,null,null,null,null,"INSTRUKCJA WYPEŁNIANIA WNIOSKU",null,null,null,null,null,null,null,null,null,null,null,null,null,null,null,null,null,null,null,"OK"]
[null,"WNIOSEK NALEŻY ZŁOŻYĆ ZA PISMEM PRZEWODNIM.",null,null,null,null,null,null,null,null,null,null,null,null,null,null,null,null,null,null,null,null,null,null,null,null,null,null,null,null,"szare pola - NIE ZMIENIAJ",null,null,null,null,null,null,null,null,null,null,null,null,null,null,null,null,null,null,null,"Wprowadzono błędną daną - proszę wprowadzić poprawną daną wybierając ją z listy rozwijanej"]
[null,"PRZED WYPEŁNIENIEM WNIOSKU NALEŻY ZAPOZNAĆ SIĘ Z INSTRUKCJĄ "]
[null,"WYPEŁNIAJĄC WNIOSEK NALEŻY KIEROWAĆ SIĘ INSTRUKCJĄ POMOCNICZĄ I WSKAZÓWKAMI  - (pola po prawej stronie wniosku oraz żółte pola pojawiające się po zaznaczeniu komórki).",null,null,null,null,null,null,null,null,null,null,null,null,null,null,null,null,null,null,null,null,null,null,null,null,null,null,null,null,"żółte pola - WYBIERZ Z LISTY ROZWIJANEJ"]
[null,"PLIK ZOSTAŁ ZABEZPIECZONY PRZED EDYTOWANIEM. \nPROSZĘ NIE USUWAĆ ZABEZPIECZEŃ I SAMODZIELNIE NIE EDYTOWAĆ PLIKU.",null,null,null,null,null,null,null,null,null,null,null,null,null,null,null,null,null,null,null,null,null,null,null,null,null,null,null,null,"białe pola - WPISZ"]
["WNIOSEK O DOFINANSOWANIE W RAMACH RZĄDOWEGO FUNDUSZU ROZWOJU DRÓG",null,null,null,null,null,null,null,null,null,null,null,null,null,null,null,null,null,null,null,null,null,null,null,null,null,null,null,null,null,"czerwone pola - błąd lub brak danych"]
["BUDOWA / PRZEBUDOWA"]
["PIECZĘĆ WPŁYWU DO URZĘDU WOJEWÓDZKIEGO",null,null,null,null,null,null,null,null,null,null,null,null,"NR EWIDENCYJNY \nWNIOSKU",null,null,null,null,null,null,null,null,null,null,null,null,"POLA POMOCNICZE - liczniki znaków użytych\nw komórkach",null,null,null,"PIECZĘĆ WPŁYWU DO URZĘDU WOJEWÓDZKIEGO oraz NR EWIDENCYJNY WNIOSKU uzupełniają pracownicy Świętokrzyskiego Urzędu Wojewódzkiego."]
[null,null,null,null,null,null,null,null,null,null,null,null,null,"/A /2026     "]
[null,null,null,null,null,null,null,null,null,null,null,null,null,"1. JEDNOSTKA SAMORZĄDU TERYTORIALNEGO",null,null,null,null,null,null,null,null,null,null,null,null,null,null,null,null,{"$f":"N10","v":"1. JEDNOSTKA SAMORZĄDU TERYTORIALNEGO"}]
[null,null,null,null,null,null,null,null,null,null,null,null,null,"JST  ",null,null,null,null,null,null,null,null,null,null,null,null,null,null,null,null,{"$f":"IF(Q11=\"\",\"Wybierz z listy rozwijanej jaka jednostka ubiega się o dofinansowanie (POWIAT / GMINA)\",IF(AND(Q11<>\"\",AZ11<>\"B\"),\"OK\",\"Błąd danej - wprowadź poprawną daną wybierając ją z listy rozwijanej\"))","v":"Wybierz z listy rozwijanej jaka jednostka ubiega się o dofinansowanie (POWIAT / GMINA)"},null,null,null,null,null,null,null,null,null,null,null,null,null,null,null,null,null,null,null,{"$f":"IF(Q11=\"\",\"W\",IF(AND(Q11<>\"\",AZ11<>\"B\"),\"OK\",IF(AZ11=\"B\",\"B\",\"\")))","v":"W"},{"$f":"IFERROR(IF(Q11=\"\",\"\",VLOOKUP(Q11,DANE!B8:B9,1,0)),\"B\")","v":""},{"$f":"IF(AND(Q11=\"\",OR(Q12<>\"\",Q13<>\"\")),\"b\",\"ok\")","v":"ok"}]
[null,null,null,null,null,null,null,null,null,null,null,null,null,"POWIAT  ",null,null,null,null,null,null,null,null,null,null,null,null,null,null,null,null,{"$f":"IF(AND(Q11=\"\",Q12=\"\"),\"\",IF(AND(Q11=\"POWIAT\",Q12=\"\"),\"Wybierz z listy rozwijanej powiat\",IF(AND(Q11=\"\",Q12<>\"\"),\"Wybierz z listy rozwijanej JST (pole powyżej)\",IF(AND(Q11=\"GMINA\",Q12=\"\"),\"Wybierz z listy rozwijanej powiat, w którym znajduje się gmina\",IF(AZ12=\"b\",\"Błąd danej - wprowadź poprawną daną wybierając ją z listy rozwijanej\",\"OK\")))))","v":""},null,null,null,null,null,null,null,null,null,null,null,null,null,null,null,null,null,null,null,{"$f":"IF(AND(Q11=\"\",Q12=\"\"),\"\",IF(AND(Q11=\"POWIAT\",Q12=\"\"),\"W\",IF(AND(Q11=\"\",Q12<>\"\"),\"W\",IF(AND(Q11=\"GMINA\",Q12=\"\"),\"W\",IF(AZ12=\"b\",\"B\",\"OK\")))))","v":""},{"$f":"IFERROR(IF(Q12=\"\",\"\",VLOOKUP(Q12,POWIAT[POWIAT],1,FALSE)),\"B\")","v":""}]
[null,null,null,null,null,null,null,null,null,null,null,null,null,{"$f":"IF(Q11=\"powiat\",\"\",\"GMINA  \")","v":"GMINA  "},null,null,null,null,null,null,null,null,null,null,null,null,null,null,null,null,{"$f":"IF(AND(Q11=\"POWIAT\",Q13=\"\"),\"\",IF(AND(Q11=\"POWIAT\",Q13<>\"\"),\"Błąd danej - błędnie wskazana JST lub błędnie wskazana GMINA\",IF(AND(Q11=\"GMINA\",Q12=\"\"),\"\",IF(AND(Q11=\"GMINA\",Q12<>\"\",Q13=\"\"),\"Wybierz z listy rozwijanej gminę\",IF(AND(Q11=\"\",Q12<>\"\",Q13<>\"\"),\"Wybierz z listy rozwijanej JST (dwa pola powyżej)\",IF(AND(Q11=\"\",Q12=\"\",Q13<>\"\"),\"Wybierz z listy rozwijanej JST (dwa pola powyżej) oraz POWIAT (pole powyżej)\",IF(AND(Q11=\"\",Q12=\"\",Q13=\"\"),\"\",IF(AND(Q11<>\"\",AY11=\"b\"),\"\",IF(AZ13=\"b\",\"Błąd danej - wybrana gmina nie znajduje się w powiecie wskazanym powyżej\",\"OK\")))))))))","v":""},null,null,null,null,null,null,null,null,null,null,null,null,null,null,null,null,null,null,null,{"$f":"IF(AND(Q11=\"POWIAT\",Q13=\"\"),\"\",IF(AND(Q11=\"POWIAT\",Q13<>\"\"),\"B\",IF(AND(Q11=\"GMINA\",Q12=\"\"),\"\",IF(AND(Q11=\"GMINA\",Q12<>\"\",Q13=\"\"),\"W\",IF(AND(Q11=\"\",Q12<>\"\",Q13<>\"\"),\"W\",IF(AND(Q11=\"\",Q12=\"\",Q13<>\"\"),\"W\",IF(AND(Q11=\"\",Q12=\"\",Q13=\"\"),\"\",IF(AND(Q11<>\"\",AY11=\"b\"),\"\",\"OK\"))))))))","v":""},{"$f":"IF(AND(Q11=\"powiat\",Q13<>\"\"),\"b\",IF(VLOOKUP(Q13,DANE!$E$59:$Q$159,13,0)<>Q12,\"b\",\"ok\"))","v":{"$error":"#N/A"}}]
[null,null,null,null,null,null,null,null,null,null,null,null,null,"NR TERC  ",null,null,{"$f":"IFERROR(IF(Q11=\"powiat\",VLOOKUP(Q12,DANE!$D$46:$H$58,4,0),IF(Q11=\"gmina\",VLOOKUP(Q13,DANE!$E$59:$H$159,3,0),\"\")),\"\")","v":""},null,null,null,null,null,{"$f":"IFERROR(IF(Q11=\"powiat\",VLOOKUP(Q12,DANE!$D$46:$H$58,5,0),IF(Q11=\"gmina\",VLOOKUP(Q13,DANE!$E$59:$H$159,4,0),\"\")),\"\")","v":""},null,null,null,null,"↓",null,null,{"$f":"IF(Q14=\"\",\"NR TERC ładuje się automatycznie po uzupełnieniu powyższych danych dotyczących jst\",IF(AND(Q11=\"POWIAT\",AZ14=4),\"OK - Załadowano NR TERC dla powiatu\",IF(AND(Q11=\"GMINA\",AZ14=7),\"OK - Załadowano NR TERC dla gminy\",IF(AND(Q11=\"POWIAT\",AZ14=7),\"Błąd danej - Załadowano NR TERC dla gminy, a w JST wybrano powiat\",IF(AND(Q11=\"GMINA\",AZ14=4),\"Błąd danej - Załadowano NR TERC dla powiatu, a w JST wybrano gminę\",\"\")))))","v":"NR TERC ładuje się automatycznie po uzupełnieniu powyższych danych dotyczących jst"},null,null,null,null,null,null,null,null,null,null,null,null,null,null,null,null,null,null,null,{"$f":"IF(Q14=\"\",\"W\",IF(AND(Q11=\"powiat\",AZ14=4),\"ok\",IF(AND(Q11=\"gmina\",AZ14=7),\"ok\",\"b\")))","v":"W"},{"$f":"LEN(Q14)","v":0}]
[null,null,null,null,null,null,null,null,null,null,null,null,null,"ADRES  ",null,null,null,null,null,null,null,null,null,null,null,null,{"$f":"LEN(Q15)","v":0},"z",120,null,{"$f":"IF(AA15=0,\"Wpisz adres jednostki samorządu terytorialnego ubiegającej się o dofinansowanie - [można użyć do 120 znaków]\",IF(AA15>120,\"błąd danej - Wprowadzono zbyt dużą ilość znków. Zmniejsz ilość wprowadzonych znaków\",\"Wprowadzono dane dotyczące adresu jednostki samorządu terytorialnego\"))","v":"Wpisz adres jednostki samorządu terytorialnego ubiegającej się o dofinansowanie - [można użyć do 120 znaków]"},null,null,null,null,null,null,null,null,null,null,null,null,null,null,null,null,null,null,null,{"$f":"IF(AA15=0,\"W\",IF(AA15>0,\"OK\",IF(AA15>120,\"b\",\"\")))","v":"W"}]
["2. ","TYTUŁ ZADANIA (nazwa zadania)",null,null,null,null,null,null,null,null,null,null,null,null,null,null,null,null,null,null,null,null,null,null,null,null,null,null,null,null,{"$f":"_xlfn.CONCAT(A16,B16)","v":"2. TYTUŁ ZADANIA (nazwa zadania)"}]
[null,null,null,null,null,null,null,null,null,null,null,null,null,null,null,null,null,null,null,null,null,null,null,null,null,null,{"$f":"LEN(A17)","v":0},"z",300,null,"Wpisz tytuł zadania (nazwę zadania) - [można użyć do 300 wszystkich znaków]\nWAŻNE:\nTytuł powinien identyfikować zadanie (rodzaj robót i ich lokalizację: nazwa ulicy, nr drogi i lokalizacja drogi) oraz sugerować klasyfikację środków (remont / budowa / rozbudowa / przebudowa)"]
["3. ","LOKALIZACJA ZADANIA (kategoria, numer i lokalizacja drogi, na której znajduje się realizowane zadanie)",null,null,null,null,null,null,null,null,null,null,null,null,null,null,null,null,null,null,null,null,null,null,null,null,null,null,null,null,{"$f":"_xlfn.CONCAT(A18,B18)","v":"3. LOKALIZACJA ZADANIA (kategoria, numer i lokalizacja drogi, na której znajduje się realizowane zadanie)"}]
["L.p.","KATEGORIA",null,null,"NR DROGI",null,null,"POWIAT ",null,null,null,"GMINA",null,null,null,null,null,null,"MIEJSCOWOŚĆ",null,null,null,null,null,null,null,null,null,null,null,"Wybierz z list rozwijanych kategorię drogi oraz powiat i gminę"]
[1,null,null,null,null,null,null,{"$f":"Q12","v":0},null,null,null,{"$f":"Q13","v":0},null,null,null,null,null,null,null,null,null,null,null,null,null,null,null,null,null,null,"Wpisz nr drogi, na której znajduje się zgłoszone zadanie oraz miejscowość",null,null,null,null,null,null,null,null,null,null,null,null,null,null,null,null,null,null,null,{"$f":"IF(VLOOKUP(L20,DANE!$E$59:$Q$159,13,0)<>H20,\"b\",\"ok\")","v":{"$error":"#N/A"}}]
[null,null,null,null,null,null,null,null,null,null,null,null,null,null,null,null,null,null,null,null,null,null,null,null,null,null,{"$f":"LEN(A21)","v":0},"z",400,null,"(miejsce na dodatkowe informacje dotyczące rodzaju i lokalizacji zadania np., gdy droga biegnie przez więcej niż jedną gminę lub więcej niż jedną miejscowość)"]
["4. ","PRZEWIDYWANY OKRES REALIZACJI ZADANIA (rozpoczęcie i zakończenie realizacji zadania)",null,null,null,null,null,null,null,null,null,null,null,null,null,null,null,null,null,null,null,null,null,null,null,null,null,null,null,null,{"$f":"_xlfn.CONCAT(A22,B22)","v":"4. PRZEWIDYWANY OKRES REALIZACJI ZADANIA (rozpoczęcie i zakończenie realizacji zadania)"}]
["Zadanie ",null,null,{"$f":"IF(AND(R23=\"\",R24=\"\",W24=\"\"),\"\",IFERROR(IF(BA23=0,\"nie wybrano lub błędnie wybrano daty realizacji zadania\",IF(BA23<12,\"JEDNOROCZNE\",IF(BA23=12,\"zmień miesiąc, aby zadanie było jednoroczne lub wieloletnie\",\"WIELOLETNIE\"))),\"nie wybrano lub błędnie wybrano daty realizacji zadania\"))","v":""},null,null,null,null,null,null,null,null,"realizowane ",null,null,null,"od ",null,null,null,null,null,2026,null,null,null,null,null,null,null,"Wybierz z listy rozwijanej przewidywany miesiąc rozpoczęcia robót budowlanych",null,null,null,null,null,null,null,null,null,null,null,null,null,null,null,null,null,null,null,{"$f":"IF(R23=\"stycznia\",1,IF(R23=\"lutego\",2,IF(R23=\"marca\",3,IF(R23=\"kwietnia\",4,IF(R23=\"maja\",5,IF(R23=\"czerwca\",6,IF(R23=\"lipca\",7,IF(R23=\"sierpnia\",8,IF(R23=\"września\",9,IF(R23=\"października\",10,IF(R23=\"listopada\",11,IF(R23=\"grudnia\",12,\"\"))))))))))))","v":""},{"$f":"IF(AY23=\"\",\"\",DATE(W23,AY23,1))","v":""},{"$f":"IF(AY23=\"\",\"\",DATEDIF(AZ23,AZ24,\"m\"))","v":""}]
[null,null,null,null,null,null,null,null,null,null,null,null,null,null,null,null,"do ",null,null,null,null,null,null,null,null,null,null,null,null,null,"Wybierz z listy rozwijanej przewidywany miesiąc i rok zakończenia robót budowlanych",null,null,null,null,null,null,null,null,null,null,null,null,null,null,null,null,null,null,null,{"$f":"IF(R24=\"stycznia\",1,IF(R24=\"lutego\",2,IF(R24=\"marca\",3,IF(R24=\"kwietnia\",4,IF(R24=\"maja\",5,IF(R24=\"czerwca\",6,IF(R24=\"lipca\",7,IF(R24=\"sierpnia\",8,IF(R24=\"września\",9,IF(R24=\"października\",10,IF(R24=\"listopada\",11,IF(R24=\"grudnia\",12,\"\"))))))))))))","v":""},{"$f":"IF(AY24=\"\",\"\",DATE(W24,AY24,1))","v":""},{"$f":"IFERROR(IF(BA23=\"\",\"\",IF(BA23>0,\"OK\",\"B\")),\"B\")","v":""},{"$f":"IF(BA23=\"\",\"\",IF(AND(R24<>\"\",W24<>\"\",BA23=12),\"B\",\"OK\"))","v":""}]
["5. ","DŁUGOŚĆ ODCINKÓW DRÓG OBJĘTYCH ZADANIEM, WG RODZAJU ROBÓT BUDOWLANYCH [m]",null,null,null,null,null,null,null,null,null,null,null,null,null,null,null,null,null,null,null,null,null,null,null,null,null,null,null,null,{"$f":"_xlfn.CONCAT(A25,B25)","v":"5. DŁUGOŚĆ ODCINKÓW DRÓG OBJĘTYCH ZADANIEM, WG RODZAJU ROBÓT BUDOWLANYCH [m]"}]
["BUDOWA",null,null,null,null,null,null,null,"PRZEBUDOWA",null,null,null,null,null,null,null,"ŁĄCZNIE",null,null,null,null,null,null,null,null,null,null,null,null,null,"Wpisz długość odcinka objętego danym rodzajem robót budowlanych (długość podaj w metrach)"]
[null,null,null,null,null,null,null,"m",null,null,null,null,null,null,null,"m",{"$f":"IF(AND(I27=\"\",A27=\"\"),\"\",A27+I27)","v":""},null,null,null,null,null,null,null,null,"m",null,null,null,null,"Łączna długość załaduje się automatycznie. Powinna być taka sama jak realizowana długość odcinka w pkt 9",null,null,null,null,null,null,null,null,null,null,null,null,null,null,null,null,null,null,null,{"$f":"IF(AND(A27=\"\",I27=\"\"),\"\",IF(AND(A27<>\"\",I27=\"\"),\"BUDOWA\",IF(AND(A27=\"\",I27<>\"\"),\"PRZEBUDOWA\",IF(AND(A27<>\"\",I27<>\"\",A27>=I27),\"BUDOWA\",IF(AND(A27<>\"\",I27<>\"\",A27<I27),\"PRZEBUDOWA\",\"\")))))","v":""}]
["6. ","PRZEWIDYWANY HARMONOGRAM RZECZOWO-FINANSOWY REALIZACJI ZADANIA (brutto)",null,null,null,null,null,null,null,null,null,null,null,null,null,null,null,null,null,null,null,null,null,null,null,null,null,null,null,null,{"$f":"_xlfn.CONCAT(A28,B28)","v":"6. PRZEWIDYWANY HARMONOGRAM RZECZOWO-FINANSOWY REALIZACJI ZADANIA (brutto)"}]
["Lp.","ELEMENTY I RODZAJE ROBÓT",null,null,null,null,null,null,null,null,"KOSZT KWALIFIKOWALNY [zł]",null,null,null,null,null,null,null,"KOSZT NIEKWALIFIKOWALNY [zł]"]
["1.","Roboty budowlane",null,null,null,null,null,null,null,null,null,null,null,null,null,null,null,null,null,null,null,null,null,null,null,null,null,null,null,null,"Wpisz koszt brutto robót budowlanych w podziale na wydatki kwalifikowalne i niekwalifikowalne"]
["2.","Nadzór inwestorski (wszystkie branże)",null,null,null,null,null,null,null,null,null,null,null,null,null,null,null,null,null,null,null,null,null,null,null,null,null,null,null,null,"Wpisz koszt brutto nadzoru inwestorskiego (wszystkie branże) w podziale na wydatki kwalifikowalne i niekwalifikowalne"]
["3.","Tablice informacyjne \n( na podst. art. 38 ust. 1, 1a ustawy o RFRD)",null,null,null,null,null,null,null,null,null,null,null,null,null,null,null,null,null,null,null,null,null,null,null,null,null,null,null,null,"Wpisz koszt brutto tablic informacyjnych w podziale na wydatki kwalifikowalne i niekwalifikowalne"]
["4.","Dodatkowy obowiązek informacyjny\n( na podst. art. 38 ust. 6 ustawy o RFRD)",null,null,null,null,null,null,null,null,null,null,null,null,null,null,null,null,null,null,null,null,null,null,null,null,null,null,null,null,"Wpisz koszt brutto dodatkowego obowiązku informacyjnego w podziale na wydatki kwalifikowalne i niekwalifikowalne \nKoszt kwalifikowalny dodatkowego obowiązku informacyjnego nie może być niższy niż 1 000,00 zł, ani wyższy niż 5 000,00 zł",null,null,null,null,null,null,null,null,null,null,null,null,null,null,null,null,null,null,null,{"$f":"IF(K33=\"\",\"\",IF(AND(1000<=K33,K33<=5000),\"OK\",\"B\"))","v":""}]
["SUMA ",null,null,null,null,null,null,null,null,null,{"$f":"SUM(K30:R33)","v":0},null,null,null,null,null,null,null,{"$f":"SUM(S30:Z33)","v":0},null,null,null,null,null,null,null,null,null,null,null,"SUMY OBLICZĄ SIĘ AUTOMATYCZNIE"]
["OGÓŁEM ",null,null,null,null,null,null,null,null,null,{"$f":"SUM(K34,S34)","v":0},null,null,null,null,null,null,null,null,null,null,null,null,null,null,null,null,null,null,null,"KWOTA OGÓŁEM OBLICZY SIĘ AUTOMATYCZNIE"]
["7. ","PRZEWIDYWANE KOSZTY REALIZACJI ZADANIA BRUTTO - WYDATKI KWALIFIKOWALNE [zł]",null,null,null,null,null,null,null,null,null,null,null,null,null,null,null,null,null,null,null,null,null,null,null,null,null,null,null,null,{"$f":"_xlfn.CONCAT(A36,B36)","v":"7. PRZEWIDYWANE KOSZTY REALIZACJI ZADANIA BRUTTO - WYDATKI KWALIFIKOWALNE [zł]"}]
["A.","ŁĄCZNY KOSZT REALIZACJI ZADANIA [zł]",null,null,null,null,null,null,null,null,null,null,null,null,null,null,null,null,null,null,{"$f":"K34","v":0},null,null,null,null,null,null,null,null,null,"Koszty i kwoty słownie załadują się automatycznie po poprawnym wypełnieniu pkt 6 wniosku",null,null,null,null,null,null,null,null,null,null,null,null,null,null,null,null,null,null,null,{"$f":"IF(K34=U37,\"ok\",\"b\")","v":"ok"},null,{"$f":"IF(U37<0,\"b\",\"OK\")","v":"OK"}]
[null,"SŁOWNIE :",null,null,{"$f":"IF(OR(U37=0,U37=\"\"),\"\",Slownie(U37))","v":""}]
["B.","KWOTA WNIOSKOWANEGO DOFINANSOWANIA [zł]",null,null,null,null,null,null,null,null,null,null,null,null,null,null,null,null,null,null,{"$f":"IF(OR(U37=\"\",U43=\"\"),\"\",IF(ROUNDDOWN(U37*U43,0)>30000000,AZ39,ROUNDDOWN((U37*U43),0)))","v":""},null,null,null,null,null,null,null,null,null,"Kwota dofinansowania nie może przekraczać 30 mln zł, jeśli przekracza, to wniosek ją automatycznie zmniejsza do kwoty maksymalnej",null,null,null,null,null,null,null,null,null,null,null,null,null,null,null,null,null,null,null,{"$f":"IF(U39>AZ39,\"b\",\"ok\")","v":"b"},30000000,{"$f":"IF(U39<0,\"b\",\"OK\")","v":"OK"}]
[null,"SŁOWNIE :",null,null,{"$f":"IF(OR(U39=0,U39=\"\"),\" \",Slownie(U39))","v":" "}]
["C.","KWOTA WKŁADU WŁASNEGO [zł]",null,null,null,null,null,null,null,null,null,null,null,null,null,null,null,null,null,null,{"$f":"IF(OR(U37=\"\",U43=\"\"),\"\",U37-U39)","v":""},null,null,null,null,null,null,null,null,null,null,null,null,null,null,null,null,null,null,null,null,null,null,null,null,null,null,null,null,null,null,null,{"$f":"IF(U41<0,\"b\",\"OK\")","v":"OK"}]
[null,"SŁOWNIE :",null,null,{"$f":"IF(OR(U41=0,U41=\"\"),\" \",Slownie(U41))","v":" "}]
["D.","UDZIAŁ DOFINANSOWANIA W KOSZTACH KWALIFIKOWALNYCH ZADANIA [%]",null,null,null,null,null,null,null,null,null,null,null,null,null,null,null,null,null,null,{"$f":"IF(Q14=\"\",\"\",IF(Q11=\"powiat\",VLOOKUP(Q14,DANE!$G$46:$O$58,9,0),VLOOKUP(Q14,DANE!$G$59:$O$159,9,0)))","v":""},null,null,null,null,null,null,null,null,null,"Poziom dofinansowania nie może przekraczać 80,00%. \nWprowadzono % dofinansowania z roku 2025, ale dana ta może ulec zmianie zgodnie z zatwierdzoną listą",null,null,null,null,null,null,null,null,null,null,null,null,null,null,null,null,null,null,null,null,{"$f":"U39/U37","v":{"$error":"#VALUE!"}},{"$f":"IF(U43<0,\"b\",\"OK\")","v":"OK"}]
["8. ","PRZEWIDYWANY TERMIN DOKONYWANIA WYPŁAT NA RZECZ WYKONAWCY ZADANIA",null,null,null,null,null,null,null,null,null,null,null,null,null,null,null,null,null,null,null,null,null,null,null,null,null,null,null,null,{"$f":"_xlfn.CONCAT(A44,B44)","v":"8. PRZEWIDYWANY TERMIN DOKONYWANIA WYPŁAT NA RZECZ WYKONAWCY ZADANIA"}]
["KWOTA DO WYPŁATY W DANYM ROKU NA RZECZ WYKONAWCY ZADANIA ",null,null,null,null,null,null,null,null,null,null,null,null,null,null,null,null,null,null,null,null,null,null,null,null,null,null,null,null,null,"Uzupełnij dane dotyczące dokonywania wypłat na rzecz wykonawcy zadania w podziale na poszczególne lata oraz na wydatki kwalifikowalne i niekwalifikowalne. Wydatki kwalifikowalne należy podać w podziale na dofinansowanie i wkład własny."]
["ROK",null,null,"KWALIFIKOWALNE",null,null,null,null,null,null,null,null,null,"NIEKWALIFIKOWALNE",null,null,null,null,null,null,"OGÓŁEM"]
[null,null,null,"DOFINANSOWANIE",null,null,null,null,"WKŁAD WŁASNY"]
[2026,null,null,null,null,null,null,null,null,null,null,null,null,null,null,null,null,null,null,null,{"$f":"IF(AND(D48=\"\",I48=\"\",N48=\"\"),\"\",SUM(D48:T48))","v":""},null,null,null,null,null,null,null,null,null,"Jeśli dane nie będą wprowadzone poprawnie, to kwoty sum i łącznie podświetlą się na czerwono. \nBędzie to miało miejsce w przypadku, gdy:\n - kwota dofinansowania (suma z wiersza 53), będzie się różnić od kwoty dofinansowania w pkt 7 lit. B (wiersz 39);\n - kwota wkładu własnego (suma z wiersza 53), będzie się różnić od kwoty wkładu własnego w pkt 7 lit. C (wiersz 41);\n - kwota środków kwalifikowalnych (łącznie z wiersza 54), będzie się różnić od kwoty łącznego kosztu realizacji zadania w pkt 7 lit. A (wiersz 37);\n - kwota środków niekwalifikowalnych (łącznie z wiersza 54), będzie się różnić od kwoty kosztów niekwalifikowalnych w pkt 6 (wiersz 34);\n - kwota środków ogółem (łącznie z wiersza 54), będzie się różnić od kwoty kosztów ogółem w pkt 6 (wiersz 35);\n\nNależy wtedy poprawić kwoty z wierszy 48-52 lub kwoty w pkt 6 wniosku (jeśli tam zostały wprowadzone błędnie)"]
[2027,null,null,null,null,null,null,null,null,null,null,null,null,null,null,null,null,null,null,null,{"$f":"IF(AND(D49=\"\",I49=\"\",N49=\"\"),\"\",SUM(D49:T49))","v":""}]
[2028,null,null,null,null,null,null,null,null,null,null,null,null,null,null,null,null,null,null,null,{"$f":"IF(AND(D50=\"\",I50=\"\",N50=\"\"),\"\",SUM(D50:T50))","v":""}]
[2029,null,null,null,null,null,null,null,null,null,null,null,null,null,null,null,null,null,null,null,{"$f":"IF(AND(D51=\"\",I51=\"\",N51=\"\"),\"\",SUM(D51:T51))","v":""}]
[2030,null,null,null,null,null,null,null,null,null,null,null,null,null,null,null,null,null,null,null,{"$f":"IF(AND(D52=\"\",I52=\"\",N52=\"\"),\"\",SUM(D52:T52))","v":""}]
["SUMA",null,null,{"$f":"SUM(D48:H52)","v":0},null,null,null,null,{"$f":"SUM(I48:M52)","v":0},null,null,null,null,null,null,null,null,null,null,null,null,null,null,null,null,null,null,null,null,null,null,null,null,null,null,null,null,null,null,null,null,null,null,null,null,null,null,null,null,null,{"$f":"IF(U39=\"\",\"ok\",IF(D53<>U39,\"błąd\",\"ok\"))","v":"ok"},{"$f":"IF(U41=\"\",\"ok\",IF(I53<>U41,\"błąd\",\"ok\"))","v":"ok"}]
["ŁĄCZNIE",null,null,{"$f":"D53+I53","v":0},null,null,null,null,null,null,null,null,null,{"$f":"SUM(N48:T52)","v":0},null,null,null,null,null,null,{"$f":"SUM(U48:Z52)","v":0},null,null,null,null,null,null,null,null,null,null,null,null,null,null,null,null,null,null,null,null,null,null,null,null,null,null,null,null,null,{"$f":"IF(U37=\"\",\"ok\",IF(D54<>U37,\"błąd\",\"ok\"))","v":"ok"},{"$f":"IF(N54<>S34,\"błąd\",\"ok\")","v":"ok"},{"$f":"IF(U54<>K35,\"błąd\",\"ok\")","v":"ok"}]
["9.\n ","OPIS ZADANIA OBEJMUJĄCY STAN ISTNIEJĄCY ORAZ PROJEKTOWANY WRAZ Z UZASADNIENIEM REALIZACJI ZADANIA",null,null,null,null,null,null,null,null,null,null,null,null,null,null,null,null,null,null,null,null,null,null,null,null,null,null,null,null,{"$f":"_xlfn.CONCAT(A55,B55)","v":"9.\n OPIS ZADANIA OBEJMUJĄCY STAN ISTNIEJĄCY ORAZ PROJEKTOWANY WRAZ Z UZASADNIENIEM REALIZACJI ZADANIA"}]
["PARAMETRY ODCINKA",null,null,null,null,null,null,null,"STAN ISTNIEJĄCY",null,null,null,null,null,null,null,null,"STAN PROJEKTOWANY",null,null,null,null,null,null,null,null,null,null,null,null,"Parametry odcinka dotyczą stanu istniejącego oraz stanu projektowanego, czyli stanu jaki ma zostać osiągnięty w wyniku budowy lub przebudowy;\nWszystkie długości podaj z dokładnością do jednego metra."]
[null,"kategoria drogi ",null,null,null,null,null,null,null,null,null,null,null,null,null,null,null,null,null,null,null,null,null,null,null,null,null,null,null,null,"Kategoria drogi - wybierz z listy kategorię drogi stanu istniejącego i projektowanego"]
[null,"numer drogi ",null,null,null,null,null,null,null,null,null,null,null,null,null,null,null,null,null,null,null,null,null,null,null,null,null,null,null,null,"Numer drogi - wpisz numer drogi stanu istniejącego i projektowanego"]
[null,"klasa drogi ",null,null,null,null,null,null,null,null,null,null,null,null,null,null,null,null,null,null,null,null,null,null,null,null,null,null,null,null,"Klasa drogi - wybierz z listy rozwijanej, po wypełnieniu kategorii drogi"]
[null,"rodzaj drogi ",null,null,null,null,null,null,null,null,null,null,null,null,null,null,null,null,null,null,null,null,null,null,null,null,null,null,null,null,"Rodzaj drogi - wybierz z listy rozwijanej"]
[null,"rodzaj robót budowlanych ",null,null,null,null,null,null,{"$f":"IF(AND(A27=\"\",I27=\"\"),\"\",IF(AND(A27<>\"\",I27=\"\"),\"BUDOWA\",IF(AND(A27=\"\",I27<>\"\"),\"PRZEBUDOWA\",IF(AND(A27<>\"\",I27<>\"\",A27>=I27),\"BUDOWA\",IF(AND(A27<>\"\",I27<>\"\",A27<I27),\"PRZEBUDOWA\",\"\")))))","v":""},null,null,null,null,null,null,null,null,null,null,null,null,null,null,null,null,null,null,null,null,null,"Rodzaj robót budowlanych - komórka załaduje się automatycznie; jeśli dana się nie załaduje wybierz daną z listy rozwijanej",null,null,null,null,null,null,null,null,null,null,null,null,null,null,null,null,null,null,null,{"$f":"IF(OR(I61=A26,I61=I26,I61=AY27),\"OK\",\"b\")","v":"OK"}]
[null,"realizowany kilometraż ",null,null,null,null,null,null,null,null,null,null,null,null,null,null,null,null,null,null,null,null,null,null,null,null,null,null,null,null,"Realizowany kilometraż - wpisz rzeczywisty kilometraż, w którym realizowane jest zadanie"]
[null,"realizowana długość odcinka ",null,null,null,null,null,null,{"$f":"Q27","v":""},null,null,null,null,null,null,null,null,null,null,null,null,null,null,null,null,"m",null,null,null,null,"Realizowana długość odcinka - komórka załaduje się automatycznie (lub wpisz realizowaną długość odcinka z dokładnością do jednego metra)"]
[null,"zgoda na odstępstwo od przepisów",null,null,null,null,null,null,null,null,null,null,null,null,null,null,null,null,null,null,null,null,null,null,null,null,null,null,null,null,"Zgoda na odstępstwo od przepisów techniczno-budowlanych - wybierz z listy rozwijanej;\nJeśli TAK, należy dołączyć do wniosku kopię zgody na odstępstwo od przepisów techniczno-budowlanych"]
[null,"trudne warunki",null,null,null,null,null,null,null,null,null,null,null,null,null,null,null,null,null,null,null,null,null,null,null,null,null,null,null,null,"Trudne warunki - wybierz z listy rozwijanej czy w ramach realizacji zadania będą stosowane przepisy odnoszące się do trudnych warunków;"]
[null,"przekrój jezdni",null,null,null,null,null,null,null,null,null,null,null,null,null,null,null,null,null,null,null,null,null,null,null,null,null,null,null,null,"Wpisz przekrój realizowanej jezdni zgodnie z Rozporządzeniem  w sprawie przepisów techniczno-budowlanych dotyczących dróg "]
[null,"szerokość jezdni ",null,null,null,null,null,null,null,null,null,null,null,null,null,null,"m",null,null,null,null,null,null,null,null,"m",null,null,null,null,"Wpisz szerokość realizowanej jezdni"]
[null,"szerokość pasa ruchu ",null,null,null,null,null,null,null,null,null,null,null,null,null,null,"m",null,null,null,null,null,null,null,null,"m",null,null,null,null,"Wpisz szerokość pasa ruchu realizowanej jezdni"]
[null,null,null,null,null,null,null,"pobocza o nawierzchni gruntowej ",null,null,null,null,null,null,null,null,null,null,null,null,null,null,null,null,null,null,null,null,null,null,{"$f":"IF(OR(AY69=\"b\",AZ69=\"b\"),\"Sprawdź poprawność danych (lista rozwijana, długości, szerokości) dotyczących poboczy o nawierzchni gruntowej\",\"Wybierz z listy rozwijanej, czy odcinek posiada pobocza o nawierzchni gruntowej i czy będą one realizowane w ramach zadania.\")","v":"Wybierz z listy rozwijanej, czy odcinek posiada pobocza o nawierzchni gruntowej i czy będą one realizowane w ramach zadania."}]
[null,"strona prawa ",null,null,null,null,null,null,"dł.",null,null,"m","szer.",null,null,null,"m","dł.",null,null,"m","szer.",null,null,null,"m",null,null,null,null,{"$f":"IF(AND(OR(I69=\"\",I69=\"nie\",I69=\"nie dotyczy\"),OR(R69=\"\",R69=\"nie\",R69=\"nie dotyczy\")),\"\",IF(AND(I69=\"TAK\",OR(R69=\"\",R69=\"nie\",R69=\"nie dotyczy\")),\"Wpisz długość i szerokość  istniejących poboczy gruntowych po stronie prawej\", IF(AND(OR(I69=\"\",I69=\"nie\",I69=\"nie dotyczy\"),R69=\"TAK\"),\"Wpisz długość i szerokość  projektowanych poboczy gruntowych po stronie prawej\", IF(AND(I69=\"TAK\",R69=\"TAK\"),\"Wpisz długość i szerokość  istniejących i projektowanych poboczy gruntowych po stronie prawej\"))))","v":""}]
[null,"strona lewa ",null,null,null,null,null,null,"dł.",null,null,"m","szer.",null,null,null,"m","dł.",null,null,"m","szer.",null,null,null,"m",null,null,null,null,{"$f":"IF(AND(OR(I69=\"\",I69=\"nie\",I69=\"nie dotyczy\"),OR(R69=\"\",R69=\"nie\",R69=\"nie dotyczy\")),\"\",IF(AND(I69=\"TAK\",OR(R69=\"\",R69=\"nie\",R69=\"nie dotyczy\")),\"Wpisz długość i szerokość  istniejących poboczy gruntowych po stronie lewej\", IF(AND(OR(I69=\"\",I69=\"nie\",I69=\"nie dotyczy\"),R69=\"TAK\"),\"Wpisz długość i szerokość  projektowanych poboczy gruntowych po stronie lewej\", IF(AND(I69=\"TAK\",R69=\"TAK\"),\"Wpisz długość i szerokość  istniejących i projektowanych poboczy gruntowych po stronie lewej\"))))","v":""}]
[null,"łączna długość ",null,null,null,null,null,null,"dł.",{"$f":"IF(AND(J70=\"\",J71=\"\"),\"\",SUM(J70:K71))","v":""},null,"m",null,null,null,null,null,"dł.",{"$f":"IF(AND(S70=\"\",S71=\"\"),\"\",SUM(S70:T71))","v":""},null,"m",null,null,null,null,null,null,null,null,null,{"$f":"IF(AND(OR(I69=\"\",I69=\"nie\",I69=\"nie dotyczy\"),OR(R69=\"\",R69=\"nie\",R69=\"nie dotyczy\")),\"\",\"Łączna długość poboczy gruntowych załaduje się automatycznie\")","v":""}]
[null,null,null,null,null,null,null,"pobocza o nawierzchni twardej ",null,null,null,null,null,null,null,null,null,"TAK",null,null,null,null,null,null,null,null,null,null,null,null,{"$f":"IF(OR(AY73=\"b\",AZ73=\"b\"),\"Sprawdź poprawność danych (lista rozwijana, długości, szerokości) dotyczących poboczy o nawierzchni twardej\",\"Wybierz z listy rozwijanej, czy odcinek posiada pobocza o nawierzchni twardej i czy będą one realizowane w ramach zadania.\")","v":"Wybierz z listy rozwijanej, czy odcinek posiada pobocza o nawierzchni twardej i czy będą one realizowane w ramach zadania."}]
[null,"strona prawa ",null,null,null,null,null,null,"dł.",null,null,"m","szer.",null,null,null,"m","dł.",null,null,"m","szer.",null,null,null,"m",null,null,null,null,{"$f":"IF(AND(OR(I73=\"\",I73=\"nie\",I73=\"nie dotyczy\"),OR(R73=\"\",R73=\"nie\",R73=\"nie dotyczy\")),\"\",IF(AND(I73=\"TAK\",OR(R73=\"\",R73=\"nie\",R73=\"nie dotyczy\")),\"Wpisz długość i szerokość  istniejących poboczy o nawierzchni twardej po stronie prawej\", IF(AND(OR(I73=\"\",I73=\"nie\",I73=\"nie dotyczy\"),R73=\"TAK\"),\"Wpisz długość i szerokość  projektowanych poboczy o nawierzchni twardej po stronie prawej\", IF(AND(I73=\"TAK\",R73=\"TAK\"),\"Wpisz długość i szerokość  istniejących i projektowanych poboczy o nawierzchni twardej po stronie prawej\"))))","v":"Wpisz długość i szerokość  projektowanych poboczy o nawierzchni twardej po stronie prawej"}]
[null,"strona lewa ",null,null,null,null,null,null,"dł.",null,null,"m","szer.",null,null,null,"m","dł.",null,null,"m","szer.",null,null,null,"m",null,null,null,null,{"$f":"IF(AND(OR(I73=\"\",I73=\"nie\",I73=\"nie dotyczy\"),OR(R73=\"\",R73=\"nie\",R73=\"nie dotyczy\")),\"\",IF(AND(I73=\"TAK\",OR(R73=\"\",R73=\"nie\",R73=\"nie dotyczy\")),\"Wpisz długość i szerokość  istniejących poboczy o nawierzchni twardej po stronie lewej\", IF(AND(OR(I73=\"\",I73=\"nie\",I73=\"nie dotyczy\"),R73=\"TAK\"),\"Wpisz długość i szerokość  projektowanych poboczy o nawierzchni twardej po stronie lewej\", IF(AND(I73=\"TAK\",R73=\"TAK\"),\"Wpisz długość i szerokość  istniejących i projektowanych poboczy o nawierzchni twardej po stronie lewej\"))))","v":"Wpisz długość i szerokość  projektowanych poboczy o nawierzchni twardej po stronie lewej"}]
[null,"łączna długość ",null,null,null,null,null,null,"dł.",{"$f":"IF(AND(J74=\"\",J75=\"\"),\"\",SUM(J74:K75))","v":""},null,"m",null,null,null,null,null,"dł.",{"$f":"IF(AND(S74=\"\",S75=\"\"),\"\",SUM(S74:T75))","v":""},null,"m",null,null,null,null,null,null,null,null,null,{"$f":"IF(AND(OR(I73=\"\",I73=\"nie\",I73=\"nie dotyczy\"),OR(R73=\"\",R73=\"nie\",R73=\"nie dotyczy\")),\"\",\"Łączna długość poboczy gruntowych załaduje się automatycznie\")","v":"Łączna długość poboczy gruntowych załaduje się automatycznie"}]
[null,"droga dla pieszych ",null,null,null,null,null,null,null,null,null,null,null,null,null,null,null,null,null,null,null,null,null,null,null,null,null,null,null,null,{"$f":"IF(OR(AY77=\"b\",AZ77=\"b\"),\"Sprawdź poprawność danych (lista rozwijana, długości, szerokości) dotyczących drogi dla pieszych\",\"Wybierz z listy rozwijanej, czy odcinek posiada drogę dla pieszych i czy będzie ona realizowana w ramach zadania.\")","v":"Wybierz z listy rozwijanej, czy odcinek posiada drogę dla pieszych i czy będzie ona realizowana w ramach zadania."}]
[null,"strona prawa ",null,null,null,null,null,null,"dł.",null,null,"m","szer.",null,null,null,"m","dł.",null,null,"m","szer.",null,null,null,"m",null,null,null,null,{"$f":"IF(AND(OR(I77=\"\",I77=\"nie\",I77=\"nie dotyczy\"),OR(R77=\"\",R77=\"nie\",R77=\"nie dotyczy\")),\"\",IF(AND(I77=\"TAK\",OR(R77=\"\",R77=\"nie\",R77=\"nie dotyczy\")),\"Wpisz długość i szerokość  istniejącej drogi dla pieszych po stronie prawej\", IF(AND(OR(I77=\"\",I77=\"nie\",I77=\"nie dotyczy\"),R77=\"TAK\"),\"Wpisz długość i szerokość  projektowanej drogi dla pieszych po stronie prawej\", IF(AND(I77=\"TAK\",R77=\"TAK\"),\"Wpisz długość i szerokość  istniejącej i projektowanej drogi dla pieszych po stronie prawej\"))))","v":""}]
[null,"strona lewa ",null,null,null,null,null,null,"dł.",null,null,"m","szer.",null,null,null,"m","dł.",null,null,"m","szer.",null,null,null,"m",null,null,null,null,{"$f":"IF(AND(OR(I77=\"\",I77=\"nie\",I77=\"nie dotyczy\"),OR(R77=\"\",R77=\"nie\",R77=\"nie dotyczy\")),\"\",IF(AND(I77=\"TAK\",OR(R77=\"\",R77=\"nie\",R77=\"nie dotyczy\")),\"Wpisz długość i szerokość  istniejącej drogi dla pieszych po stronie lewej\", IF(AND(OR(I77=\"\",I77=\"nie\",I77=\"nie dotyczy\"),R77=\"TAK\"),\"Wpisz długość i szerokość  projektowanej drogi dla pieszych po stronie lewej\", IF(AND(I77=\"TAK\",R77=\"TAK\"),\"Wpisz długość i szerokość  istniejącej i projektowanej drogi dla pieszych po stronie lewej\"))))","v":""}]
[null,"łączna długość ",null,null,null,null,null,null,"dł.",{"$f":"IF(AND(J78=\"\",J79=\"\"),\"\",SUM(J78:K79))","v":""},null,"m",null,null,null,null,null,"dł.",{"$f":"IF(AND(S78=\"\",S79=\"\"),\"\",SUM(S78:T79))","v":""},null,"m",null,null,null,null,null,null,null,null,null,{"$f":"IF(AND(OR(I77=\"\",I77=\"nie\",I77=\"nie dotyczy\"),OR(R77=\"\",R77=\"nie\",R77=\"nie dotyczy\")),\"\",\"Łączna długość drogi dla pieszych załaduje się automatycznie\")","v":""}]
[null,"droga dla pieszych i rowerów ",null,null,null,null,null,null,null,null,null,null,null,null,null,null,null,null,null,null,null,null,null,null,null,null,null,null,null,null,{"$f":"IF(OR(AY81=\"b\",AZ81=\"b\"),\"Sprawdź poprawność danych (lista rozwijana, długości, szerokości) dotyczących drogi dla pieszych i rowerów\",\"Wybierz z listy rozwijanej, czy odcinek posiada drogę dla pieszych i rowerów i czy będzie ona realizowana w ramach zadania.\")","v":"Wybierz z listy rozwijanej, czy odcinek posiada drogę dla pieszych i rowerów i czy będzie ona realizowana w ramach zadania."}]
[null,"strona prawa ",null,null,null,null,null,null,"dł.",null,null,"m","szer.",null,null,null,"m","dł.",null,null,"m","szer.",null,null,null,"m",null,null,null,null,{"$f":"IF(AND(OR(I81=\"\",I81=\"nie\",I81=\"nie dotyczy\"),OR(R81=\"\",R81=\"nie\",R81=\"nie dotyczy\")),\"\",IF(AND(I81=\"TAK\",OR(R81=\"\",R81=\"nie\",R81=\"nie dotyczy\")),\"Wpisz długość i szerokość  istniejącej drogi dla pieszych i rowerów po stronie prawej\", IF(AND(OR(I81=\"\",I81=\"nie\",I81=\"nie dotyczy\"),R81=\"TAK\"),\"Wpisz długość i szerokość  projektowanej drogi dla pieszych i rowerów po stronie prawej\", IF(AND(I81=\"TAK\",R81=\"TAK\"),\"Wpisz długość i szerokość  istniejącej i projektowanej drogi dla pieszych i rowerów po stronie prawej\"))))","v":""}]
[null,"strona lewa ",null,null,null,null,null,null,"dł.",null,null,"m","szer.",null,null,null,"m","dł.",null,null,"m","szer.",null,null,null,"m",null,null,null,null,{"$f":"IF(AND(OR(I81=\"\",I81=\"nie\",I81=\"nie dotyczy\"),OR(R81=\"\",R81=\"nie\",R81=\"nie dotyczy\")),\"\",IF(AND(I81=\"TAK\",OR(R81=\"\",R81=\"nie\",R81=\"nie dotyczy\")),\"Wpisz długość i szerokość  istniejącej drogi dla pieszych i rowerów po stronie lewej\", IF(AND(OR(I81=\"\",I81=\"nie\",I81=\"nie dotyczy\"),R81=\"TAK\"),\"Wpisz długość i szerokość  projektowanej drogi dla pieszych i rowerów po stronie lewej\", IF(AND(I81=\"TAK\",R81=\"TAK\"),\"Wpisz długość i szerokość  istniejącej i projektowanej drogi dla pieszych i rowerów po stronie lewej\"))))","v":""}]
[null,"łączna długość ",null,null,null,null,null,null,"dł.",{"$f":"IF(AND(J82=\"\",J83=\"\"),\"\",SUM(J82:K83))","v":""},null,"m",null,null,null,null,null,"dł.",{"$f":"IF(AND(S82=\"\",S83=\"\"),\"\",SUM(S82:T83))","v":""},null,"m",null,null,null,null,null,null,null,null,null,{"$f":"IF(AND(OR(I81=\"\",I81=\"nie\",I81=\"nie dotyczy\"),OR(R81=\"\",R81=\"nie\",R81=\"nie dotyczy\")),\"\",\"Łączna długość drogi dla pieszych i rowerów załaduje się automatycznie\")","v":""}]
[null,"droga dla rowerów ",null,null,null,null,null,null,null,null,null,null,null,null,null,null,null,null,null,null,null,null,null,null,null,null,null,null,null,null,{"$f":"IF(OR(AY85=\"b\",AZ85=\"b\"),\"Sprawdź poprawność danych (lista rozwijana, długości, szerokości) dotyczących drogi dla rowerów\",\"Wybierz z listy rozwijanej, czy odcinek posiada drogę dla rowerów i czy będzie ona realizowana w ramach zadania.\")","v":"Wybierz z listy rozwijanej, czy odcinek posiada drogę dla rowerów i czy będzie ona realizowana w ramach zadania."}]
[null,"strona prawa ",null,null,null,null,null,null,"dł.",null,null,"m","szer.",null,null,null,"m","dł.",null,null,"m","szer.",null,null,null,"m",null,null,null,null,{"$f":"IF(AND(OR(I85=\"\",I85=\"nie\",I85=\"nie dotyczy\"),OR(R85=\"\",R85=\"nie\",R85=\"nie dotyczy\")),\"\",IF(AND(I85=\"TAK\",OR(R85=\"\",R85=\"nie\",R85=\"nie dotyczy\")),\"Wpisz długość i szerokość  istniejącej drogi dla rowerów po stronie prawej\", IF(AND(OR(I85=\"\",I85=\"nie\",I85=\"nie dotyczy\"),R85=\"TAK\"),\"Wpisz długość i szerokość  projektowanej drogi dla rowerów po stronie prawej\", IF(AND(I85=\"TAK\",R85=\"TAK\"),\"Wpisz długość i szerokość  istniejącej i projektowanej drogi dla rowerów po stronie prawej\"))))","v":""}]
[null,"strona lewa ",null,null,null,null,null,null,"dł.",null,null,"m","szer.",null,null,null,"m","dł.",null,null,"m","szer.",null,null,null,"m",null,null,null,null,{"$f":"IF(AND(OR(I85=\"\",I85=\"nie\",I85=\"nie dotyczy\"),OR(R85=\"\",R85=\"nie\",R85=\"nie dotyczy\")),\"\",IF(AND(I85=\"TAK\",OR(R85=\"\",R85=\"nie\",R85=\"nie dotyczy\")),\"Wpisz długość i szerokość  istniejącej drogi dla rowerów po stronie lewej\", IF(AND(OR(I85=\"\",I85=\"nie\",I85=\"nie dotyczy\"),R85=\"TAK\"),\"Wpisz długość i szerokość  projektowanej drogi dla rowerów po stronie lewej\", IF(AND(I85=\"TAK\",R85=\"TAK\"),\"Wpisz długość i szerokość  istniejącej i projektowanej drogi dla rowerów po stronie lewej\"))))","v":""}]
[null,"łączna długość ",null,null,null,null,null,null,"dł.",{"$f":"IF(AND(J86=\"\",J87=\"\"),\"\",SUM(J86:K87))","v":""},null,"m",null,null,null,null,null,"dł.",{"$f":"IF(AND(S86=\"\",S87=\"\"),\"\",SUM(S86:T87))","v":""},null,"m",null,null,null,null,null,null,null,null,null,{"$f":"IF(AND(OR(I85=\"\",I85=\"nie\",I85=\"nie dotyczy\"),OR(R85=\"\",R85=\"nie\",R85=\"nie dotyczy\")),\"\",\"Łączna długość drogi dla rowerów załaduje się automatycznie\")","v":""}]
[null,"pas ruchu dla rowerów ",null,null,null,null,null,null,null,null,null,null,null,null,null,null,null,null,null,null,null,null,null,null,null,null,null,null,null,null,{"$f":"IF(OR(AY89=\"b\",AZ89=\"b\"),\"Sprawdź poprawność danych (lista rozwijana, długości, szerokości) dotyczących pasa ruchu dla rowerów\",\"Wybierz z listy rozwijanej, czy odcinek posiada pas ruchu dla rowerów i czy będzie on realizowany w ramach zadania.\")","v":"Wybierz z listy rozwijanej, czy odcinek posiada pas ruchu dla rowerów i czy będzie on realizowany w ramach zadania."}]
[null,"strona prawa ",null,null,null,null,null,null,"dł.",null,null,"m","szer.",null,null,null,"m","dł.",null,null,"m","szer.",null,null,null,"m",null,null,null,null,{"$f":"IF(AND(OR(I89=\"\",I89=\"nie\",I89=\"nie dotyczy\"),OR(R89=\"\",R89=\"nie\",R89=\"nie dotyczy\")),\"\",IF(AND(I89=\"TAK\",OR(R89=\"\",R89=\"nie\",R89=\"nie dotyczy\")),\"Wpisz długość i szerokość  istniejącego pasa ruchu dla rowerów po stronie prawej\", IF(AND(OR(I89=\"\",I89=\"nie\",I89=\"nie dotyczy\"),R89=\"TAK\"),\"Wpisz długość i szerokość  projektowanego pasa ruchu dla rowerów po stronie prawej\", IF(AND(I89=\"TAK\",R89=\"TAK\"),\"Wpisz długość i szerokość  istniejącego i projektowanego pasa ruchu dla rowerów po stronie prawej\"))))","v":""}]
[null,"strona lewa ",null,null,null,null,null,null,"dł.",null,null,"m","szer.",null,null,null,"m","dł.",null,null,"m","szer.",null,null,null,"m",null,null,null,null,{"$f":"IF(AND(OR(I89=\"\",I89=\"nie\",I89=\"nie dotyczy\"),OR(R89=\"\",R89=\"nie\",R89=\"nie dotyczy\")),\"\",IF(AND(I89=\"TAK\",OR(R89=\"\",R89=\"nie\",R89=\"nie dotyczy\")),\"Wpisz długość i szerokość  istniejącego pasa ruchu dla rowerów po stronie lewej\", IF(AND(OR(I89=\"\",I89=\"nie\",I89=\"nie dotyczy\"),R89=\"TAK\"),\"Wpisz długość i szerokość  projektowanego pasa ruchu dla rowerów po stronie lewej\", IF(AND(I89=\"TAK\",R89=\"TAK\"),\"Wpisz długość i szerokość  istniejącego i projektowanego pasa ruchu dla rowerów po stronie lewej\"))))","v":""}]
[null,"łączna długość ",null,null,null,null,null,null,"dł.",{"$f":"IF(AND(J90=\"\",J91=\"\"),\"\",SUM(J90:K91))","v":""},null,"m",null,null,null,null,null,"dł.",{"$f":"IF(AND(S90=\"\",S91=\"\"),\"\",SUM(S90:T91))","v":""},null,"m",null,null,null,null,null,null,null,null,null,{"$f":"IF(AND(OR(I89=\"\",I89=\"nie\",I89=\"nie dotyczy\"),OR(R89=\"\",R89=\"nie\",R89=\"nie dotyczy\")),\"\",\"Łączna długość pasa ruchu dla rowerów załaduje się automatycznie\")","v":""}]
[null,"stan istniejący",null,null,null,null,null,null,null,null,null,null,null,null,null,null,null,null,null,null,null,null,null,null,null,null,{"$f":"LEN(F93)","v":0},"z",1200,null,"Opisz stan istniejący odcinka, czyli stan w jakim znajdują się elementy drogi.\nMożna użyć do 1200 wszystkich znaków."]
[null,"stan projektowany",null,null,null,null,null,null,null,null,null,null,null,null,null,null,null,null,null,null,null,null,null,null,null,null,{"$f":"LEN(F94)","v":0},"z",1200,null,"Opisz stan jaki ma zostać osiągnięty w wyniku realizacji zadania.\nMożna użyć do 1200 wszystkich znaków."]
[null,"uzasadnienie",null,null,null,null,null,null,null,null,null,null,null,null,null,null,null,null,null,null,null,null,null,null,null,null,{"$f":"LEN(F95)","v":0},"z",1200,null,"Uzasadnij realizację zadania.\nMożna użyć do 1200 wszystkich znaków."]
["10. ","CHARAKTERYSTYKA ZADANIA WEDŁUG KRYTERIÓW OCENY MERYTORYCZNEJ",null,null,null,null,null,null,null,null,null,null,null,null,null,null,null,null,null,null,null,null,null,null,null,null,null,null,null,null,{"$f":"_xlfn.CONCAT(A96,B96)","v":"10. CHARAKTERYSTYKA ZADANIA WEDŁUG KRYTERIÓW OCENY MERYTORYCZNEJ"}]
[null,"Kryterium nr 1",null,null,null,"-","Poprawa stanu bezpieczeństwa ruchu drogowego, ze szczególnym uwzględnieniem bezpieczeństwa ruchu drogowego niechronionych uczestników ruchu",null,null,null,null,null,null,null,null,null,null,null,null,null,null,null,null,null,null,null,null,null,null,null,{"$f":"_xlfn.CONCAT(A97,B97,\" \",F97,\" \",G97)","v":"Kryterium nr 1 - Poprawa stanu bezpieczeństwa ruchu drogowego, ze szczególnym uwzględnieniem bezpieczeństwa ruchu drogowego niechronionych uczestników ruchu"}]
["A. \n","Ryzyko wypadków.\nOdcinek drogi przebiega przez gminę/powiat o dużym poziomie ryzyka społecznego pod względem:",null,null,null,null,null,null,null,null,null,null,null,null,null,null,null,null,null,null,null,null,null,null,null,null,null,null,null,null,"Dane ładują się automatycznie po poprawnym uzupełnieniu pkt 1 oraz 3 wniosku"]
[null,"1)","wypadków drogowych z udziałem pieszych ",null,null,null,null,null,null,null,null,null,null,null,null,null,null,null,null,null,null,null,null,null,{"$f":"IF($Q$11=\"\",\"\",IF($Q$11=\"powiat\",VLOOKUP($Q$12,DANE!$D$46:$K$58,6,0),VLOOKUP($Q$13,DANE!$E$59:$K$159,5,0)))","v":""}]
[null,"2)","wypadków drogowych ogółem",null,null,null,null,null,null,null,null,null,null,null,null,null,null,null,null,null,null,null,null,null,{"$f":"IF($Q$11=\"\",\"\",IF($Q$11=\"powiat\",VLOOKUP($Q$12,DANE!$D$46:$K$58,7,0),VLOOKUP($Q$13,DANE!$E$59:$K$159,6,0)))","v":""}]
[null,"3)","ofiar śmiertelnych w wypadkach drogowych",null,null,null,null,null,null,null,null,null,null,null,null,null,null,null,null,null,null,null,null,null,{"$f":"IF($Q$11=\"\",\"\",IF($Q$11=\"powiat\",VLOOKUP($Q$12,DANE!$D$46:$K$58,8,0),VLOOKUP($Q$13,DANE!$E$59:$K$159,7,0)))","v":""}]
["B. \n\n","Bezpieczeństwo uczestników ruchu drogowego. \nRealizacja rozwiązań zwiększających bezpieczeństwo uczestników ruchu drogowego \n(poprzez budowę lub przebudowę):",null,null,null,null,null,null,null,null,null,null,null,null,null,null,null,null,null,null,null,null,null,null,null,null,null,null,null,null,"Wybierz z list rozwijanych, czy w ramach zadania będą realizowane rozwiązania zwiększające bezpieczeństwo uczestników ruchu drogowego (w pkt 1 lit. a-e oraz pkt 2 lit. a-d)"]
[null,"1)","przejścia dla pieszych lub/i przejazdu dla rowerów o podwyższonym standardzie bezpieczeństwa:"]
[null,null,"a)","z oświetleniem lub/i doświetleniem"]
[null,null,"b)","z wyspą dzielącą (tzw. azylem)"]
[null,null,"c)","wyniesionego przejścia dla pieszych lub/i przejazdu dla rowerów"]
[null,null,"d)","z sygnalizacją świetlną"]
[null,null,"e)","z oznakowaniem aktywnym lub sygnalizacją ostrzegawczą"]
[null,"2)\n","innego rozwiązania w zakresie bezpieczeństwa nie związanego z przejściem dla pieszych lub/i przejazdem dla rowerów:"]
[null,null,"a)","wyniesionego skrzyżowania"]
[null,null,"b)","wyspy dzielącej na jezdni wraz z odgięciem toru jazdy na wjeździe do miejscowości"]
[null,null,"c)","radaru ze znakiem/tablicą zmiennej treści (aktywną), informującym o prędkości ruchu pojazdu"]
[null,null,"d)","oznakowania aktywnego na dojeździe do przejazdu kolejowo-drogowego"]
[null,"Kryterium nr 2",null,null,null,"-","Zapewnienie spójności sieci dróg publicznych ",null,null,null,null,null,null,null,null,null,null,null,null,null,null,null,null,null,null,null,null,null,null,null,{"$f":"_xlfn.CONCAT(A114,B114,\" \",F114,\" \",G114)","v":"Kryterium nr 2 - Zapewnienie spójności sieci dróg publicznych "}]
["A.\n ","Połączenie z innymi drogami publicznymi. \nBezpośrednie połączenie odcinka drogi z inną drogą publiczną wyższego rzędu",null,null,null,null,null,null,null,null,null,null,null,null,null,null,null,null,null,null,null,null,null,null,null,null,null,null,null,null,"Wybierz z listy rozwijanej, czy odcinek drogi ma bezpośrednie połączenie z drogą wyższego rzędu.\nJeśli TAK podaj numer drogi wyższego rzędu stosując oznaczenia: DK – droga krajowa, DW – droga wojewódzka, DP – droga powiatowa, DG – droga gminna. Numer należy podać w formacie np. DP-1234T (można użyć do 100 wszystkich znaków). Zaznacz to połączenie na załączonej mapie poglądowej."]
[null,null,null,null,null,null,null,null,null,null,null,null,null,null,null,null,null,null,null,null,null,null,null,null,null,null,{"$f":"LEN(D116)","v":0},"z",100]
[null,"jeżeli wybrano odpowiedź TAK, należy wskazać to połączenie na załączonej mapie poglądowej"]
["B.\n\n ","Kontynuacja zadania. \nKontynuacja robót budowlanych* realizowanych na podstawie umowy dofinansowania w ramach RFRD oraz zakończonych w ciągu 3 lat przed datą złożenia wniosku o dofinansowanie"]
[null,"*kontynuacja robót budowlanych oznacza, że wcześniejsze roboty budowlane realizowane były na odcinku drogi bezpośrednio połączonym z odcinkiem drogi objętym wnioskowanym zadaniem ",null,null,null,null,null,null,null,null,null,null,null,null,null,null,null,null,null,null,null,null,null,null,null,null,null,null,null,null,"Wybierz z listy rozwijanej, czy odcinek stanowi kontynuację robót budowlanych (budowy, przebudowy lub remontu) w ramach wcześniej zawartych umów o dofinansowanie ze środków RFRD i zakończonych w ciągu 3 lat przed datą złożenia wniosku o dofinansowanie.\nJeśli TAK wpisz numer umowy z wojewodą i datę jej zawarcia (np. 175/RFRD/A/2023 z dnia 30.04.2023) (można użyć do 100 znaków) oraz zaznacz to połącznie na załączonej mapie poglądowej."]
[null,null,null,null,null,null,null,null,null,null,null,null,null,null,null,null,null,null,null,null,null,null,null,null,null,null,{"$f":"LEN(D120)","v":0},"z",100]
[null,"jeżeli wybrano odpowiedź TAK, należy wskazać to połączenie na załączonej mapie poglądowej"]
["C. \n\n","Peryferyjność. \nOdcinek drogi biegnie przez gminę, dla której wskaźnik peryferyjności czasowej jest mniejszy niż 30 min., mieści się w przedziale od 30 do 50 minut, jest większy niż 50 min.",null,null,null,null,null,null,null,null,null,null,null,null,null,null,null,null,null,null,null,null,null,null,null,null,null,null,null,null,"Dana ładuje się automatycznie, po poprawnym wypełnieniu pkt 3 wniosku"]
[null,"wskaźnik peryferyjności czasowej:",null,null,null,null,null,null,null,null,null,null,null,{"$f":"IF(OR(L20=\"\",L20=0),\"\",VLOOKUP(L20,DANE!E46:M159,9,0))","v":""}]
["D.\n\n\n ","Uszkodzenie w wyniku niekorzystnych zjawisk atmosferycznych. \nOdcinek drogi został uszkodzony w wyniku działania niekorzystnych zjawisk atmosferycznych w ciągu \n3 lat przed datą złożenia wniosku o dofinansowanie i jest ujęty w protokole strat potwierdzonym przez Wojewodę Świętokrzyskiego",null,null,null,null,null,null,null,null,null,null,null,null,null,null,null,null,null,null,null,null,null,null,null,null,null,null,null,null,"Wybierz z listy rozwijanej, czy odcinek drogi został uszkodzony w wyniku działania niekorzystnych zjawisk atmosferycznych w ciągu 3 lat przed datą złożenia wniosku o dofinansowanie i jest ujęty w protokole strat potwierdzonym przez Wojewodę Świętokrzyskiego.\n\nJeśli TAK, to wpisz rodzaj klęski i jej datę (można użyć do 70 wszystkich znaków) oraz numer i datę protokołu strat potwierdzonego przez Wojewodę Świętokrzyskiego (można  użyć do 70 wszystkich znaków).\n\nZałącz kopię protokołu do wniosku. \nZaznacz uszkodzony fragment na mapie poglądowej."]
[null,null,null,"rodzaj i data zjawiska",null,null,null,null,null,null,null,null,null,null,null,null,null,null,null,null,null,null,null,null,null,null,{"$f":"LEN(L125)","v":0},"z",70]
[null,null,null,"protokół strat potwierdzony przez Wojewodę Świętokrzyskiego",null,null,null,null,null,null,null,null,null,null,null,null,null,null,null,null,null,null,null,null,null,null,{"$f":"LEN(L126)","v":0},"z",70]
[null,"jeżeli wybrano odpowiedź TAK, należy załączyć do wniosku kopię protokołu strat potwierdzonego przez Wojewodę Świętokrzyskiego oraz zaznaczyć uszkodzony odcinek na mapie poglądowej"]
[null,"Kryterium nr 3\n",null,null,null,"-","Podnoszenie standardów technicznych dróg powiatowych i dróg gminnych, \nw szczególności dostosowanie ich do ruchu pojazdów o dopuszczalnym nacisku pojedynczej osi napędowej do 11,5 t, oraz zachowanie jednorodności sieci dróg powiatowych i dróg gminnych pod względem spełniania tych standardów ",null,null,null,null,null,null,null,null,null,null,null,null,null,null,null,null,null,null,null,null,null,null,null,{"$f":"_xlfn.CONCAT(A128,B128,\" \",F128,\" \",G128)","v":"Kryterium nr 3\n - Podnoszenie standardów technicznych dróg powiatowych i dróg gminnych, \nw szczególności dostosowanie ich do ruchu pojazdów o dopuszczalnym nacisku pojedynczej osi napędowej do 11,5 t, oraz zachowanie jednorodności sieci dróg powiatowych i dróg gminnych pod względem spełniania tych standardów "}]
["A.\n","Skrzyżowania. \nBudowa/przebudowa skrzyżowań:",null,null,null,null,null,null,null,null,null,null,null,null,null,null,null,null,null,null,null,null,null,null,null,null,null,null,null,null,"Wybierz z list rozwijanych, czy w ramach zadania będzie realizowana budowa/przebudowa podanych rodzajów skrzyżowań (lit. A, pkt 1-2).   \nJeśli TAK, to podaj ich ilości w sztukach oraz zaznacz te skrzyżowania na załączonej mapie poglądowej."]
[null,"1)","zwykłych z drogami publicznymi",null,null,null,null,null,null,null,null,null,null,null,null,null,null,null,null,null,null,null,null,null,null,"szt.",null,null,null,null,{"$f":"IF(AND(AY130=\"b\",V130=\"tak\"),\"Błąd - wybrano TAK i nie podano ilości sztuk\",IF(AND(AY130=\"b\",OR(V130=\"nie\",V130=\"\")),\"Błąd - wybrano NIE i podano ilość sztuk (pozostawienie pustego pola wyboru jest jednoznaczne z wybraniem NIE)\",\"\"))","v":""},null,null,null,null,null,null,null,null,null,null,null,null,null,null,null,null,null,null,null,{"$f":"IF(AND(V130=\"\",X130=\"\"),\"ok\",IF(AND(V130=\"tak\",X130>0),\"ok\",IF(AND(V130=\"nie\",X130=0),\"ok\",IF(AND(V130=\"nie\",X130>\"\"),\"ok\",IF(AND(V130=\"\",X130=0),\"ok\",\"b\")))))","v":"ok"}]
[null,"2)","innych:"]
[null,null,"•","skanalizowanych",null,null,null,null,null,null,null,null,null,null,null,null,null,null,null,null,null,null,null,null,null,"szt.",null,null,null,null,{"$f":"IF(AND(AY132=\"b\",V132=\"tak\"),\"Błąd - wybrano TAK i nie podano ilości sztuk\",IF(AND(AY132=\"b\",OR(V132=\"nie\",V132=\"\")),\"Błąd - wybrano NIE i podano ilość sztuk (pozostawienie pustego pola wyboru jest jednoznaczne z wybraniem NIE)\",\"\"))","v":""},null,null,null,null,null,null,null,null,null,null,null,null,null,null,null,null,null,null,null,{"$f":"IF(AND(V132=\"\",X132=\"\"),\"ok\",IF(AND(V132=\"tak\",X132>0),\"ok\",IF(AND(V132=\"nie\",X132=0),\"ok\",IF(AND(V132=\"nie\",X132>\"\"),\"ok\",IF(AND(V132=\"\",X132=0),\"ok\",\"b\")))))","v":"ok"}]
[null,null,"•","w formie ronda",null,null,null,null,null,null,null,null,null,null,null,null,null,null,null,null,null,null,null,null,null,"szt.",null,null,null,null,{"$f":"IF(AND(AY133=\"b\",V133=\"tak\"),\"Błąd - wybrano TAK i nie podano ilości sztuk\",IF(AND(AY133=\"b\",OR(V133=\"nie\",V133=\"\")),\"Błąd - wybrano NIE i podano ilość sztuk (pozostawienie pustego pola wyboru jest jednoznaczne z wybraniem NIE)\",\"\"))","v":""},null,null,null,null,null,null,null,null,null,null,null,null,null,null,null,null,null,null,null,{"$f":"IF(AND(V133=\"\",X133=\"\"),\"ok\",IF(AND(V133=\"tak\",X133>0),\"ok\",IF(AND(V133=\"nie\",X133=0),\"ok\",IF(AND(V133=\"nie\",X133>\"\"),\"ok\",IF(AND(V133=\"\",X133=0),\"ok\",\"b\")))))","v":"ok"}]
[null,null,"•","innych podnoszących poziom bezpieczeństwa np. z sygnalizacją świetlną ",null,null,null,null,null,null,null,null,null,null,null,null,null,null,null,null,null,null,null,null,null,"szt.",null,null,null,null,{"$f":"IF(AND(AY134=\"b\",V134=\"tak\"),\"Błąd - wybrano TAK i nie podano ilości sztuk\",IF(AND(AY134=\"b\",OR(V134=\"nie\",V134=\"\")),\"Błąd - wybrano NIE i podano ilość sztuk (pozostawienie pustego pola wyboru jest jednoznaczne z wybraniem NIE)\",\"\"))","v":""},null,null,null,null,null,null,null,null,null,null,null,null,null,null,null,null,null,null,null,{"$f":"IF(AND(V134=\"\",X134=\"\"),\"ok\",IF(AND(V134=\"tak\",X134>0),\"ok\",IF(AND(V134=\"nie\",X134=0),\"ok\",IF(AND(V134=\"nie\",X134>\"\"),\"ok\",IF(AND(V134=\"\",X134=0),\"ok\",\"b\")))))","v":"ok"}]
[null,"jeśli wybrano odpowiedź TAK, należy wskazać to skrzyżowanie na załączonej mapie poglądowej"]
["B.\n","Drogowe obiekty inżynierskie. \nBudowa/przebudowa drogowych obiektów inżynierskich:",null,null,null,null,null,null,null,null,null,null,null,null,null,null,null,null,null,null,null,null,null,null,null,null,null,null,null,null,"Wybierz z list rozwijanych, czy w ramach zadania będzie realizowana budowa/przebudowa podanych obiektów inżynierskich (lit. B pkt 1-3).   \nJeśli TAK, to podaj ich ilości w sztukach oraz zaznacz te obiekty na załączonej mapie poglądowej."]
[null,"1)\n\n\n","•","mostów",null,null,null,null,null,null,null,null,null,null,null,null,null,null,null,null,null,null,null,null,null,"szt.",null,null,null,null,{"$f":"IF(AND(AY137=\"b\",V137=\"tak\"),\"Błąd - wybrano TAK i nie podano ilości sztuk\",IF(AND(AY137=\"b\",OR(V137=\"nie\",V137=\"\")),\"Błąd - wybrano NIE i podano ilość sztuk (pozostawienie pustego pola wyboru jest jednoznaczne z wybraniem NIE)\",\"\"))","v":""},null,null,null,null,null,null,null,null,null,null,null,null,null,null,null,null,null,null,null,{"$f":"IF(AND(V137=\"\",X137=\"\"),\"ok\",IF(AND(V137=\"tak\",X137>0),\"ok\",IF(AND(V137=\"nie\",X137=0),\"ok\",IF(AND(V137=\"nie\",X137>\"\"),\"ok\",IF(AND(V137=\"\",X137=0),\"ok\",\"b\")))))","v":"ok"}]
[null,null,"•","wiaduktów",null,null,null,null,null,null,null,null,null,null,null,null,null,null,null,null,null,null,null,null,null,"szt.",null,null,null,null,"",null,null,null,null,null,null,null,null,null,null,null,null,null,null,null,null,null,null,null,{"$f":"IF(AND(V138=\"\",X138=\"\"),\"ok\",IF(AND(V138=\"tak\",X138>0),\"ok\",IF(AND(V138=\"nie\",X138=0),\"ok\",IF(AND(V138=\"nie\",X138>\"\"),\"ok\",IF(AND(V138=\"\",X138=0),\"ok\",\"b\")))))","v":"ok"}]
[null,null,"•","estakad",null,null,null,null,null,null,null,null,null,null,null,null,null,null,null,null,null,null,null,null,null,"szt.",null,null,null,null,"",null,null,null,null,null,null,null,null,null,null,null,null,null,null,null,null,null,null,null,"ok"]
[null,null,"•","kładek dla pieszych",null,null,null,null,null,null,null,null,null,null,null,null,null,null,null,null,null,null,null,null,null,"szt.",null,null,null,null,"",null,null,null,null,null,null,null,null,null,null,null,null,null,null,null,null,null,null,null,"ok"]
[null,"2)","przepustów pod koroną drogi",null,null,null,null,null,null,null,null,null,null,null,null,null,null,null,null,null,null,null,null,null,null,"szt.",null,null,null,null,"",null,null,null,null,null,null,null,null,null,null,null,null,null,null,null,null,null,null,null,"ok"]
[null,"3)","konstrukcji oporowej",null,null,null,null,null,null,null,null,null,null,null,null,null,null,null,null,null,null,null,null,null,null,"szt.",null,null,null,null,"",null,null,null,null,null,null,null,null,null,null,null,null,null,null,null,null,null,null,null,"ok"]
[null,"jeśli wybrano odpowiedź TAK, należy wskazać ten obiekt na załączonej mapie poglądowej"]
["C.\n","Inne. \nBudowa/przebudowa elementów w ramach wnioskowanego zadania:",null,null,null,null,null,null,null,null,null,null,null,null,null,null,null,null,null,null,null,null,null,null,null,null,null,null,null,null,"Wybierz z list rozwijanych, czy w ramach zadania będzie realizowana budowa lub przebudowa podanych elementów (lit. C pkt 1-6)."]
[null,"1)","drogi dla pieszych lub rowerów ",null,null,null,null,null,null,null,null,null,null,null,null,null,null,null,null,null,null,null,null,null,null,null,null,null,null,null,{"$f":"IF(Y145=\"\",\"Wybierz z listy rozwijanej, czy w ramach zadania będzie realizowana droga dla pieszych lub droga dla rowerów\", IF(AND(OR(R77=\"tak\",R85=\"tak\"),Y145<>\"tak\"),\"BŁĄD - w pkt 9 wybrano TAK; należy wybrać TAK lub zmienić odpowiedź w pkt 9 wniosku (droga dla pieszych lub droga dla rowerów)\",IF(AND(OR(R77<>\"tak\",R85<>\"tak\"),Y145=\"tak\"),\"BŁĄD - w pkt 9 wybrano NIE (pozostawienie komórki pustej jest jednoznaczne z wybraniem NIE); należy wybrać NIE lub zmienić odpowiedź w pkt 9 wniosku (droga dla pieszych lub droga rowerów)\",\"OK\")))","v":"Wybierz z listy rozwijanej, czy w ramach zadania będzie realizowana droga dla pieszych lub droga dla rowerów"},null,null,null,null,null,null,null,null,null,null,null,null,null,null,null,null,null,null,null,{"$f":"IF(Y145=\"\",\"w\",IF(AND(OR(R77=\"tak\",R85=\"tak\"),Y145<>\"tak\"),\"b\",IF(AND(OR(R77<>\"tak\",R85<>\"tak\"),Y145=\"tak\"),\"b\",\"OK\")))","v":"w"}]
[null,"2)","drogi dla pieszych i rowerów (ciągu pieszo-rowerowego) ",null,null,null,null,null,null,null,null,null,null,null,null,null,null,null,null,null,null,null,null,null,null,null,null,null,null,null,{"$f":"IF(Y146=\"\",\"Wybierz z listy rozwijanej, czy w ramach zadania będzie realizowana droga dla pieszych i rowerów\", IF(AND(R81=\"tak\",Y146<>\"tak\"),\"BŁĄD - w pkt 9 wybrano TAK; należy wybrać TAK lub zmienić odpowiedź w pkt 9 wniosku (droga dla pieszych i rowerów)\",IF(AND(R81<>\"tak\",Y146=\"tak\"),\"BŁĄD - w pkt 9 wybrano NIE (pozostawienie komórki pustej jest jednoznaczne z wybraniem NIE); należy wybrać NIE lub zmienić odpowiedź w pkt 9 wniosku (droga dla pieszych i rowerów)\",\"OK\")))","v":"Wybierz z listy rozwijanej, czy w ramach zadania będzie realizowana droga dla pieszych i rowerów"},null,null,null,null,null,null,null,null,null,null,null,null,null,null,null,null,null,null,null,{"$f":"IF(Y146=\"\",\"w\",IF(AND(R81=\"tak\",Y146<>\"tak\"),\"b\",IF(AND(R81<>\"tak\",Y146=\"tak\"),\"b\",\"OK\")))","v":"w"}]
[null,"3)","oświetlenia ulicznego "]
[null,"4)","odwodnienia drogi (kanału deszczowego, rowu) "]
[null,"5)","przebudowy drogi wewnętrznej i zaliczenie jej do kategorii dróg publicznych"]
[null,"6)","dostosowania drogi do ruchu pojazdów o dopuszczalnym nacisku pojedynczej osi napędowej do 11,5 t "]
[null,"Kryterium nr 4",null,null,null,"-","Zwiększenie dostępności transportowej jednostek administracyjnych",null,null,null,null,null,null,null,null,null,null,null,null,null,null,null,null,null,null,null,null,null,null,null,{"$f":"_xlfn.CONCAT(A151,B151,\" \",F151,\" \",G151)","v":"Kryterium nr 4 - Zwiększenie dostępności transportowej jednostek administracyjnych"}]
["A.\n\n","Obszar wiejski. \nOdcinek drogi przebiega w całości lub w części na obszarze wiejskim (wykracza poza granice administracyjne miasta)",null,null,null,null,null,null,null,null,null,null,null,null,null,null,null,null,null,null,null,null,null,null,null,null,null,null,null,null,"Wybierz z listy rozwijanej, czy odcinek drogi przebiega w całości lub w części na obszarze wiejskim (wykracza poza granice administracyjne miasta)"]
[]
["B.\n\n\n","Utrata funkcji społeczno-gospodarczych. \nOdcinek drogi przebiega w całości lub w części w granicach administracyjnych miast ujętych w pakiecie dla średnich miast uznanych za zagrożone utratą funkcji społeczno-gospodarczych (na podstawie Analizy Instytutu Geografii i Przestrzennego Zagospodarowania PAN)"]
[null,null,null,null,null,null,null,null,null,null,null,null,null,null,null,null,null,null,null,null,null,null,null,null,null,null,null,null,null,null,"Wybierz z listy rozwijanej, czy odcinek przebiega w granicach administracyjnych jednego z miast ujętych w Pakiecie dla średnich miast uznanych za zagrożone utratą funkcji społeczno-gospodarczych. \nJeśli TAK, to wybierz z listy rozwijanej miasto, przez które przebiega odcinek."]
[null,{"$f":"IFERROR(IF(FIND(\"TAK\",B155)=1,\"miasto\",\"\"),\"\")","v":""}]
[null,"średnie miasta uznane za zagrożone utratą funkcji społeczno-gospodarczych w województwie świętokrzyskim – \nBusko-Zdrój, Jędrzejów,  Końskie, Ostrowiec Świętokrzyski, Sandomierz, Skarżysko-Kamienna, Starachowice, Staszów."]
["C.\n","Instytucje publiczne i miejsca zgromadzeń. \nOdcinek drogi zapewnia bezpośredni dojazd* do:"]
[null,"• \n\n• ","miejsc zgromadzeń ludności (np.: cmentarz, boisko, amfiteatr, obiekty zabytkowe, sakralne, turystyczne, itp.)\ninstytucji publicznych lub świadczących usługi publiczne (np.: urząd gminy, szkoła, ośrodek zdrowia, ośrodek pomocy społecznej, remiza OSP, świetlica wiejska, żłobek, przedszkole, klub seniora. itp.)"]
[null," *bezpośredni dojazd - położenie do 200 m od odcinka drogi"]
[null,null,null,null,null,null,null,null,null,null,null,null,null,null,null,null,null,null,null,null,null,null,null,null,null,null,{"$f":"LEN(D161)","v":0},"z",500,null,"Wybierz z listy rozwijanej, czy odcinek drogi zapewnia bezpośredni dojazd (do 200 m od odcinka) do miejsc zgromadzeń ludności, instytucji publicznych lub świadczących usługi publiczne.\nJeśli TAK, to wymień do jakich miejsc zgromadzeń ludności, instytucji publicznych lub świadczących usługi publiczne odcinek zapewnia bezpośredni dojazd  (można użyć do 500 wszystkich znaków) oraz zaznacz te miejsca na załączonej mapie poglądowej."]
[null,"jeżeli wybrano odpowiedź TAK, należy wskazać te miejsca i instytucje na załączonej mapie poglądowej"]
["D.\n\n\n","Transport publiczny. \nNa odcinku drogi przebiega linia autobusowa objęta wsparciem z Funduszu Rozwoju Przewozów Autobusowych, realizowane są usługi transportu publicznego, uchwalono planowany przebieg linii użyteczności publicznej"]
[null,null,null,null,null,null,null,null,null,null,null,null,null,null,null,null,null,null,null,null,null,null,null,null,null,null,{"$f":"LEN(D164)","v":0},"z",300,null,"Wybierz z listy rozwijanej, czy na odcinku drogi przebiega linia autobusowa objęta wsparciem z Funduszu Rozwoju Przewozów Autobusowych, realizowane są usługi transportu publicznego, uchwalono planowany przebieg linii użyteczności publicznej.\nJeśli TAK, to wpisz nr umowy z wojewodą i datę jej zawarcia oraz nr linii autobusowej lub usługi transportu publicznego lub numer i datę uchwały o planowanym przebiegu linii użyteczności publicznej (można użyć do 300 wszystkich znaków), zaznacz przebieg linii na załączonej mapie poglądowej oraz załącz do wniosku kopię odpowiedniego dokumentu."]
[null,"jeżeli wybrano odpowiedź TAK, należy załączyć do wniosku kopię odpowiedniego dokumentu oraz zaznaczyć przebieg linii na załączonej mapie poglądowej."]
["E.\n","Dostępność komunikacyjna. \nWpływ odcinka drogi na dostępność komunikacyjną obszaru, na którym znajduje się ta droga "]
[null,null,null,null,null,null,null,null,null,null,null,null,null,null,null,null,null,null,null,null,null,null,null,null,null,null,{"$f":"LEN(D167)","v":0},"z",500,null,"Wybierz z listy rozwijanej, czy odcinek drogi wpływa na dostępność komunikacyjną obszaru, na którym znajduje się ta droga.\nJeśli TAK, to opisz wpływ odcinka drogi na dostępność komunikacyjną obszaru, na którym znajduje się ta droga (można użyć do 500 wszystkich znaków)."]
[null,"Kryterium nr 5",null,null,null,"-","Poprawa dostępności terenów inwestycyjnych i gospodarczych",null,null,null,null,null,null,null,null,null,null,null,null,null,null,null,null,null,null,null,null,null,null,null,{"$f":"_xlfn.CONCAT(A168,B168,\" \",F168,\" \",G168)","v":"Kryterium nr 5 - Poprawa dostępności terenów inwestycyjnych i gospodarczych"}]
["A.\n\n\n","Lokalne ośrodki gospodarcze. \nOdcinek drogi zapewnia bezpośredni dojazd* do lokalnych ośrodków gospodarczych np. do strefy ekonomicznej, podmiotów gospodarczych, lokalnego targowiska \n*bezpośredni dojazd - położenie do 200 m od odcinka drogi"]
[null,null,null,null,null,null,null,null,null,null,null,null,null,null,null,null,null,null,null,null,null,null,null,null,null,null,{"$f":"LEN(D170)","v":0},"z",400,null,"Wybierz z listy rozwijanej , czy odcinek drogi zapewnia bezpośredni dojazd (do 200 m od odcinka) do lokalnych ośrodków gospodarczych np. do strefy ekonomicznej, podmiotów gospodarczych, lokalnego targowiska.\nJeśli TAK, to wymień do jakich lokalnych ośrodków gospodarczych odcinek stanowi bezpośredni dojazd (można użyć do 400 wszystkich znaków) oraz zaznacz te ośrodki na załączonej mapie poglądowej."]
[null,"jeżeli wybrano odpowiedź TAK, należy wskazać te ośrodki gospodarcze na załączonej mapie poglądowej"]
["B.\n\n\n\n","Tereny inwestycyjne. \nOdcinek drogi zapewnia bezpośredni dojazd* do terenów inwestycyjnych, rozumianych jako tereny przeznaczone pod działalność gospodarczą w studium uwarunkowań przestrzennych, miejscowym planie zagospodarowania, warunkach zabudowy lub decyzji lokalizacyjnej celu publicznego \n*bezpośredni dojazd - położenie do 200 m od odcinka drogi"]
[null,null,null,null,null,null,null,null,null,null,null,null,null,null,null,null,null,null,null,null,null,null,null,null,null,null,{"$f":"LEN(D173)","v":0},"z",400,null,"Wybierz z listy rozwijanej, czy odcinek drogi zapewnia bezpośredni dojazd (do 200 m od odcinka) do terenów inwestycyjnych, rozumianych jako tereny przeznaczone pod działalność gospodarczą w studium uwarunkowań przestrzennych, miejscowym planie zagospodarowania, warunkach zabudowy lub decyzji lokalizacyjnej celu publicznego.\nJeśli TAK, to wymień do jakich terenów inwestycyjnych odcinek stanowi bezpośredni dojazd (można użyć do 400 wszystkich znaków) oraz zaznacz te tereny na załączonej mapie poglądowej."]
[null,"jeżeli wybrano odpowiedź TAK, należy wskazać te tereny inwestycyjne na załączonej mapie poglądowej"]
["C.\n\n\n\n","Tereny rolne. \nOdcinek drogi zapewnia bezpośredni dojazd* do terenów, na których prowadzona jest produkcja rolna, sadownictwo, ogrodnictwo lub/i zlokalizowane są gospodarstwa agroturystyczne ważne ze względu na specyfikę obszaru \n*bezpośredni dojazd - położenie do 200 m od odcinka drogi"]
[null,null,null,null,null,null,null,null,null,null,null,null,null,null,null,null,null,null,null,null,null,null,null,null,null,null,{"$f":"LEN(D176)","v":0},"z",400,null,"Wybierz z listy rozwijanej, czy odcinek drogi zapewnia bezpośredni dojazd (do 200 m od odcinka) do terenów, na których prowadzona jest produkcja rolna, sadownictwo, ogrodnictwo lub/i zlokalizowane są gospodarstwa agroturystyczne ważne ze względu na specyfikę obszaru.\nJeśli TAK, to wymień do jakich terenów rolnych odcinek stanowi bezpośredni dojazd (można użyć do 400 wszystkich znaków) oraz zaznacz te tereny na załączonej mapie poglądowej."]
[null,"jeżeli wybrano odpowiedź TAK, należy wskazać te tereny rolne na załączonej mapie poglądowej"]
["D.\n","Rozwój społeczno-gospodarczy. \nStrategiczne znaczenia odcinka drogi dla rozwoju społeczno-gospodarczego województwa"]
[null,null,null,null,null,null,null,null,null,null,null,null,null,null,null,null,null,null,null,null,null,null,null,null,null,null,{"$f":"LEN(D179)","v":0},"z",500,null,"Wybierz z listy rozwijanej, czy odcinek drogi ma strategiczne znaczenie dla rozwoju społeczno-gospodarczego województwa.\nJeśli TAK, to opisz przewidywane znaczenie wnioskowanego odcinka drogi dla rozwoju społeczno-gospodarczego województwa (można użyć do 500 wszystkich znaków)."]
[null,"Kryterium nr 6",null,null,null,"-","Zwiększenie liczby obwodnic w ciągu dróg powiatowych i dróg gminnych",null,null,null,null,null,null,null,null,null,null,null,null,null,null,null,null,null,null,null,null,null,null,null,{"$f":"_xlfn.CONCAT(A180,B180,\" \",F180,\" \",G180)","v":"Kryterium nr 6 - Zwiększenie liczby obwodnic w ciągu dróg powiatowych i dróg gminnych"}]
[null,"Zwiększenie liczby obwodnic. \nOdcinek drogi przyczynia się do zwiększenia liczby dróg spełniających funkcję obwodnicy, która w rozumieniu art. 2 ust.1 pkt 2a ustawy o RFRD oznacza drogę omijającą miejscowość lub teren zwartej zabudowy miejscowości, planowaną do realizacji w większości w nowym przebiegu i mającą na celu wyprowadzenie części ruchu pojazdów z tej miejscowości"]
[null,null,null,null,null,null,null,null,null,null,null,null,null,null,null,null,null,null,null,null,null,null,null,null,null,null,{"$f":"LEN(D182)","v":0},"z",500,null,"Wybierz z listy rozwijanej, czy odcinek drogi przyczynia się do zwiększenia ilości dróg spełniających funkcję obwodnicy.\nJeśli TAK, to opisz/uzasadnij przyczynianie się odcinka do zwiększenia ilości dróg spełniających funkcję obwodnicy (można użyć do 500 wszystkich znaków)."]
[null,"Kryterium nr 7",null,null,null,"-","Poprawa dostępności terenów objętych przedsięwzięciami lub inwestycjami powiązanymi z przedsięwzięciem infrastrukturalnym",null,null,null,null,null,null,null,null,null,null,null,null,null,null,null,null,null,null,null,null,null,null,null,{"$f":"_xlfn.CONCAT(A183,B183,\" \",F183,\" \",G183)","v":"Kryterium nr 7 - Poprawa dostępności terenów objętych przedsięwzięciami lub inwestycjami powiązanymi z przedsięwzięciem infrastrukturalnym"}]
[null,"Tereny powiązane z przedsięwzięciem infrastrukturalnym. \nOdcinek drogi przyczynia się do poprawy dostępności terenów objętych przedsięwzięciami lub inwestycjami powiązanymi z przedsięwzięciem infrastrukturalnym, o których mowa w art. 5c ust. 1 ustawy z dnia 8 grudnia 2006 r. o finansowym wsparciu niektórych przedsięwzięć mieszkaniowych (Dz. U. z 2024 r. poz. 304)"]
[null,null,null,null,null,null,null,null,null,null,null,null,null,null,null,null,null,null,null,null,null,null,null,null,null,null,{"$f":"LEN(D185)","v":0},"z",500,null,"Wybierz z listy rozwijanej, czy odcinek drogi przyczynia się do poprawy dostępności terenów objętych przedsięwzięciami lub inwestycjami powiązanymi z przedsięwzięciem infrastrukturalnym.\nJeśli TAK wymień te tereny i krótko opisz (można użyć do 500 wszystkich znaków)."]
[null,"jeżeli wybrano odpowiedź TAK, należy wskazać te tereny na załączonej mapie poglądowej"]
["11. ","OSOBY UPOWAŻNIONE DO UDZIELANIA WYJAŚNIEŃ KOMISJI",null,null,null,null,null,null,null,null,null,null,null,null,null,null,null,null,null,null,null,null,null,null,null,null,null,null,null,null,{"$f":"_xlfn.CONCAT(A187,B187)","v":"11. OSOBY UPOWAŻNIONE DO UDZIELANIA WYJAŚNIEŃ KOMISJI"}]
["Lp.","imię i nazwisko",null,null,null,null,null,null,"stanowisko służbowe",null,null,null,null,null,"nr telefonu",null,null,null,null,"e-mail",null,null,null,null,null,null,null,null,null,null,"Wskaż osobę/osoby do kontaktu przez podanie następujących danych:\n - imię i nazwisko, \n - zajmowane stanowisko służbowe, \n - nr telefonu (ze wskazaniem nr wewnętrznego - jeśli dotyczy), \n - adres e-mail."]
[1]
[2]
["12. ","ZŁĄCZNIKI",null,null,null,null,null,null,null,null,null,null,null,null,null,null,null,null,null,null,null,null,null,null,null,null,null,null,null,null,{"$f":"_xlfn.CONCAT(A191,B191)","v":"12. ZŁĄCZNIKI"}]
[null,"Do wniosku dołączone zostały załączniki:   ",null,null,null,null,null,null,null,null,null,null,null,null,null,null,null,null,null,null,null,null,null,null,null,null,null,null,null,null,"Wybierz z list rozwijanych, które z wymienionych załączników zostały dołączone do wniosku."]
[null,"a)","kopia prawomocnej* decyzji o pozwoleniu na budowę - dotyczy robót realizowanych na podstawie pozwolenia na budowę (obligatoryjnie),\n*w przypadku nadania decyzji rygoru natychmiastowej wykonalności prawomocność nie jest wymagana",null,null,null,null,null,null,null,null,null,null,null,null,null,null,null,null,null,null,null,null,null,null,null,null,null,null,null,{"$f":"IF(X193=\"\",\"Wybierz z listy rozwijanej, czy załączono kopię prawomocnej decyzji o pozwoleniu na budowę.\"&\"\nZałącznik jest OBLIGATORYJNY jeśli nie załącza się kopii ZRID lub kopii zgłoszenia robót budowlanych z poświadczeniem o braku podstaw do wniesienia sprzeciwu.\"&\" Pozostawienie komórki pustej jest jednoznaczne z wybraniem NIE.\",IF(AND(X193<>\"tak\",X194<>\"tak\",X196<>\"tak\"),\"BŁĄD - kopia prawomocnej decyzji o pozwoleniu na budowę jest załącznikiem OBLIGATORYJNYM jeśli nie załącza się kopii ZRID lub kopii zgłoszenia robót budowlanych z poświadczeniem o braku podstaw do wniesienia sprzeciwu\", IF(AND(X193<>\"tak\", OR(X194=\"tak\",X196=\"tak\")),\"OK - wnioskodawca oświadczył, że załączył do wniosku kopię jednego z trzech wymaganych dokumentów wskazanych w pkt 12, lit. a wniosku\",\"OK - wnioskodawca oświadczył, że załączył do wniosku kopię prawomocnej decyzji o pozwoleniu na budowę\")))","v":"Wybierz z listy rozwijanej, czy załączono kopię prawomocnej decyzji o pozwoleniu na budowę.\nZałącznik jest OBLIGATORYJNY jeśli nie załącza się kopii ZRID lub kopii zgłoszenia robót budowlanych z poświadczeniem o braku podstaw do wniesienia sprzeciwu. Pozostawienie komórki pustej jest jednoznaczne z wybraniem NIE."},null,null,null,null,null,null,null,null,null,null,null,null,null,null,null,null,null,null,null,{"$f":"IF(AND(X193<>\"tak\",X194<>\"tak\",X196<>\"tak\"),\"B\",IF(X193=\"\",\"OK1\",IF(AND(X193<>\"tak\",OR(X194=\"tak\",X196=\"tak\")),\"OK1\",\"OK\")))","v":"B"},{"$f":"IF(AND(OR(X193=\"\",X193=\"nie\",X193=\"nie dotyczy\"),OR(X194=\"\",X194=\"nie\",X194=\"nie dotyczy\"),OR(X196=\"nie\",X196=\"nie dotyczy\")),\"B\",\"OK\")","v":"OK"}]
[null,null,"lub"]
[null,null,"kopia prawomocnej* decyzji o zezwoleniu na realizację inwestycji drogowej (ZRID)- dotyczy robót realizowanych na podstawie ZRID (obligatoryjnie), \n*w przypadku nadania decyzji rygoru natychmiastowej wykonalności prawomocność nie jest wymagana",null,null,null,null,null,null,null,null,null,null,null,null,null,null,null,null,null,null,null,null,null,null,null,null,null,null,null,{"$f":"IF(X194=\"\",\"Wybierz z listy rozwijanej, czy załączono kopię prawomocnej decyzji o zezwoleniu na realizację inwestycji drogowej (ZRID).\"&\"\nZałącznik jest OBLIGATORYJNY jeśli nie załącza się kopii decyzji o pozwoleniu na budowę lub kopii zgłoszenia robót budowlanych z poświadczeniem o braku podstaw do wniesienia sprzeciwu.\"&\" Pozostawienie komórki pustej jest jednoznaczne z wybraniem NIE.\",IF(AND(X193<>\"tak\",X194<>\"tak\",X196<>\"tak\"),\"BŁĄD - kopia prawomocnej decyzji o zezwoleniu na realizację inwestycji drogowej jest załącznikiem OBLIGATORYJNYM\"&\" jeśli nie załącza się kopii decyzji o pozwoleniu na budowę lub kopii zgłoszenia robót budowlanych z poświadczeniem o braku podstaw do wniesienia sprzeciwu\", IF(AND(X194<>\"tak\", OR(X193=\"tak\",X196=\"tak\")),\"OK - wnioskodawca oświadczył, że załączył do wniosku kopię jednego z trzech wymaganych dokumentów wskazanych w pkt 12, lit. a wniosku\",\"OK - wnioskodawca oświadczył, że załączył do wniosku kopię prawomocnej decyzji o zezwoleniu na realizację inwestycji drogowej (ZRID)\")))","v":"Wybierz z listy rozwijanej, czy załączono kopię prawomocnej decyzji o zezwoleniu na realizację inwestycji drogowej (ZRID).\nZałącznik jest OBLIGATORYJNY jeśli nie załącza się kopii decyzji o pozwoleniu na budowę lub kopii zgłoszenia robót budowlanych z poświadczeniem o braku podstaw do wniesienia sprzeciwu. Pozostawienie komórki pustej jest jednoznaczne z wybraniem NIE."},null,null,null,null,null,null,null,null,null,null,null,null,null,null,null,null,null,null,null,{"$f":"IF(AND(X193<>\"tak\",X194<>\"tak\",X196<>\"tak\"),\"B\",IF(X194=\"\",\"OK1\",IF(AND(X194<>\"tak\",OR(X193=\"tak\",X196=\"tak\")),\"OK1\",\"OK\")))","v":"B"},{"$f":"IF(AND(OR(X193=\"\",X193=\"nie\",X193=\"nie dotyczy\"),OR(X194=\"\",X194=\"nie\",X194=\"nie dotyczy\"),OR(X196=\"nie\",X196=\"nie dotyczy\")),\"B\",\"OK\")","v":"OK"}]
[null,null,"lub"]
[null,null,"kopia zgłoszenia robót budowlanych z poświadczeniem o braku podstaw do wniesienia sprzeciwu na zgłoszenie wykonania robót budowlanych potwierdzonym:\n      - zaświadczeniem organu administracji architektoniczno-budowlanej \n        lub \n      - pieczęcią organu administracji architektoniczno-budowlanej \ndotyczy robót realizowanych na podstawie zgłoszenia (obligatoryjnie),",null,null,null,null,null,null,null,null,null,null,null,null,null,null,null,null,null,null,null,null,null,null,null," ",null,null,null,{"$f":"IF(X196=\"\",\"Wybierz z listy rozwijanej, czy załączono kopię zgłoszenia robót budowlanych z poświadczeniem o braku podstaw do wniesienia sprzeciwu.\"&\"\nZałącznik jest OBLIGATORYJNY jeśli nie załącza się kopii decyzji o pozwoleniu na budowę lub kopii ZRID.\"&\" Pozostawienie komórki pustej jest jednoznaczne z wybraniem NIE.\",IF(AND(X193<>\"tak\",X194<>\"tak\",X196<>\"tak\"),\"BŁĄD - kopia zgłoszenia robót budowlanych z poświadczeniem o braku podstaw do wniesienia sprzeciwu jest załącznikiem OBLIGATORYJNYM\"&\" jeśli nie załącza się kopii decyzji o pozwoleniu na budowę lub kopii ZRID\",IF(AND(X196<>\"tak\", OR(X193=\"tak\",X194=\"tak\")),\"OK - wnioskodawca oświadczył, że załączył do wniosku kopię jednego z trzech wymaganych dokumentów wskazanych w pkt 12, lit. a wniosku\",\"OK - wnioskodawca oświadczył, że załączył do wniosku kopię zgłoszenia robót budowlanych z poświadczeniem o braku podstaw do wniesienia sprzeciwu\")))","v":"Wybierz z listy rozwijanej, czy załączono kopię zgłoszenia robót budowlanych z poświadczeniem o braku podstaw do wniesienia sprzeciwu.\nZałącznik jest OBLIGATORYJNY jeśli nie załącza się kopii decyzji o pozwoleniu na budowę lub kopii ZRID. Pozostawienie komórki pustej jest jednoznaczne z wybraniem NIE."},null,null,null,null,null,null,null,null,null,null,null,null,null,null,null,null,null,null,null,{"$f":"IF(AND(X193<>\"tak\",X194<>\"tak\",X196<>\"tak\"),\"B\",IF(X196=\"\",\"OK1\",IF(AND(X196<>\"tak\",OR(X193=\"tak\",X194=\"tak\")),\"OK1\",\"OK\")))","v":"B"},{"$f":"IF(AND(OR(X193=\"\",X193=\"nie\",X193=\"nie dotyczy\"),OR(X194=\"\",X194=\"nie\",X194=\"nie dotyczy\"),OR(X196=\"nie\",X196=\"nie dotyczy\")),\"B\",\"OK\")","v":"OK"}]
[null,"b)","zgodna ze stanem faktycznym, czytelna mapa poglądowa zawierająca: \n   - naniesioną skalę, \n   - zaznaczone miejsce/odcinek realizacji wnioskowanego zadania, \n   - obszar obrazujący odległość 200 m od odcinka drogi objętego zadaniem, \n   - zaznaczone elementy mające wpływ na ocenę merytoryczną wniosku - \n     dotyczy kryterium: nr 2 lit. A, B, D; nr 3 lit. A, B; nr 4 lit. C, D; nr 5 lit. A, B, C; nr 7\n(obligatoryjnie).",null,null,null,null,null,null,null,null,null,null,null,null,null,null,null,null,null,null,null,null,null,null,null,null,null,null,null,{"$f":"IF(X198=\"\",\"Wybierz z listy rozwijanej, czy załączono mapę poglądową.\nZałącznik jest OBLIGATORYJNY.\nPozostawienie komórki pustej jest jednoznaczne z wybraniem NIE.\",IF(OR(X198=\"\",X198=\"nie\",X198=\"nie dotyczy\"),\"BŁĄD - mapa poglądowa jest załącznikiem OBLIGATORYJNYM\",\"OK - wnioskodawca oświadczył, że załączył do wniosku mapę poglądową\"))","v":"Wybierz z listy rozwijanej, czy załączono mapę poglądową.\nZałącznik jest OBLIGATORYJNY.\nPozostawienie komórki pustej jest jednoznaczne z wybraniem NIE."},null,null,null,null,null,null,null,null,null,null,null,null,null,null,null,null,null,null,null,{"$f":"IF(X198=\"tak\",\"OK\",\"B\")","v":"B"},{"$f":"IF(OR(X198=\"nie\",X198=\"nie dotyczy\"),\"B\",\"OK\")","v":"OK"}]
[null,"c)","rysunki  z charakterystycznymi przekrojami poprzecznymi pasa drogowego w liniach rozgraniczających ze zwymiarowanymi elementami drogi – szerokość jezdni, pasa ruchu drogowego, pobocza, drogi dla pieszych, itp. (obligatoryjnie).",null,null,null,null,null,null,null,null,null,null,null,null,null,null,null,null,null,null,null,null,null,null,null,null,null,null,null,{"$f":"IF(X199=\"\",\"Wybierz z listy rozwijanej, \"&\"czy załączono kopie rysunków z charakterystycznymi przekrojami poprzecznymi pasa drogowego w liniach rozgraniczających.\"&\"\nZałącznik jest OBLIGATORYJNY. Pozostawienie komórki pustej jest jednoznaczne z wybraniem NIE.\",IF(OR(X199=\"\",X199=\"nie\",X199=\"nie dotyczy\"),\"BŁĄD -  kopie rysunków z charakterystycznymi przekrojami poprzecznymi pasa drogowego w liniach rozgraniczających  są załącznikiem OBLIGATORYJNYM\",\"OK - wnioskodawca oświadczył, że załączył do wniosku \"&\"kopie rysunków z charakterystycznymi przekrojami poprzecznymi pasa drogowego w liniach rozgraniczających\"))","v":"Wybierz z listy rozwijanej, czy załączono kopie rysunków z charakterystycznymi przekrojami poprzecznymi pasa drogowego w liniach rozgraniczających.\nZałącznik jest OBLIGATORYJNY. Pozostawienie komórki pustej jest jednoznaczne z wybraniem NIE."},null,null,null,null,null,null,null,null,null,null,null,null,null,null,null,null,null,null,null,{"$f":"IF(X199=\"tak\",\"OK\",\"B\")","v":"B"},{"$f":"IF(OR(X199=\"nie\",X199=\"nie dotyczy\"),\"B\",\"OK\")","v":"OK"}]
[null,"d)","kopia kosztorysu inwestorskiego (obligatoryjnie).",null,null,null,null,null,null,null,null,null,null,null,null,null,null,null,null,null,null,null,null,null,null,null,null,null,null,null,{"$f":"IF(X200=\"\",\"Wybierz z listy rozwijanej, czy załączono kopię aktualnego kosztorysu inwestorskiego (sporządzonego nie wcześniej niż 6 miesięcy przed złożeniem wniosku).\"&\" Załącznik jest OBLIGATORYJNY. Pozostawienie komórki pustej jest jednoznaczne z wybraniem NIE.\",IF(OR(X200=\"\",X200=\"nie\",X200=\"nie dotyczy\"),\"BŁĄD - kopia aktualnego kosztorysu inwestorskiego jest załącznikiem OBLIGATORYJNYM\",\"OK - wnioskodawca oświadczył, że załączył do wniosku kopię aktualnego kosztorysu inwestorskiego\"))","v":"Wybierz z listy rozwijanej, czy załączono kopię aktualnego kosztorysu inwestorskiego (sporządzonego nie wcześniej niż 6 miesięcy przed złożeniem wniosku). Załącznik jest OBLIGATORYJNY. Pozostawienie komórki pustej jest jednoznaczne z wybraniem NIE."},null,null,null,null,null,null,null,null,null,null,null,null,null,null,null,null,null,null,null,{"$f":"IF(X200=\"tak\",\"OK\",\"B\")","v":"B"},{"$f":"IF(OR(X200=\"nie\",X200=\"nie dotyczy\"),\"B\",\"OK\")","v":"OK"}]
[null,"e)","kopia zgody na odstępstwo od przepisów techniczno-budowlanych (jeśli dotyczy).",null,null,null,null,null,null,null,null,null,null,null,null,null,null,null,null,null,null,null,null,null,null,null,null,null,null,null,{"$f":"IF(X201=\"\",\"Wybierz z listy rozwijanej, czy załączono kopię zgody na odstępstwo od przepisów techniczno-budowlanych - jeśli dotyczy, czyli gdy parametru odcinka nie są zgodne z parametrami wynikającymi z Rozporządzenia\"&\" - jeśli dotyczy, czyli gdy w pkt nr 9  zgoda na odstępstwo od przepisów wybrano TAK\",IF(AND(R64=\"tak\",X201=\"tak\"),\"OK - wnioskodawca oświadczył, że załączył kopię zgody na odstępstwo od przepisów techniczno-budowlanych\", IF(AND(R64=\"tak\", OR(X201=\"nie\",X201=\"nie dotyczy\")),\"BŁĄD - zgoda jest załącznikiem OBLIGATORYJNYM w przypadku, gdy w pkt nr 9 zgoda na odstępstwo od przepisów wybrano TAK.\"&\"\nWybierz TAK lub zmień odpowiedź w pkt nr 9 zgoda na odstępstwo od przepisów\", IF(AND(OR(R64=\"nie dotyczy\",R64=\"nie\",R64=\"\"),OR(X201=\"nie\",X201=\"nie dotyczy\",X201=\"\")),\"OK - wnioskodawca oświadczył, że nie załączył kopii zgody na odstępstwo od przepisów techniczno-budowlanych\", IF(AND(OR(R64=\"nie dotyczy\",R64=\"nie\",R64=\"\"),OR(X201=\"tak\")),\"BŁĄD - w pkt nr 9 zgoda na odstępstwo od przepisów wybrano NIE (pozostawienie komórki pustej jest jednoznaczne z wybraniem NIE). Wybierz NIE lub zmień odpowiedź w pkt nr 9 zgoda na odstępstwo od przepisów\", \"Błąd danej - wprowadzono daną spoza listy rozwijanej\")))))","v":"Wybierz z listy rozwijanej, czy załączono kopię zgody na odstępstwo od przepisów techniczno-budowlanych - jeśli dotyczy, czyli gdy parametru odcinka nie są zgodne z parametrami wynikającymi z Rozporządzenia - jeśli dotyczy, czyli gdy w pkt nr 9  zgoda na odstępstwo od przepisów wybrano TAK"},null,null,null,null,null,null,null,null,null,null,null,null,null,null,null,null,null,null,null,{"$f":"IF(X201=\"\",\"W\",IF(AND(X201=\"tak\",OR(R64=\"\",R64=\"nie\",R64=\"nie dotyczy\")),\"B\",IF(AND(X201<>\"tak\",R64=\"tak\"),\"B\",\"OK\")))","v":"W"}]
[null,"f)","kopia protokołu strat potwierdzonego przez Wojewodę Świętokrzyskiego - dotyczy kryterium nr 2 lit. D (jeśli dotyczy).",null,null,null,null,null,null,null,null,null,null,null,null,null,null,null,null,null,null,null,null,null,null,null,null,null,null,null,{"$f":"IF(X202=\"\",\"Wybierz z listy rozwijanej, czy załączono kopię protokołu strat potwierdzonego przez Wojewodę Świętokrzyskiego\"&\" - jeśli dotyczy, czyli gdy w kryterium nr 2 lit. D wybrano TAK\",IF(AND(B125=\"tak\",X202=\"tak\"),\"OK - wnioskodawca oświadczył, że załączył kopię protokołu strat potwierdzonego przez Wojewodę Świętokrzyskiego\", IF(AND(B125=\"tak\", OR(X202=\"nie\",X202=\"nie dotyczy\")),\"BŁĄD - protokół jest załącznikiem OBLIGATORYJNYM w przypadku, gdy w kryterium nr 2 lit. D wybrano TAK.\"&\"\nWybierz TAK lub zmień odpowiedź w kryterium nr 2 lit. D\",IF(AND(OR(B125=\"nie\",B125=\"\"),OR(X202=\"nie\",X202=\"nie dotyczy\",X202=\"\")),\"OK - wnioskodawca oświadczył, że nie załączył protokołu strat potwierdzonego przez Wojewodę Świętokrzyskiego\", IF(AND(OR(B125=\"nie\",B125=\"\"),OR(X202=\"tak\")),\"BŁĄD - w kryterium nr 2 lit. D wybrano NIE (pozostawienie komórki pustej jest jednoznaczne z wybraniem NIE). Wybierz NIE lub zmień odpowiedź w kryterium nr 2 lit. D\", \"Błąd danej - wprowadzono daną spoza listy rozwijanej\")))))","v":"Wybierz z listy rozwijanej, czy załączono kopię protokołu strat potwierdzonego przez Wojewodę Świętokrzyskiego - jeśli dotyczy, czyli gdy w kryterium nr 2 lit. D wybrano TAK"},null,null,null,null,null,null,null,null,null,null,null,null,null,null,null,null,null,null,null,{"$f":"IF(X202=\"\",\"W\",IF(AND(X202=\"tak\",OR(B125=\"\",B125=\"nie\")),\"B\",IF(AND(X202<>\"tak\",B125=\"tak\"),\"B\",\"OK\")))","v":"W"}]
[null,"g)","kopia dokumentu potwierdzającego przebieg linii autobusowej objętej wsparciem  z FRPA, linii użyteczności publicznej lub realizowanie usług transportu publicznego - dotyczy kryterium nr 4 lit. D (jeśli dotyczy).",null,null,null,null,null,null,null,null,null,null,null,null,null,null,null,null,null,null,null,null,null,null,null,null,null,null,null,{"$f":"IF(X203=\"\",\"Wybierz z listy rozwijanej, czy załączono dokument potwierdzający przebieg linii autobusowej objętej wsparciem z FRPA, linii użyteczności publicznej lub realizowanie usług transportu publicznego\"&\" - jeśli dotyczy, czyli gdy w kryterium nr 4 lit. D wybrano TAK\",IF(AND(B164=\"tak\",X203=\"tak\"),\"OK - wnioskodawca oświadczył, że załączył dokument potwierdzający przebieg linii autobusowej objętej wsparciem z FRPA, linii użyteczności publicznej lub realizowanie usług transportu publicznego\", IF(AND(B164=\"tak\", OR(X203=\"nie\",X203=\"nie dotyczy\")),\"BŁĄD - dokument jest załącznikiem OBLIGATORYJNYM w przypadku, gdy w kryterium nr 4 lit. D wybrano TAK.\"&\"\nWybierz TAK lub zmień odpowiedź w kryterium nr 4 lit. D\",IF(AND(OR(B164=\"nie\",B164=\"\"),OR(X203=\"nie\",X203=\"nie dotyczy\",X203=\"\")),\"OK - wnioskodawca oświadczył, że nie załączył dokumentu potwierdzającego przebieg linii autobusowej objętej wsparciem z FRPA, linii użyteczności publicznej lub realizowania usług transportu publicznego\", IF(AND(OR(B164=\"nie\",B164=\"\"),OR(X203=\"tak\")),\"BŁĄD - w kryterium nr 4 lit. D wybrano NIE (pozostawienie komórki pustej jest jednoznaczne z wybraniem NIE). Wybierz NIE lub zmień odpowiedź w kryterium nr 4 lit. D\", \"Błąd danej - wprowadzono daną spoza listy rozwijanej\")))))","v":"Wybierz z listy rozwijanej, czy załączono dokument potwierdzający przebieg linii autobusowej objętej wsparciem z FRPA, linii użyteczności publicznej lub realizowanie usług transportu publicznego - jeśli dotyczy, czyli gdy w kryterium nr 4 lit. D wybrano TAK"},null,null,null,null,null,null,null,null,null,null,null,null,null,null,null,null,null,null,null,{"$f":"IF(X203=\"\",\"W\",IF(AND(X203=\"tak\",OR(R68=\"\",R68=\"nie\",R68=\"nie dotyczy\")),\"B\",IF(AND(X203<>\"tak\",R68=\"tak\"),\"B\",\"OK\")))","v":"W"}]
[null,"h)","kopia uchwały o zaliczeniu drogi do odpowiedniej kategorii dróg publicznych (jeśli dotyczy) oraz uchwała o zmianie numerów dróg publicznych* (jeśli dotyczy).\n* w przypadku, numer drogi wskazany we wniosku jest inny niż w uchwale o zliczeniu drogi do dróg publicznych, czyli gdy po zaliczeniu drogi do odpowiedniej kategorii dróg publicznych nastąpiła zmiana numeru drogi - fakt ten należy odnotować poniżej w pkt 12 lit. i (dodatkowe załączniki)",null,null,null,null,null,null,null,null,null,null,null,null,null,null,null,null,null,null,null,null,null,null,null,null,null,null,null,{"$f":"IF(X204=\"\",\"Wybierz z listy rozwijanej, czy załączono uchwałę o zaliczeniu drogi do odpowiedniej kategorii dróg publicznych - dotyczy dróg publicznych. Załącznik jest OBLIGATORYJNY w przypadku dróg publicznych.\"&\"\nNależy załączyć uchwałę o zmianie numeru drogi, jeśli numer drogi podany we wniosku jest inny niż numer wynikający z uchwały o zaliczeniu drogi do dróg publicznych,\"&\" czyli gdy po zaliczeniu drogi do kategorii dróg publicznych zmieniono jej numer.\", IF(AND(OR(B20=\"gminna\",B20=\"powiatowa\"),X204=\"tak\"),\"OK - wnioskodawca oświadczył, że załączył uchwałę o zaliczeniu drogi do dróg publicznych\", IF(AND(OR(B20=\"gminna\",B20=\"powiatowa\"),OR(X204=\"nie\",X204=\"nie dotyczy\")),\"BŁĄD - uchwała jest załącznikiem OBLIGATORYJNYM w przypadku realizacji zadania na drodze zaliczonej do dróg publicznych\", IF(AND(OR(B20=\"\",B20=\"brak\"),OR(X204=\"nie\",X204=\"nie dotyczy\",X204=\"\")),\"OK - wnioskodawca oświadczył, że nie załączył uchwały do wniosku i że droga nie jest jeszcze zaliczona do dróg publicznych\", IF(AND(OR(B20=\"\",B20=\"brak\"),OR(X204=\"tak\")),\"BŁĄD - w pkt 3 wniosku nie wybrano kategorii drogi lub wybrano BRAK kategorii\", \"Błąd danej - wprowadzono daną spoza listy rozwijanej\")))))","v":"Wybierz z listy rozwijanej, czy załączono uchwałę o zaliczeniu drogi do odpowiedniej kategorii dróg publicznych - dotyczy dróg publicznych. Załącznik jest OBLIGATORYJNY w przypadku dróg publicznych.\nNależy załączyć uchwałę o zmianie numeru drogi, jeśli numer drogi podany we wniosku jest inny niż numer wynikający z uchwały o zaliczeniu drogi do dróg publicznych, czyli gdy po zaliczeniu drogi do kategorii dróg publicznych zmieniono jej numer."},null,null,null,null,null,null,null,null,null,null,null,null,null,null,null,null,null,null,null,{"$f":"IF(X204=\"\",\"w\",IF(AND(OR(B20=\"gminna\",B20=\"powiatowa\"),X204=\"\"),\"W\",IF(AND(OR(B20=\"gminna\",B20=\"powiatowa\"),X204=\"tak\"),\"OK\",IF(AND(OR(B20=\"\",B20=\"brak\"),X204<>\"tak\"),\"OK\",\"B\"))))","v":"w"}]
[null,"i)","dodatkowe załączniki (jeśli dotyczy):"]
[null,null,null,null,null,null,null,null,null,null,null,null,null,null,null,null,null,null,null,null,null,null,null,null,null,null,{"$f":"LEN(C206)","v":0},"z",500,null,"Wybierz z listy rozwijanej, czy do wniosku dołączono dodatkowe załączniki.\nJeśli TAK, to wpisz /wymień jakie dodatkowe załączniki dołączono do wniosku.\n\nPisanie od nowej linii  - wciśnij jednocześnie dwa klawisze: lewy ALT oraz ENTER"]
["13. ","OŚWIADCZENIA WNIOSKODAWCY (ustawowego zarządcy drogi)",null,null,null,null,null,null,null,null,null,null,null,null,null,null,null,null,null,null,null,null,null,null,null,null,null,null,null,null,{"$f":"_xlfn.CONCAT(A207,B207)","v":"13. OŚWIADCZENIA WNIOSKODAWCY (ustawowego zarządcy drogi)"}]
["Wnioskodawca oświadcza, że: "]
["1)","do wniosku dołączone zostały załączniki wskazane w pkt 12 wniosku;"]
["2)","dane i informacje zawarte we wniosku są prawidłowe i kompletne;"]
["3)","na dzień złożenia wniosku, zadanie obejmuje inwestycję wyłącznie na drodze dla której wnioskodawca pełni rolę ustawowego zarządcy;"]
["4)","na dzień złożenia wniosku, zadanie obejmuje inwestycję wyłącznie na drodze, która:",null,null,null,null,null,null,null,null,null,null,null,null,null,null,null,null,null,null,null,null,null,null,null,null,null,null,null,null,"Wybierz z list rozwijanych \"TAK/NIE/NIE DOTYCZY\", czy droga została lub zostanie zaliczona do odpowiedniej kategorii dróg"]
[null,"•","została zaliczona do kategorii dróg publicznych",null,null,null,null,null,null,null,null,null,null,null,null,null,null,null,null,null,null,null,null,null,null,null,null,null,null,null,{"$f":"IF(AND(AY213=\"b\",AY214=\"b\"),\"Błąd - nie określono czy droga jest zaliczona do dróg publicznych, czy będzie zaliczona do dróg publicznych\",IF(AND(OR(W213=\"\",W213=\"nie\",W213=\"nie dotyczy\"),OR(B20=\"powiatowa\",B20=\"gminna\")),\"BŁĄD - w pkt 3 wniosku wskazano, że droga jest zaliczona do dróg publicznych, należy wybrać TAK lub zmienić odpowiedź w pkt 3 wniosku\",\"\"))","v":""},null,null,null,null,null,null,null,null,null,null,null,null,null,null,null,null,null,null,null,{"$f":"IF(AND(W214=\"\",W213=\"\"),\"W\",IF(AND(W214=\"nie dotyczy\",W213=\"nie dotyczy\"),\"B\",IF(AND(W214=\"NIE\",W213=\"NIE\"),\"B\",IF(AND(W214=\"nie dotyczy\",W213=\"NIE\"),\"B\",IF(AND(W214=\"NIE\",W213=\"nie dotyczy\"),\"B\",IF(AND(W214=\"\",W213=\"nie dotyczy\"),\"B\",IF(AND(W214=\"\",W213=\"NIE\"),\"B\",IF(AND(W214=\"NIE\",W213=\"\"),\"B\",IF(AND(W214=\"nie dotyczy\",W213=\"\"),\"B\",\"OK\")))))))))","v":"W"},{"$f":"IF(AND(OR(W213=\"\",W213=\"nie\",W213=\"nie dotyczy\"),OR(B20=\"powiatowa\",B20=\"gminna\")),\"B\",\"\")","v":""}]
[null,"•","zostanie zaliczona do kategorii dróg publicznych*",null,null,null,null,null,null,null,null,null,null,null,null,null,null,null,null,null,null,null,null,null,null,null,null,null,null,null,{"$f":"IF(AND(Y149=\"tak\",OR(W214=\"\",W214=\"nie\",W214=\"nie dotyczy\")),\"Należy wybrać TAK lub zmienić odpowiedź w kryterium nr 3 lit. C pkt 5\",\"\")","v":""},null,null,null,null,null,null,null,null,null,null,null,null,null,null,null,null,null,null,null,{"$f":"IF(AND(W214=\"\",W213=\"\"),\"W\",IF(AND(W214=\"nie dotyczy\",W213=\"nie dotyczy\"),\"B\",IF(AND(W214=\"NIE\",W213=\"NIE\"),\"B\",IF(AND(W214=\"nie dotyczy\",W213=\"NIE\"),\"B\",IF(AND(W214=\"NIE\",W213=\"nie dotyczy\"),\"B\",IF(AND(W214=\"\",W213=\"nie dotyczy\"),\"B\",IF(AND(W214=\"\",W213=\"NIE\"),\"B\",IF(AND(W214=\"NIE\",W213=\"\"),\"B\",IF(AND(W214=\"nie dotyczy\",W213=\"\"),\"B\",\"OK\")))))))))","v":"W"},{"$f":"IF(AND(Y149=\"tak\",W214<>\"tak\"),\"B\",\"OK\")","v":"OK"}]
[null,null,"* uchwałą właściwego organu jst w sprawie zaliczenia drogi/dróg do odpowiedniej kategorii w terminie \n12 miesięcy od dnia zatwierdzenia rozliczenia; "]
["5)","zapewnione zostanie zabezpieczenie całości zadeklarowanego we wniosku wkładu własnego;"]
["6)","dopełnił lub dopełni wszelkich wymogów wynikających z przepisów prawa uprawniających do realizacji wnioskowanego zadania;"]
["7)","przeprowadzi postępowanie o zamówienie publiczne zgodnie z obowiązującymi przepisami Prawa zamówień publicznych (t.j. Dz. U. z 2024 r. poz. 1320 ze zm.)."]
["OŚWIADCZENIE O REALIZACJI ZADANIA W PASIE DROGOWYM (obligatoryjnie)",null,null,null,null,null,null,null,null,null,null,null,null,null,null,null,null,null,null,null,null,null,null,null,null,null,null,null,null,null,{"$f":"A219","v":"OŚWIADCZENIE O REALIZACJI ZADANIA W PASIE DROGOWYM (obligatoryjnie)"}]
[null,"Wnioskodawca oświadcza, że planowane do realizacji elementy drogi mieszczą się w granicach pasa drogowego (nie zaplanowano ich na działkach stanowiących własność prywatną bądź na działkach niestanowiących pasa drogowego)",null,null,null,null,null,null,null,null,null,null,null,null,null,null,null,null,null,null,null,null,null,null,null,null,null,null,null,null,{"$f":"IF(X219=\"\",\"Wybierz z listy rozwijanej czy wnioskodawca oświadcza, że zadnie realizowane jest w pasie drogowym.\nRealizacja zadania w pasie drogowym jest OBLIGATORYJNA.\",IF(X219=\"tak\",\"OK - wnioskodawca oświadcza, że zadnie realizowane jest w pasie drogowym.\",IF(X219=\"nie\",\"Oświadczenie jest OBLIGATORYJNE\",\"Błąd danej - wprowadzono daną spoza listy rozwijanej\")))","v":"Wybierz z listy rozwijanej czy wnioskodawca oświadcza, że zadnie realizowane jest w pasie drogowym.\nRealizacja zadania w pasie drogowym jest OBLIGATORYJNA."},null,null,null,null,null,null,null,null,null,null,null,null,null,null,null,null,null,null,null,{"$f":"IF(X219=\"\",\"W\",IF(X219=\"tak\",\"OK\",\"B\"))","v":"W"}]
["OŚWIADCZENIE O PRZEKAZANIU DANYCH O SIECI DRÓG PUBLICZNYCH (obligatoryjnie)",null,null,null,null,null,null,null,null,null,null,null,null,null,null,null,null,null,null,null,null,null,null,null,null,null,null,null,null,null,{"$f":"A221","v":"OŚWIADCZENIE O PRZEKAZANIU DANYCH O SIECI DRÓG PUBLICZNYCH (obligatoryjnie)"}]
[null,"Wnioskodawca oświadcza, że zgodnie z zapisami § 2 rozporządzenia Ministra Infrastruktury z dnia 16 lutego 2005 r. w sprawie trybu sporządzania informacji oraz gromadzenia i udostępniania danych o sieci dróg publicznych, obiektach mostowych, tunelach oraz promach (Dz. U. 2005 nr 67 poz. 583) sporządzono oraz przekazano do Generalnego Dyrektora Dróg Krajowych i Autostrad informacje dla celów statystycznych o sieci dróg publicznych według stanu na dzień 31 grudnia 2024 r. ",null,null,null,null,null,null,null,null,null,null,null,null,null,null,null,null,null,null,null,null,null,null,null,null,null,null,null,null,{"$f":"IF(X221=\"\",\"Wybierz z listy rozwijanej czy wnioskodawca oświadcza, że sporządził i przekazał do Generalnego Dyrektora Dróg Krajowych i Autostrad informacje do celów statystycznych o sieci dróg publicznych.\nOświadczenie jest OBLIGATORYJNE.\",IF(X221=\"tak\",\"OK - wnioskodawca oświadcza, że sporządził i przekazał do Generalnego Dyrektora Dróg Krajowych i Autostrad informacje do celów statystycznych o sieci dróg publicznych.\",IF(X221=\"nie\",\"Oświadczenie jest OBLIGATORYJNE\",\"Błąd danej - wprowadzono daną spoza listy rozwijanej\")))","v":"Wybierz z listy rozwijanej czy wnioskodawca oświadcza, że sporządził i przekazał do Generalnego Dyrektora Dróg Krajowych i Autostrad informacje do celów statystycznych o sieci dróg publicznych.\nOświadczenie jest OBLIGATORYJNE."},null,null,null,null,null,null,null,null,null,null,null,null,null,null,null,null,null,null,null,{"$f":"IF(X221=\"\",\"W\",IF(X221=\"tak\",\"OK\",\"B\"))","v":"W"}]
["OŚWIADCZENIE O POSIADANIU TYTUŁU PRAWNEGO DO NIERUCHOMOŚCI (obligatoryjnie)",null,null,null,null,null,null,null,null,null,null,null,null,null,null,null,null,null,null,null,null,null,null,null,null,null,null,null,null,null,{"$f":"A223","v":"OŚWIADCZENIE O POSIADANIU TYTUŁU PRAWNEGO DO NIERUCHOMOŚCI (obligatoryjnie)"}]
[null,"Wnioskodawca oświadcza, że posiada tytuł prawny do nieruchomości wskazanych w oświadczeniu o dysponowaniu nieruchomością na cele budowlane zgodnie z art. 3 ustawy z dnia 7 lipca 1994 r. prawo budowlane (t.j. Dz.U. z 2025 r. poz. 418), tj. tytuł prawny wynikający z prawa własności, użytkowania wieczystego, zarządu, ograniczonego prawa rzeczowego albo stosunku zobowiązaniowego, przewidującego uprawnienia do wykonywania robót budowlanych, ponadto tytuł ten nie wynika z posiadania samoistnego/władania lub z mocy prawa na podst. art. 73 ustawy z dnia 13 października 1998 r. Przepisy wprowadzające ustawy reformujące administrację publiczną (t.j. Dz. U. Nr 133, poz. 872 ze zm.) - dotyczy sytuacji gdy jst nie posiada decyzji potwierdzającej ten fakt.",null,null,null,null,null,null,null,null,null,null,null,null,null,null,null,null,null,null,null,null,null,null,null,null,null,null,null,null,{"$f":"IF(X223=\"\",\"Wybierz z listy rozwijanej czy wnioskodawca oświadcza, że posiada tytuł prawny do nieruchomości.\nPosiadanie tytułu prawnego do nieruchomości jest OBLIGATORYJNE.\",IF(X223=\"tak\",\"OK - wnioskodawca oświadcza, że posiada tytuł prawny do nieruchomości.\",IF(X223=\"nie\",\"Oświadczenie jest OBLIGATORYJNE\",\"Błąd danej - wprowadzono daną spoza listy rozwijanej\")))","v":"Wybierz z listy rozwijanej czy wnioskodawca oświadcza, że posiada tytuł prawny do nieruchomości.\nPosiadanie tytułu prawnego do nieruchomości jest OBLIGATORYJNE."},null,null,null,null,null,null,null,null,null,null,null,null,null,null,null,null,null,null,null,{"$f":"IF(X223=\"\",\"W\",IF(X223=\"tak\",\"OK\",\"B\"))","v":"W"}]
["OŚWIADCZENIE O ZGODNOŚCI Z PRZEPISAMI PRAWA (obligatoryjnie)",null,null,null,null,null,null,null,null,null,null,null,null,null,null,null,null,null,null,null,null,null,null,null,null,null,null,null,null,null,{"$f":"A225","v":"OŚWIADCZENIE O ZGODNOŚCI Z PRZEPISAMI PRAWA (obligatoryjnie)"}]
[null,"Wnioskodawca oświadcza, że realizacja zgłoszonego zadania odbędzie się z zachowaniem przepisów prawa budowlanego, w tym warunków techniczno-budowlanych dotyczących dróg, w szczególności z:",null,null,null,null,null,null,null,null,null,null,null,null,null,null,null,null,null,null,null,null,null,null,null,null,null,null,null,null,{"$f":"IF(X225=\"\",\"Wybierz z listy rozwijanej czy wnioskodawca oświadcza, że realizując zgłoszone we wniosku zadanie zostaną zachowane przepisy prawa budowlanego, w tym warunków techniczno-budowlanych dotyczących dróg.\"&\"\nPrzestrzeganie przepisów prawa budowlanego, w tym warunków-techniczno-budowlanych jest OBLIGATORYJNE.\",IF(X225=\"tak\",\"OK - wnioskodawca oświadcza, że realizując zgłoszone we wniosku zadanie zostaną zachowane przepisy prawa budowlanego, w tym warunków techniczno-budowlanych dotyczących dróg.\",IF(X225=\"nie\",\"Oświadczenie jest OBLIGATORYJNE.\",\"Błąd danej - wprowadzono daną spoza listy rozwijanej\")))","v":"Wybierz z listy rozwijanej czy wnioskodawca oświadcza, że realizując zgłoszone we wniosku zadanie zostaną zachowane przepisy prawa budowlanego, w tym warunków techniczno-budowlanych dotyczących dróg.\nPrzestrzeganie przepisów prawa budowlanego, w tym warunków-techniczno-budowlanych jest OBLIGATORYJNE."},null,null,null,null,null,null,null,null,null,null,null,null,null,null,null,null,null,null,null,{"$f":"IF(X225=\"\",\"W\",IF(X225=\"tak\",\"OK\",\"B\"))","v":"W"}]
[null,"•  ","ustawą z dnia 7 lipca 1994 r. prawo budowlane (t.j. Dz. U. z 2025 r. poz. 418);"]
[null,"•  ","rozporządzeniem Ministra Infrastruktury z dnia 24 czerwca 2022 r. w sprawie przepisów techniczno-budowlanych dotyczących dróg publicznych (t.j. Dz. U. z 2022 r. poz. 1518);\nlub\nrozporządzeniem Ministra Transportu i Gospodarki Morskiej z dnia 2 marca 1999 r. w sprawie warunków technicznych, jakim powinny odpowiadać drogi publiczne i ich usytuowanie (t.j. Dz. U. z 2016 r. poz. 124 ze zm.) - w przypadku, gdy ZRID jest sprzed 2022 roku"]
[null,"•  ","ustawą z dnia 21 marca 1985 r. o drogach publicznych (t.j. Dz. U. z 2025 r. poz. 889)."]
["OŚWIADCZENIE O DZIAŁANIACH INFORMACYJNYCH (obligatoryjnie)",null,null,null,null,null,null,null,null,null,null,null,null,null,null,null,null,null,null,null,null,null,null,null,null,null,null,null,null,null,{"$f":"A230","v":"OŚWIADCZENIE O DZIAŁANIACH INFORMACYJNYCH (obligatoryjnie)"}]
[null,"Wnioskodawca oświadcza, że realizując zgłoszone zadanie dopełni działań informacyjnych wynikających z art. 38 ustawy z dnia 23 października 2018 r. o Rządowym Funduszu Rozwoju Dróg (t.j. Dz. U. z 2025 r. poz. 94).",null,null,null,null,null,null,null,null,null,null,null,null,null,null,null,null,null,null,null,null,null,null,null,null,null,null,null,null,{"$f":"IF(X230=\"\",\"Wybierz z listy rozwijanej czy wnioskodawca oświadcza, że realizując zgłoszone we wniosku zadanie dopełni działań informacyjnych wynikających z ustawy o RFRD.\nDopełnienie działań informacyjnych jest OBLIGATORYJNE.\",IF(X230=\"TAK\",\"OK - wnioskodawca oświadcza, że dopełni działań informacyjnych wynikających z ustawy o RFRD.\",IF(X230=\"nie\",\"Oświadczenie jest OBLIGATORYJNE.\",\"Błąd danej - wprowadzono daną spoza listy rozwijanej\")))","v":"Wybierz z listy rozwijanej czy wnioskodawca oświadcza, że realizując zgłoszone we wniosku zadanie dopełni działań informacyjnych wynikających z ustawy o RFRD.\nDopełnienie działań informacyjnych jest OBLIGATORYJNE."},null,null,null,null,null,null,null,null,null,null,null,null,null,null,null,null,null,null,null,{"$f":"IF(X230=\"\",\"W\",IF(X230=\"tak\",\"OK\",\"B\"))","v":"W"}]
["OŚWIADCZENIE O ODPOWIEDZIALNOŚCI KARNEJ (obligatoryjnie)",null,null,null,null,null,null,null,null,null,null,null,null,null,null,null,null,null,null,null,null,null,null,null,null,null,null,null,null,null,{"$f":"A232","v":"OŚWIADCZENIE O ODPOWIEDZIALNOŚCI KARNEJ (obligatoryjnie)"}]
[null,"Ja, niżej podpisana/y, oświadczam, że informacje zawarte we wniosku oraz przedłożonych załącznikach są zgodne z prawdą. Jestem świadomy odpowiedzialności karnej wynikającej z art. 271 Kodeksu Karnego, dotyczącego poświadczenia nieprawdy, co do okoliczności mającej znaczenie prawne.",null,null,null,null,null,null,null,null,null,null,null,null,null,null,null,null,null,null,null,null,null,null,null,null,null,null,null,null,{"$f":"IF(X232=\"\",\"Wybierz z listy rozwijanej czy wnioskodawca oświadcza, że informacje zawarte we wniosku i załącznikach są zgodne z prawdą. \nOświadczenie to jest OBLIGATORYJNE.\",IF(X232=\"TAK\",\"OK - wnioskodawca oświadcza, że informacje zawarte we wniosku i załącznikach są zgodne z prawdą.\",IF(X232=\"nie\",\"Oświadczenie jest OBLIGATORYJNE.\",\"Błąd danej - wprowadzono daną spoza listy rozwijanej\")))","v":"Wybierz z listy rozwijanej czy wnioskodawca oświadcza, że informacje zawarte we wniosku i załącznikach są zgodne z prawdą. \nOświadczenie to jest OBLIGATORYJNE."},null,null,null,null,null,null,null,null,null,null,null,null,null,null,null,null,null,null,null,{"$f":"IF(X232=\"\",\"W\",IF(X232=\"tak\",\"OK\",\"B\"))","v":"W"}]
["Podpisy i pieczęcie osób upoważnionych z ramienia wnioskodawcy (ustawowego zarządcy drogi) \nwraz z podpisem i piećzęcią Skarbnika",null,null,null,null,null,null,null,null,null,null,null,null,null,null,null,null,null,null,null,null,null,null,null,null,null,null,null,null,null,{"$f":"A234","v":"Podpisy i pieczęcie osób upoważnionych z ramienia wnioskodawcy (ustawowego zarządcy drogi) \nwraz z podpisem i piećzęcią Skarbnika"}]
[null,null,null,null,null,null,null,null,null,null,null,null,null,null,null,null,null,null,null,null,null,null,null,null,null,null,null,null,null,null,"Jeśli wnioskodawcą (ustawowym zarządcą drogi) jest :\n - GMINA (samorząd gminy) - podpis i pieczątka wójta/burmistrza/prezydenta oraz skarbnika/głównego księgowego (łącznie 2 podpisy),\n - POWIAT (samorząd powiatu) - podpisy i pieczątki dwóch członków zarządu powiatu oraz skarbnika/głównego księgowego (łącznie 3 podpisy).\n\nW przypadku, gdy właściwa osoba nie może złożyć podpisu i pieczątki dopuszcza się, żeby w jej zastępstwie podpis i pieczątkę złożyła osoba upoważniona. Należy wtedy załączyć do wniosku kopię stosownego upoważnienia potwierdzoną za zgodność z oryginałem.\n"]

{"sheet":"Remont","index":1,"n_rows":235,"n_cols":54,"rows_kept":235,"cut":false,"hidden":false,"merged":[[3,30,3,47],[5,0,5,25],[6,0,6,25],[4,1,4,25],[3,1,3,25],[2,1,2,25],[1,1,1,25],[0,30,0,47],[4,30,4,47],[0,1,0,25],[5,30,6,47],[1,30,2,47],[10,30,10,47],[11,13,11,15],[11,16,11,25],[11,30,11,47],[12,13,12,15],[12,16,12,25],[12,30,12,47],[7,0,7,12],[7,13,7,25],[7,26,12,28],[7,30,8,47],[8,0,14,12],[8,13,8,25],[9,13,9,25],[9,30,9,47],[10,13,10,15],[10,16,10,25],[15,1,15,25],[15,30,15,47],[16,0,16,25],[16,30,16,47],[17,1,17,25],[17,30,17,47],[13,13,13,15],[13,16,13,21],[13,22,13,25],[13,30,13,47],[14,13,14,15],[14,16,14,25],[14,30,14,47],[19,1,19,3],[19,4,19,6],[19,7,19,10],[19,11,19,17],[19,18,19,25],[19,30,19,47],[18,1,18,3],[18,4,18,6],[18,7,18,10],[18,11,18,17],[18,18,18,25],[18,30,18,47],[20,0,20,25],[20,30,20,47],[21,1,21,25],[21,30,21,47],[22,0,23,2],[22,3,23,11],[22,12,23,15],[22,17,22,21],[22,22,22,25],[22,30,22,47],[23,17,23,21],[23,22,23,25],[23,30,23,47],[24,1,24,25],[24,30,24,47],[25,0,25,7],[25,8,25,15],[25,16,25,25],[25,30,25,47],[28,1,28,9],[28,10,28,17],[28,18,28,25],[28,30,28,47],[29,1,29,9],[29,10,29,17],[29,18,29,25],[29,30,29,47],[26,8,26,14],[26,16,26,24],[26,30,26,47],[27,1,27,25],[27,30,27,47],[26,0,26,7],[32,1,32,9],[32,10,32,17],[32,18,32,25],[32,30,32,47],[33,0,33,9],[33,10,33,17],[33,18,33,25],[33,30,33,47],[30,1,30,9],[30,10,30,17],[30,18,30,25],[30,30,30,47],[31,1,31,9],[31,10,31,17],[31,18,31,25],[31,30,31,47],[37,1,37,3],[37,4,37,25],[37,30,37,47],[38,1,38,19],[38,20,38,25],[38,30,38,47],[34,0,34,9],[34,10,34,25],[34,30,34,47],[35,1,35,25],[35,30,35,47],[36,1,36,19],[36,20,36,25],[36,30,36,47],[41,1,41,3],[41,4,41,25],[41,30,41,47],[42,1,42,19],[42,20,42,25],[42,30,42,47],[39,1,39,3],[39,4,39,25],[39,30,39,47],[40,1,40,19],[40,20,40,25],[40,30,40,47],[43,1,43,25],[43,30,43,47],[44,0,44,25],[44,30,45,47],[45,0,46,2],[45,3,45,12],[45,13,46,19],[45,20,46,25],[46,3,46,7],[46,8,46,12],[47,30,53,47],[48,0,48,2],[48,3,48,7],[48,8,48,12],[50,0,50,2],[50,3,50,7],[50,8,50,12],[50,13,50,19],[50,20,50,25],[51,0,51,2],[51,3,51,7],[48,13,48,19],[48,20,48,25],[49,0,49,2],[49,3,49,7],[49,8,49,12],[49,13,49,19],[49,20,49,25],[47,0,47,2],[47,3,47,7],[47,8,47,12],[47,13,47,19],[47,20,47,25],[51,8,51,12],[51,13,51,19],[51,20,51,25],[52,0,52,2],[52,3,52,7],[52,8,52,12],[52,13,52,19],[52,20,52,25],[53,0,53,2],[53,3,53,12],[53,13,53,19],[53,20,53,25],[56,1,56,7],[56,8,56,16],[56,17,56,25],[56,30,56,47],[57,1,57,7],[57,8,57,16],[57,17,57,25],[57,30,57,47],[54,1,54,25],[54,30,54,47],[55,0,55,7],[55,8,55,16],[55,17,55,25],[55,30,55,47],[60,1,60,7],[60,30,60,47],[61,1,61,7],[61,8,61,25],[61,30,61,47],[58,1,58,7],[58,8,58,16],[58,17,58,25],[58,30,58,47],[59,1,59,7],[59,8,59,16],[59,17,59,25],[59,30,59,47],[64,1,64,7],[64,8,64,16],[64,17,64,25],[64,30,64,47],[65,1,65,7],[65,8,65,16],[65,17,65,25],[65,30,65,47],[62,1,62,7],[62,8,62,24],[62,30,62,47],[63,1,63,7],[63,8,63,16],[63,17,63,25],[63,30,63,47],[68,8,68,16],[68,17,68,25],[68,30,68,47],[69,1,69,7],[69,9,69,10],[69,12,69,13],[69,14,69,15],[66,1,66,7],[66,8,66,15],[66,30,66,47],[67,1,67,7],[67,8,67,15],[67,30,67,47],[71,1,71,7],[71,9,71,10],[71,30,71,47],[72,8,72,16],[72,17,72,25],[72,30,72,47],[71,17,71,25],[69,30,69,47],[70,1,70,7],[70,9,70,10],[70,12,70,13],[70,14,70,15],[70,30,70,47],[75,1,75,7],[75,9,75,10],[75,30,75,47],[76,1,76,7],[76,8,76,16],[76,17,76,25],[76,30,76,47],[73,30,73,47],[74,1,74,7],[74,9,74,10],[74,12,74,13],[74,14,74,15],[74,30,74,47],[73,1,73,7],[73,9,73,10],[73,12,73,13],[73,14,73,15],[73,17,73,25],[74,17,74,25],[75,17,75,25],[79,1,79,7],[79,9,79,10],[79,30,79,47],[80,1,80,7],[80,8,80,16],[80,17,80,25],[80,30,80,47],[77,30,77,47],[78,1,78,7],[78,9,78,10],[78,12,78,13],[78,14,78,15],[78,30,78,47],[77,1,77,7],[77,9,77,10],[77,12,77,13],[77,14,77,15],[77,17,77,25],[78,17,78,25],[79,17,79,25],[83,1,83,7],[83,9,83,10],[83,30,83,47],[84,1,84,7],[84,8,84,16],[84,17,84,25],[84,30,84,47],[81,30,81,47],[82,1,82,7],[82,9,82,10],[82,12,82,13],[82,14,82,15],[82,30,82,47],[81,1,81,7],[81,9,81,10],[81,12,81,13],[81,14,81,15],[82,17,82,25],[83,17,83,25],[81,17,81,25],[87,1,87,7],[87,9,87,10],[87,30,87,47],[88,1,88,7],[88,8,88,16],[88,17,88,25],[88,30,88,47],[85,30,85,47],[86,1,86,7],[86,9,86,10],[86,12,86,13],[86,14,86,15],[86,30,86,47],[85,1,85,7],[85,9,85,10],[85,12,85,13],[85,14,85,15],[85,17,85,25],[86,17,86,25],[87,17,87,25],[89,30,89,47],[90,1,90,7],[90,9,90,10],[90,12,90,13],[90,14,90,15],[90,30,90,47],[89,1,89,7],[89,9,89,10],[89,12,89,13],[89,14,89,15],[90,17,90,25],[89,17,89,25],[93,1,93,4],[93,5,93,25],[93,30,93,47],[94,1,94,4],[94,5,94,25],[94,30,94,47],[91,1,91,7],[91,9,91,10],[91,30,91,47],[92,1,92,4],[92,5,92,25],[92,30,92,47],[91,17,91,25],[98,2,98,23],[98,24,98,25],[98,30,98,47],[99,2,99,23],[99,24,99,25],[99,30,99,47],[95,1,95,25],[95,30,95,47],[96,1,96,4],[96,6,96,25],[96,30,96,47],[97,1,97,25],[97,30,97,47],[103,3,103,23],[103,24,103,25],[103,30,103,47],[104,3,104,23],[104,24,104,25],[104,30,104,47],[100,2,100,23],[100,24,100,25],[100,30,100,47],[101,1,101,25],[101,30,101,47],[102,2,102,25],[102,30,102,47],[107,3,107,23],[107,24,107,25],[107,30,107,47],[108,2,108,25],[108,30,108,47],[109,3,109,23],[109,24,109,25],[109,30,109,47],[105,3,105,23],[105,24,105,25],[105,30,105,47],[106,3,106,23],[106,24,106,25],[106,30,106,47],[112,3,112,23],[112,24,112,25],[112,30,112,47],[113,1,113,4],[113,6,113,25],[113,30,113,47],[110,3,110,23],[110,24,110,25],[110,30,110,47],[111,3,111,23],[111,24,111,25],[111,30,111,47],[118,1,118,25],[118,30,119,47],[119,1,119,2],[119,3,119,25],[120,1,120,25],[120,30,120,47],[114,1,114,25],[114,30,116,47],[115,1,115,2],[115,3,115,25],[116,1,116,25],[117,1,117,25],[117,30,117,47],[125,3,125,10],[125,11,125,25],[126,1,126,25],[127,1,127,4],[127,6,127,25],[127,30,127,47],[121,1,121,25],[121,30,121,47],[122,1,122,12],[122,13,122,25],[122,30,122,47],[123,1,123,25],[123,30,126,47],[124,1,125,2],[124,3,124,10],[124,11,124,25],[128,1,128,25],[128,30,128,47],[129,0,133,0],[129,2,129,20],[129,21,129,22],[129,23,129,24],[129,30,129,47],[130,2,130,25],[130,30,130,47],[131,3,131,20],[133,3,133,20],[133,21,133,22],[133,23,133,24],[133,30,133,47],[134,1,134,25],[134,30,134,47],[131,21,131,22],[131,23,131,24],[131,30,131,47],[132,3,132,20],[132,21,132,22],[132,23,132,24],[132,30,132,47],[135,1,135,25],[135,30,135,47],[136,0,141,0],[136,1,139,1],[136,3,136,20],[136,21,136,22],[136,23,136,24],[136,30,136,47],[137,3,137,20],[137,21,137,22],[139,3,139,20],[139,21,139,22],[139,23,139,24],[139,30,139,47],[140,2,140,20],[140,21,140,22],[140,23,140,24],[140,30,140,47],[137,23,137,24],[137,30,137,47],[138,3,138,20],[138,21,138,22],[138,23,138,24],[138,30,138,47],[143,1,143,25],[143,30,143,47],[144,2,144,23],[144,24,144,25],[144,30,144,47],[145,2,145,23],[145,24,145,25],[145,30,145,47],[141,2,141,20],[141,21,141,22],[141,23,141,24],[141,30,141,47],[142,1,142,25],[142,30,142,47],[148,2,148,23],[148,24,148,25],[148,30,148,47],[149,2,149,23],[149,24,149,25],[149,30,149,47],[146,2,146,23],[146,24,146,25],[146,30,146,47],[147,2,147,23],[147,24,147,25],[147,30,147,47],[153,1,153,25],[153,30,153,47],[154,1,154,25],[154,30,156,47],[155,1,155,3],[155,4,155,25],[156,1,156,25],[150,1,150,4],[150,6,150,25],[150,30,150,47],[151,1,151,25],[151,30,151,47],[152,1,152,25],[152,30,152,47],[160,1,160,2],[160,3,160,25],[160,30,160,47],[161,1,161,25],[161,30,161,47],[162,1,162,25],[162,30,162,47],[157,1,157,25],[157,30,157,47],[158,2,158,25],[158,30,158,47],[159,1,159,25],[159,30,159,47],[166,1,166,2],[166,3,166,25],[166,30,166,47],[167,1,167,4],[167,6,167,25],[167,30,167,47],[163,1,163,2],[163,3,163,25],[163,30,163,47],[164,1,164,25],[164,30,164,47],[165,1,165,25],[165,30,165,47],[171,1,171,25],[171,30,171,47],[172,1,172,2],[172,3,172,25],[172,30,172,47],[173,1,173,25],[173,30,173,47],[168,1,168,25],[168,30,168,47],[169,1,169,2],[169,3,169,25],[169,30,169,47],[170,1,170,25],[170,30,170,47],[177,1,177,25],[177,30,177,47],[178,1,178,2],[178,3,178,25],[178,30,178,47],[179,1,179,4],[179,6,179,25],[179,30,179,47],[174,1,174,25],[174,30,174,47],[175,1,175,2],[175,3,175,25],[175,30,175,47],[176,1,176,25],[176,30,176,47],[183,1,183,25],[183,30,183,47],[184,1,184,2],[184,3,184,25],[184,30,184,47],[185,1,185,25],[180,1,180,25],[180,30,180,47],[181,1,181,2],[181,3,181,25],[181,30,181,47],[182,1,182,4],[182,6,182,25],[182,30,182,47],[186,1,186,25],[186,30,186,47],[187,1,187,7],[187,8,187,13],[187,14,187,18],[187,19,187,25],[187,30,189,47],[188,1,188,7],[188,8,188,13],[188,14,188,18],[190,30,190,47],[191,1,191,25],[191,30,191,47],[192,2,192,22],[192,23,192,25],[192,30,192,47],[188,19,188,25],[189,1,189,7],[189,8,189,13],[189,14,189,18],[189,19,189,25],[190,1,190,25],[197,2,197,22],[197,23,197,25],[197,30,197,47],[198,2,198,22],[198,23,198,25],[198,30,198,47],[193,2,193,22],[193,23,194,25],[193,30,193,47],[194,2,194,22],[194,30,194,47],[195,2,195,22],[195,23,196,25],[195,30,195,47],[196,2,196,22],[196,30,196,47],[201,2,201,22],[201,23,201,25],[201,30,201,47],[202,2,202,22],[202,23,202,25],[202,30,202,47],[199,2,199,22],[199,23,199,25],[199,30,199,47],[200,2,200,22],[200,23,200,25],[200,30,200,47],[206,1,206,25],[206,30,206,47],[207,0,207,25],[207,30,207,47],[208,1,208,25],[208,30,208,47],[203,2,203,22],[203,23,203,25],[203,30,203,47],[204,2,204,22],[204,23,205,25],[204,30,204,47],[205,2,205,22],[205,30,205,47],[212,2,212,13],[212,22,212,25],[212,30,212,47],[213,2,213,13],[213,22,213,25],[213,30,213,47],[209,1,209,25],[209,30,209,47],[210,1,210,25],[210,30,210,47],[211,1,211,25],[211,30,211,47],[219,1,219,25],[219,30,219,47],[220,0,220,22],[220,23,220,25],[220,30,220,47],[221,1,221,25],[221,30,221,47],[214,2,214,25],[215,1,215,25],[216,1,216,25],[216,30,216,47],[217,1,217,25],[218,0,218,22],[218,23,218,25],[218,30,218,47],[229,30,229,47],[222,0,222,22],[222,23,222,25],[222,30,222,47],[223,1,223,25],[223,30,223,47],[224,0,224,22],[224,23,224,25],[224,30,224,47],[233,0,233,25],[233,30,233,47],[234,0,234,25],[234,30,234,47],[60,8,60,16],[60,17,60,25],[66,17,66,25],[67,17,67,25],[69,17,69,25],[70,17,70,25],[230,1,230,25],[230,30,230,47],[231,0,231,22],[231,23,231,25],[231,30,231,47],[232,1,232,25],[232,30,232,47],[225,1,225,25],[225,30,228,47],[226,2,226,25],[227,2,227,25],[228,2,228,25],[229,0,229,22],[229,23,229,25]]}
["!"," UWAGA: ",null,null,null,null,null,null,null,null,null,null,null,null,null,null,null,null,null,null,null,null,null,null,null,null,null,null,null,null,"INSTRUKCJA WYPEŁNIANIA WNIOSKU",null,null,null,null,null,null,null,null,null,null,null,null,null,null,null,null,null,null,null,"OK"]
[null,"WNIOSEK NALEŻY ZŁOŻYĆ ZA PISMEM PRZEWODNIM.",null,null,null,null,null,null,null,null,null,null,null,null,null,null,null,null,null,null,null,null,null,null,null,null,null,null,null,null,"szare pola - NIE ZMIENIAJ",null,null,null,null,null,null,null,null,null,null,null,null,null,null,null,null,null,null,null,"Wprowadzono błędną daną - proszę wprowadzić poprawną daną wybierając ją z listy rozwijanej"]
[null,"PRZED WYPEŁNIENIEM WNIOSKU NALEŻY ZAPOZNAĆ SIĘ Z INSTRUKCJĄ "]
[null,"WYPEŁNIAJĄC WNIOSEK NALEŻY KIEROWAĆ SIĘ INSTRUKCJĄ POMOCNICZĄ I WSKAZÓWKAMI  - (pola po prawej stronie wniosku oraz żółte pola pojawiające się po zaznaczeniu komórki).",null,null,null,null,null,null,null,null,null,null,null,null,null,null,null,null,null,null,null,null,null,null,null,null,null,null,null,null,"żółte pola - WYBIERZ Z LISTY ROZWIJANEJ"]
[null,"PLIK ZOSTAŁ ZABEZPIECZONY PRZED EDYTOWANIEM. \nPROSZĘ NIE USUWAĆ ZABEZPIECZEŃ I SAMODZIELNIE NIE EDYTOWAĆ PLIKU.",null,null,null,null,null,null,null,null,null,null,null,null,null,null,null,null,null,null,null,null,null,null,null,null,null,null,null,null,"białe pola - WPISZ"]
["WNIOSEK O DOFINANSOWANIE W RAMACH RZĄDOWEGO FUNDUSZU ROZWOJU DRÓG",null,null,null,null,null,null,null,null,null,null,null,null,null,null,null,null,null,null,null,null,null,null,null,null,null,null,null,null,null,"czerwone pola - błąd lub brak danych"]
["REMONT"]
["PIECZĘĆ WPŁYWU DO URZĘDU WOJEWÓDZKIEGO",null,null,null,null,null,null,null,null,null,null,null,null,"NR EWIDENCYJNY \nWNIOSKU",null,null,null,null,null,null,null,null,null,null,null,null,"POLA POMOCNICZE - liczniki znaków użytych\nw komórkach",null,null,null,"PIECZĘĆ WPŁYWU DO URZĘDU WOJEWÓDZKIEGO oraz NR EWIDENCYJNY WNIOSKU uzupełniają pracownicy Świętokrzyskiego Urzędu Wojewódzkiego."]
[null,null,null,null,null,null,null,null,null,null,null,null,null,"/A /2026     "]
[null,null,null,null,null,null,null,null,null,null,null,null,null,"1. JEDNOSTKA SAMORZĄDU TERYTORIALNEGO",null,null,null,null,null,null,null,null,null,null,null,null,null,null,null,null,{"$f":"N10","v":"1. JEDNOSTKA SAMORZĄDU TERYTORIALNEGO"}]
[null,null,null,null,null,null,null,null,null,null,null,null,null,"JST  ",null,null,null,null,null,null,null,null,null,null,null,null,null,null,null,null,{"$f":"IF(Q11=\"\",\"Wybierz z listy rozwijanej jaka jednostka ubiega się o dofinansowanie (POWIAT / GMINA)\",IF(AND(Q11<>\"\",AZ11<>\"B\"),\"OK\",\"Błąd danej - wprowadź poprawną daną wybierając ją z listy rozwijanej\"))","v":"Wybierz z listy rozwijanej jaka jednostka ubiega się o dofinansowanie (POWIAT / GMINA)"},null,null,null,null,null,null,null,null,null,null,null,null,null,null,null,null,null,null,null,{"$f":"IF(Q11=\"\",\"W\",IF(AND(Q11<>\"\",AZ11<>\"B\"),\"OK\",IF(AZ11=\"B\",\"B\",\"\")))","v":"W"},{"$f":"IFERROR(IF(Q11=\"\",\"\",VLOOKUP(Q11,DANE!B8:B9,1,0)),\"B\")","v":""},{"$f":"IF(AND(Q11=\"\",OR(Q12<>\"\",Q13<>\"\")),\"b\",\"ok\")","v":"ok"}]
[null,null,null,null,null,null,null,null,null,null,null,null,null,"POWIAT  ",null,null,null,null,null,null,null,null,null,null,null,null,null,null,null,null,{"$f":"IF(AND(Q11=\"\",Q12=\"\"),\"\",IF(AND(Q11=\"POWIAT\",Q12=\"\"),\"Wybierz z listy rozwijanej powiat\",IF(AND(Q11=\"\",Q12<>\"\"),\"Wybierz z listy rozwijanej JST (pole powyżej)\",IF(AND(Q11=\"GMINA\",Q12=\"\"),\"Wybierz z listy rozwijanej powiat, w którym znajduje się gmina\",IF(AZ12=\"b\",\"Błąd danej - wprowadź poprawną daną wybierając ją z listy rozwijanej\",\"OK\")))))","v":""},null,null,null,null,null,null,null,null,null,null,null,null,null,null,null,null,null,null,null,{"$f":"IF(AND(Q11=\"\",Q12=\"\"),\"\",IF(AND(Q11=\"POWIAT\",Q12=\"\"),\"W\",IF(AND(Q11=\"\",Q12<>\"\"),\"W\",IF(AND(Q11=\"GMINA\",Q12=\"\"),\"W\",IF(AZ12=\"b\",\"B\",\"OK\")))))","v":""},{"$f":"IFERROR(IF(Q12=\"\",\"\",VLOOKUP(Q12,POWIAT[POWIAT],1,FALSE)),\"B\")","v":""}]
[null,null,null,null,null,null,null,null,null,null,null,null,null,{"$f":"IF(Q11=\"powiat\",\"\",\"GMINA  \")","v":"GMINA  "},null,null,null,null,null,null,null,null,null,null,null,null,null,null,null,null,{"$f":"IF(AND(Q11=\"POWIAT\",Q13=\"\"),\"\",IF(AND(Q11=\"POWIAT\",Q13<>\"\"),\"Błąd danej - błędnie wskazana JST lub błędnie wskazana GMINA\",IF(AND(Q11=\"GMINA\",Q12=\"\"),\"\",IF(AND(Q11=\"GMINA\",Q12<>\"\",Q13=\"\"),\"Wybierz z listy rozwijanej gminę\",IF(AND(Q11=\"\",Q12<>\"\",Q13<>\"\"),\"Wybierz z listy rozwijanej JST (dwa pola powyżej)\",IF(AND(Q11=\"\",Q12=\"\",Q13<>\"\"),\"Wybierz z listy rozwijanej JST (dwa pola powyżej) oraz POWIAT (pole powyżej)\",IF(AND(Q11=\"\",Q12=\"\",Q13=\"\"),\"\",IF(AND(Q11<>\"\",AY11=\"b\"),\"\",IF(AZ13=\"b\",\"Błąd danej - wybrana gmina nie znajduje się w powiecie wskazanym powyżej\",\"OK\")))))))))","v":""},null,null,null,null,null,null,null,null,null,null,null,null,null,null,null,null,null,null,null,{"$f":"IF(AND(Q11=\"POWIAT\",Q13=\"\"),\"\",IF(AND(Q11=\"POWIAT\",Q13<>\"\"),\"B\",IF(AND(Q11=\"GMINA\",Q12=\"\"),\"\",IF(AND(Q11=\"GMINA\",Q12<>\"\",Q13=\"\"),\"W\",IF(AND(Q11=\"\",Q12<>\"\",Q13<>\"\"),\"W\",IF(AND(Q11=\"\",Q12=\"\",Q13<>\"\"),\"W\",IF(AND(Q11=\"\",Q12=\"\",Q13=\"\"),\"\",IF(AND(Q11<>\"\",AY11=\"b\"),\"\",\"OK\"))))))))","v":""},{"$f":"IF(AND(Q11=\"powiat\",Q13<>\"\"),\"b\",IF(VLOOKUP(Q13,DANE!$E$59:$Q$159,13,0)<>Q12,\"b\",\"ok\"))","v":{"$error":"#N/A"}}]
[null,null,null,null,null,null,null,null,null,null,null,null,null,"NR TERC  ",null,null,{"$f":"IFERROR(IF(Q11=\"powiat\",VLOOKUP(Q12,DANE!$D$46:$H$58,4,0),IF(Q11=\"gmina\",VLOOKUP(Q13,DANE!$E$59:$H$159,3,0),\"\")),\"\")","v":""},null,null,null,null,null,{"$f":"IFERROR(IF(Q11=\"powiat\",VLOOKUP(Q12,DANE!$D$46:$H$58,5,0),IF(Q11=\"gmina\",VLOOKUP(Q13,DANE!$E$59:$H$159,4,0),\"\")),\"\")","v":""},null,null,null,null,"↓",null,null,{"$f":"IF(Q14=\"\",\"NR TERC ładuje się automatycznie po uzupełnieniu powyższych danych dotyczących jst\",IF(AND(Q11=\"POWIAT\",AZ14=4),\"OK - Załadowano NR TERC dla powiatu\",IF(AND(Q11=\"GMINA\",AZ14=7),\"OK - Załadowano NR TERC dla gminy\",IF(AND(Q11=\"POWIAT\",AZ14=7),\"Błąd danej - Załadowano NR TERC dla gminy, a w JST wybrano powiat\",IF(AND(Q11=\"GMINA\",AZ14=4),\"Błąd danej - Załadowano NR TERC dla powiatu, a w JST wybrano gminę\",\"\")))))","v":"NR TERC ładuje się automatycznie po uzupełnieniu powyższych danych dotyczących jst"},null,null,null,null,null,null,null,null,null,null,null,null,null,null,null,null,null,null,null,{"$f":"IF(Q14=\"\",\"W\",IF(AND(Q11=\"powiat\",AZ14=4),\"ok\",IF(AND(Q11=\"gmina\",AZ14=7),\"ok\",\"b\")))","v":"W"},{"$f":"LEN(Q14)","v":0}]
[null,null,null,null,null,null,null,null,null,null,null,null,null,"ADRES  ",null,null,null,null,null,null,null,null,null,null,null,null,{"$f":"LEN(Q15)","v":0},"z",120,null,{"$f":"IF(AA15=0,\"Wpisz adres jednostki samorządu terytorialnego ubiegającej się o dofinansowanie - [można użyć do 120 znaków]\",IF(AA15>120,\"błąd danej - Wprowadzono zbyt dużą ilość znków. Zmniejsz ilość wprowadzonych znaków\",\"Wprowadzono dane dotyczące adresu jednostki samorządu terytorialnego\"))","v":"Wpisz adres jednostki samorządu terytorialnego ubiegającej się o dofinansowanie - [można użyć do 120 znaków]"},null,null,null,null,null,null,null,null,null,null,null,null,null,null,null,null,null,null,null,{"$f":"IF(AA15=0,\"W\",IF(AA15>0,\"OK\",IF(AA15>120,\"b\",\"\")))","v":"W"}]
["2. ","TYTUŁ ZADANIA (nazwa zadania)",null,null,null,null,null,null,null,null,null,null,null,null,null,null,null,null,null,null,null,null,null,null,null,null,null,null,null,null,{"$f":"_xlfn.CONCAT(A16,B16)","v":"2. TYTUŁ ZADANIA (nazwa zadania)"}]
[null,null,null,null,null,null,null,null,null,null,null,null,null,null,null,null,null,null,null,null,null,null,null,null,null,null,{"$f":"LEN(A17)","v":0},"z",300,null,"Wpisz tytuł zadania (nazwę zadania) - [można użyć do 300 wszystkich znaków]\nWAŻNE:\nTytuł powinien identyfikować zadanie (rodzaj robót i ich lokalizację: nazwa ulicy, nr drogi i lokalizacja drogi) oraz sugerować klasyfikację środków (remont / budowa / rozbudowa / przebudowa)"]
["3. ","LOKALIZACJA ZADANIA (kategoria, numer i lokalizacja drogi, na której znajduje się realizowane zadanie)",null,null,null,null,null,null,null,null,null,null,null,null,null,null,null,null,null,null,null,null,null,null,null,null,null,null,null,null,{"$f":"_xlfn.CONCAT(A18,B18)","v":"3. LOKALIZACJA ZADANIA (kategoria, numer i lokalizacja drogi, na której znajduje się realizowane zadanie)"}]
["L.p.","KATEGORIA",null,null,"NR DROGI",null,null,"POWIAT ",null,null,null,"GMINA",null,null,null,null,null,null,"MIEJSCOWOŚĆ",null,null,null,null,null,null,null,null,null,null,null,"Wybierz z list rozwijanych: kategorię drogi, powiat i gminę"]
[1,null,null,null,null,null,null,{"$f":"Q12","v":0},null,null,null,{"$f":"Q13","v":0},null,null,null,null,null,null,null,null,null,null,null,null,null,null,null,null,null,null,"Wpisz nr drogi, na której znajduje się zgłoszone zadanie oraz miejscowość",null,null,null,null,null,null,null,null,null,null,null,null,null,null,null,null,null,null,null,{"$f":"IF(VLOOKUP(L20,DANE!$E$59:$Q$159,13,0)<>H20,\"b\",\"ok\")","v":{"$error":"#N/A"}}]
[null,null,null,null,null,null,null,null,null,null,null,null,null,null,null,null,null,null,null,null,null,null,null,null,null,null,{"$f":"LEN(A21)","v":0},"z",400,null,"(miejsce na dodatkowe informacje dotyczące rodzaju i lokalizacji zadania np., gdy droga biegnie przez więcej niż jedną gminę lub więcej niż jedną miejscowość)"]
["4. ","PRZEWIDYWANY OKRES REALIZACJI ZADANIA (rozpoczęcie i zakończenie realizacji zadania)",null,null,null,null,null,null,null,null,null,null,null,null,null,null,null,null,null,null,null,null,null,null,null,null,null,null,null,null,{"$f":"_xlfn.CONCAT(A22,B22)","v":"4. PRZEWIDYWANY OKRES REALIZACJI ZADANIA (rozpoczęcie i zakończenie realizacji zadania)"}]
["Zadanie ",null,null,{"$f":"IF(AND(R23=\"\",R24=\"\",W24=\"\"),\"\",IFERROR(IF(BA23=0,\"nie wybrano lub błędnie wybrano daty realizacji zadania\",IF(BA23<12,\"JEDNOROCZNE\",IF(BA23=12,\"zmień miesiąc, aby zadanie było jednoroczne lub wieloletnie\",\"WIELOLETNIE\"))),\"nie wybrano lub błędnie wybrano daty realizacji zadania\"))","v":""},null,null,null,null,null,null,null,null,"realizowane ",null,null,null,"od ",null,null,null,null,null,2026,null,null,null,null,null,null,null,"Wybierz z listy rozwijanej przewidywany miesiąc rozpoczęcia robót budowlanych",null,null,null,null,null,null,null,null,null,null,null,null,null,null,null,null,null,null,null,{"$f":"IF(R23=\"stycznia\",1,IF(R23=\"lutego\",2,IF(R23=\"marca\",3,IF(R23=\"kwietnia\",4,IF(R23=\"maja\",5,IF(R23=\"czerwca\",6,IF(R23=\"lipca\",7,IF(R23=\"sierpnia\",8,IF(R23=\"września\",9,IF(R23=\"października\",10,IF(R23=\"listopada\",11,IF(R23=\"grudnia\",12,\"\"))))))))))))","v":""},{"$f":"IF(AY23=\"\",\"\",DATE(W23,AY23,1))","v":""},{"$f":"IF(AY23=\"\",\"\",DATEDIF(AZ23,AZ24,\"m\"))","v":""}]
[null,null,null,null,null,null,null,null,null,null,null,null,null,null,null,null,"do ",null,null,null,null,null,null,null,null,null,null,null,null,null,"Wybierz z listy rozwijanej przewidywany miesiąc i rok zakończenia robót budowlanych",null,null,null,null,null,null,null,null,null,null,null,null,null,null,null,null,null,null,null,{"$f":"IF(R24=\"stycznia\",1,IF(R24=\"lutego\",2,IF(R24=\"marca\",3,IF(R24=\"kwietnia\",4,IF(R24=\"maja\",5,IF(R24=\"czerwca\",6,IF(R24=\"lipca\",7,IF(R24=\"sierpnia\",8,IF(R24=\"września\",9,IF(R24=\"października\",10,IF(R24=\"listopada\",11,IF(R24=\"grudnia\",12,\"\"))))))))))))","v":""},{"$f":"IF(AY24=\"\",\"\",DATE(W24,AY24,1))","v":""},{"$f":"IFERROR(IF(BA23=\"\",\"\",IF(BA23>0,\"OK\",\"B\")),\"B\")","v":""},{"$f":"IF(BA23=\"\",\"\",IF(AND(R24<>\"\",W24<>\"\",BA23=12),\"B\",\"OK\"))","v":""}]
["5. ","DŁUGOŚĆ ODCINKÓW DRÓG OBJĘTYCH ZADANIEM, WG RODZAJU ROBÓT BUDOWLANYCH [m]",null,null,null,null,null,null,null,null,null,null,null,null,null,null,null,null,null,null,null,null,null,null,null,null,null,null,null,null,{"$f":"_xlfn.CONCAT(A25,B25)","v":"5. DŁUGOŚĆ ODCINKÓW DRÓG OBJĘTYCH ZADANIEM, WG RODZAJU ROBÓT BUDOWLANYCH [m]"}]
[null,null,null,null,null,null,null,null,"REMONT",null,null,null,null,null,null,null,"ŁĄCZNIE",null,null,null,null,null,null,null,null,null,null,null,null,null,"Wpisz długość odcinka objętego danym rodzajem robót budowlanych (długość podaj w metrach z dokładnością do jednego metra)"]
[null,null,null,null,null,null,null,null,null,null,null,null,null,null,null,"m",{"$f":"IF(I27=\"\",\"\",I27)","v":""},null,null,null,null,null,null,null,null,"m",null,null,null,null,"Łączna długość załaduje się automatycznie. Powinna być taka sama jak realizowana długość odcinka w pkt 9",null,null,null,null,null,null,null,null,null,null,null,null,null,null,null,null,null,null,null,{"$f":"IF(I27=\"\",\"\",I26)","v":""}]
["6. ","PRZEWIDYWANY HARMONOGRAM RZECZOWO-FINANSOWY REALIZACJI ZADANIA (brutto)",null,null,null,null,null,null,null,null,null,null,null,null,null,null,null,null,null,null,null,null,null,null,null,null,null,null,null,null,{"$f":"_xlfn.CONCAT(A28,B28)","v":"6. PRZEWIDYWANY HARMONOGRAM RZECZOWO-FINANSOWY REALIZACJI ZADANIA (brutto)"}]
["Lp.","ELEMENTY I RODZAJE ROBÓT",null,null,null,null,null,null,null,null,"KOSZT KWALIFIKOWALNY [zł]",null,null,null,null,null,null,null,"KOSZT NIEKWALIFIKOWALNY [zł]"]
["1.","Roboty budowlane",null,null,null,null,null,null,null,null,null,null,null,null,null,null,null,null,null,null,null,null,null,null,null,null,null,null,null,null,"Wpisz koszt brutto robót budowlanych w podziale na wydatki kwalifikowalne i niekwalifikowalne"]
["2.","Nadzór inwestorski (wszystkie branże)",null,null,null,null,null,null,null,null,null,null,null,null,null,null,null,null,null,null,null,null,null,null,null,null,null,null,null,null,"Wpisz koszt brutto nadzoru inwestorskiego (wszystkie branże) w podziale na wydatki kwalifikowalne i niekwalifikowalne"]
["3.","Tablice informacyjne \n( na podst. art. 38 ust. 1, 1a ustawy o RFRD)",null,null,null,null,null,null,null,null,null,null,null,null,null,null,null,null,null,null,null,null,null,null,null,null,null,null,null,null,"Wpisz koszt brutto tablic informacyjnych w podziale na wydatki kwalifikowalne i niekwalifikowalne"]
["4.","Dodatkowy obowiązek informacyjny\n( na podst. art. 38 ust. 6 ustawy o RFRD)",null,null,null,null,null,null,null,null,null,null,null,null,null,null,null,null,null,null,null,null,null,null,null,null,null,null,null,null,"Wpisz koszt brutto dodatkowego obowiązku informacyjnego w podziale na wydatki kwalifikowalne i niekwalifikowalne \nKoszt kwalifikowalny dodatkowego obowiązku informacyjnego nie może być niższy niż 1 000,00 zł, ani wyższy niż 5 000,00 zł",null,null,null,null,null,null,null,null,null,null,null,null,null,null,null,null,null,null,null,{"$f":"IF(K33=\"\",\"\",IF(AND(1000<=K33,K33<=5000),\"OK\",\"B\"))","v":""}]
["SUMA ",null,null,null,null,null,null,null,null,null,{"$f":"SUM(K30:R33)","v":0},null,null,null,null,null,null,null,{"$f":"SUM(S30:Z33)","v":0},null,null,null,null,null,null,null,null,null,null,null,"SUMY OBLICZĄ SIĘ AUTOMATYCZNIE"]
["OGÓŁEM ",null,null,null,null,null,null,null,null,null,{"$f":"SUM(K34,S34)","v":0},null,null,null,null,null,null,null,null,null,null,null,null,null,null,null,null,null,null,null,"KWOTA OGÓŁEM OBLICZY SIĘ AUTOMATYCZNIE"]
["7. ","PRZEWIDYWANE KOSZTY REALIZACJI ZADANIA BRUTTO - WYDATKI KWALIFIKOWALNE [zł]",null,null,null,null,null,null,null,null,null,null,null,null,null,null,null,null,null,null,null,null,null,null,null,null,null,null,null,null,{"$f":"_xlfn.CONCAT(A36,B36)","v":"7. PRZEWIDYWANE KOSZTY REALIZACJI ZADANIA BRUTTO - WYDATKI KWALIFIKOWALNE [zł]"}]
["A.","ŁĄCZNY KOSZT REALIZACJI ZADANIA [zł]",null,null,null,null,null,null,null,null,null,null,null,null,null,null,null,null,null,null,{"$f":"K34","v":0},null,null,null,null,null,null,null,null,null,"Koszty i kwoty słownie załadują się automatycznie po poprawnym wypełnieniu pkt 6 wniosku",null,null,null,null,null,null,null,null,null,null,null,null,null,null,null,null,null,null,null,{"$f":"IF(K34=U37,\"ok\",\"b\")","v":"ok"},null,{"$f":"IF(U37<0,\"b\",\"OK\")","v":"OK"}]
[null,"SŁOWNIE :",null,null,{"$f":"IF(OR(U37=0,U37=\"\"),\"\",Slownie(U37))","v":""}]
["B.","KWOTA WNIOSKOWANEGO DOFINANSOWANIA [zł]",null,null,null,null,null,null,null,null,null,null,null,null,null,null,null,null,null,null,{"$f":"IF(OR(U37=\"\",U43=\"\"),\"\",IF(ROUNDDOWN(U37*U43,0)>30000000,AZ39,ROUNDDOWN((U37*U43),0)))","v":""},null,null,null,null,null,null,null,null,null,"Kwota dofinansowania nie może przekraczać 30 mln zł, jeśli przekracza, to wniosek ją automatycznie zmniejsza do kwoty maksymalnej",null,null,null,null,null,null,null,null,null,null,null,null,null,null,null,null,null,null,null,{"$f":"IF(U39>AZ39,\"b\",\"ok\")","v":"b"},30000000,{"$f":"IF(U39<0,\"b\",\"OK\")","v":"OK"}]
[null,"SŁOWNIE :",null,null,{"$f":"IF(OR(U39=0,U39=\"\"),\" \",Slownie(U39))","v":" "}]
["C.","KWOTA WKŁADU WŁASNEGO [zł]",null,null,null,null,null,null,null,null,null,null,null,null,null,null,null,null,null,null,{"$f":"IF(OR(U37=\"\",U43=\"\"),\"\",U37-U39)","v":""},null,null,null,null,null,null,null,null,null,null,null,null,null,null,null,null,null,null,null,null,null,null,null,null,null,null,null,null,null,null,null,{"$f":"IF(U41<0,\"b\",\"OK\")","v":"OK"}]
[null,"SŁOWNIE :",null,null,{"$f":"IF(OR(U41=0,U41=\"\"),\" \",Slownie(U41))","v":" "}]
["D.","UDZIAŁ DOFINANSOWANIA W KOSZTACH KWALIFIKOWALNYCH ZADANIA [%]",null,null,null,null,null,null,null,null,null,null,null,null,null,null,null,null,null,null,{"$f":"IF(Q14=\"\",\"\",IF(Q11=\"powiat\",VLOOKUP(Q14,DANE!$G$46:$O$58,9,0),VLOOKUP(Q14,DANE!$G$59:$O$159,9,0)))","v":""},null,null,null,null,null,null,null,null,null,"Poziom dofinansowania nie może przekraczać 80,00%. \nWprowadzono % dofinansowania z roku 2025, ale dana ta może ulec zmianie zgodnie z zatwierdzoną listą",null,null,null,null,null,null,null,null,null,null,null,null,null,null,null,null,null,null,null,null,{"$f":"U39/U37","v":{"$error":"#VALUE!"}},{"$f":"IF(U43<0,\"b\",\"OK\")","v":"OK"}]
["8. ","PRZEWIDYWANY TERMIN DOKONYWANIA WYPŁAT NA RZECZ WYKONAWCY ZADANIA",null,null,null,null,null,null,null,null,null,null,null,null,null,null,null,null,null,null,null,null,null,null,null,null,null,null,null,null,{"$f":"_xlfn.CONCAT(A44,B44)","v":"8. PRZEWIDYWANY TERMIN DOKONYWANIA WYPŁAT NA RZECZ WYKONAWCY ZADANIA"}]
["KWOTA DO WYPŁATY W DANYM ROKU NA RZECZ WYKONAWCY ZADANIA ",null,null,null,null,null,null,null,null,null,null,null,null,null,null,null,null,null,null,null,null,null,null,null,null,null,null,null,null,null,"Uzupełnij dane dotyczące dokonywania wypłat na rzecz wykonawcy zadania w podziale na poszczególne lata oraz na wydatki kwalifikowalne i niekwalifikowalne. Wydatki kwalifikowalne należy podać w podziale na dofinansowanie i wkład własny."]
["ROK",null,null,"KWALIFIKOWALNE",null,null,null,null,null,null,null,null,null,"NIEKWALIFIKOWALNE",null,null,null,null,null,null,"OGÓŁEM"]
[null,null,null,"DOFINANSOWANIE",null,null,null,null,"WKŁAD WŁASNY"]
[2026,null,null,null,null,null,null,null,null,null,null,null,null,null,null,null,null,null,null,null,{"$f":"IF(AND(D48=\"\",I48=\"\",N48=\"\"),\"\",SUM(D48:T48))","v":""},null,null,null,null,null,null,null,null,null,"Jeśli dane nie będą wprowadzone poprawnie, to kwoty sum i łącznie podświetlą się na czerwono. \nBędzie to miało miejsce w przypadku, gdy:\n - kwota dofinansowania (suma z wiersza 53), będzie się różnić od kwoty dofinansowania w pkt 7 lit. B (wiersz 39);\n - kwota wkładu własnego (suma z wiersza 53), będzie się różnić od kwoty wkładu własnego w pkt 7 lit. C (wiersz 41);\n - kwota środków kwalifikowalnych (łącznie z wiersza 54), będzie się różnić od kwoty łącznego kosztu realizacji zadania w pkt 7 lit. A (wiersz 37);\n - kwota środków niekwalifikowalnych (łącznie z wiersza 54), będzie się różnić od kwoty kosztów niekwalifikowalnych w pkt 6 (wiersz 34);\n - kwota środków ogółem (łącznie z wiersza 54), będzie się różnić od kwoty kosztów ogółem w pkt 6 (wiersz 35);\n\nNależy wtedy poprawić kwoty z wierszy 48-52 lub kwoty w pkt 6 wniosku (jeśli tam zostały wprowadzone błędnie)"]
[2027,null,null,null,null,null,null,null,null,null,null,null,null,null,null,null,null,null,null,null,{"$f":"IF(AND(D49=\"\",I49=\"\",N49=\"\"),\"\",SUM(D49:T49))","v":""}]
[2028,null,null,null,null,null,null,null,null,null,null,null,null,null,null,null,null,null,null,null,{"$f":"IF(AND(D50=\"\",I50=\"\",N50=\"\"),\"\",SUM(D50:T50))","v":""}]
[2029,null,null,null,null,null,null,null,null,null,null,null,null,null,null,null,null,null,null,null,{"$f":"IF(AND(D51=\"\",I51=\"\",N51=\"\"),\"\",SUM(D51:T51))","v":""}]
[2030,null,null,null,null,null,null,null,null,null,null,null,null,null,null,null,null,null,null,null,{"$f":"IF(AND(D52=\"\",I52=\"\",N52=\"\"),\"\",SUM(D52:T52))","v":""}]
["SUMA",null,null,{"$f":"SUM(D48:H52)","v":0},null,null,null,null,{"$f":"SUM(I48:M52)","v":0},null,null,null,null,null,null,null,null,null,null,null,null,null,null,null,null,null,null,null,null,null,null,null,null,null,null,null,null,null,null,null,null,null,null,null,null,null,null,null,null,null,{"$f":"IF(U39=\"\",\"ok\",IF(D53<>U39,\"błąd\",\"ok\"))","v":"ok"},{"$f":"IF(U41=\"\",\"ok\",IF(I53<>U41,\"błąd\",\"ok\"))","v":"ok"}]
["ŁĄCZNIE",null,null,{"$f":"D53+I53","v":0},null,null,null,null,null,null,null,null,null,{"$f":"SUM(N48:T52)","v":0},null,null,null,null,null,null,{"$f":"SUM(U48:Z52)","v":0},null,null,null,null,null,null,null,null,null,null,null,null,null,null,null,null,null,null,null,null,null,null,null,null,null,null,null,null,null,{"$f":"IF(U37=\"\",\"ok\",IF(D54<>U37,\"błąd\",\"ok\"))","v":"ok"},{"$f":"IF(N54<>S34,\"błąd\",\"ok\")","v":"ok"},{"$f":"IF(U54<>K35,\"błąd\",\"ok\")","v":"ok"}]
["9.\n ","OPIS ZADANIA OBEJMUJĄCY STAN ISTNIEJĄCY ORAZ PROJEKTOWANY WRAZ Z UZASADNIENIEM REALIZACJI ZADANIA",null,null,null,null,null,null,null,null,null,null,null,null,null,null,null,null,null,null,null,null,null,null,null,null,null,null,null,null,{"$f":"_xlfn.CONCAT(A55,B55)","v":"9.\n OPIS ZADANIA OBEJMUJĄCY STAN ISTNIEJĄCY ORAZ PROJEKTOWANY WRAZ Z UZASADNIENIEM REALIZACJI ZADANIA"}]
["PARAMETRY ODCINKA",null,null,null,null,null,null,null,"STAN ISTNIEJĄCY \n(stan pierwotny, który będzie odtwarzany)",null,null,null,null,null,null,null,null,null,null,null,null,null,null,null,null,null,null,null,null,null,"Parametry odcinka dotyczą stanu istniejącego, który będzie odtwarzany w wyniku remontu;\nWszystkie długości podaj z dokładnością do jednego metra."]
[null,"kategoria drogi ",null,null,null,null,null,null,{"$f":"IF(B20=\"\",\"\",B20)","v":""},null,null,null,null,null,null,null,null,null,null,null,null,null,null,null,null,null,null,null,null,null,"Kategoria drogi - komórka załaduje się automatycznie po wypełnieniu danych w pkt 3"]
[null,"numer drogi ",null,null,null,null,null,null,{"$f":"IF(E20=\"\",\"\",E20)","v":""},null,null,null,null,null,null,null,null,null,null,null,null,null,null,null,null,null,null,null,null,null,"Numer drogi - komórka załaduje się automatycznie po wypełnieniu danych w pkt 3; jeśli dane są niekompletne można je zmienić wpisując dane"]
[null,"klasa drogi ",null,null,null,null,null,null,null,null,null,null,null,null,null,null,null,null,null,null,null,null,null,null,null,null,null,null,null,null,"Klasa drogi - wybierz z listy rozwijanej, po wypełnieniu danych w pkt 3"]
[null,"rodzaj drogi ",null,null,null,null,null,null,null,null,null,null,null,null,null,null,null,null,null,null,null,null,null,null,null,null,null,null,null,null,"Rodzaj drogi - wybierz z listy rozwijanej"]
[null,"rodzaj robót budowlanych ",null,null,null,null,null,null,{"$f":"IF(I27=\"\",\"\",\"REMONT\")","v":""},null,null,null,null,null,null,null,null,null,null,null,null,null,null,null,null,null,null,null,null,null,"Rodzaj robót budowlanych - komórka załaduje się automatycznie; jeśli dana się nie załaduje wybierz daną z listy rozwijanej"]
[null,"realizowany kilometraż ",null,null,null,null,null,null,null,null,null,null,null,null,null,null,null,null,null,null,null,null,null,null,null,null,null,null,null,null,"Realizowany kilometraż - wpisz rzeczywisty kilometraż, w którym realizowane jest zadanie"]
[null,"realizowana długość odcinka ",null,null,null,null,null,null,{"$f":"Q27","v":""},null,null,null,null,null,null,null,null,null,null,null,null,null,null,null,null,"m",null,null,null,null,"Realizowana długość odcinka - komórka załaduje się automatycznie (lub wpisz realizowaną długość odcinka z dokładnością do jednego metra)"]
[null,"zgoda na odstępstwo od przepisów",null,null,null,null,null,null,"NIE DOTYCZY",null,null,null,null,null,null,null,null,null,null,null,null,null,null,null,null,null,null,null,null,null,"NIE DOTYCZY REMONTU"]
[null,"trudne warunki",null,null,null,null,null,null,"NIE DOTYCZY",null,null,null,null,null,null,null,null,null,null,null,null,null,null,null,null,null,null,null,null,null,"NIE DOTYCZY REMONTU"]
[null,"przekrój jezdni",null,null,null,null,null,null,null,null,null,null,null,null,null,null,null,null,null,null,null,null,null,null,null,null,null,null,null,null,"Wpisz przekrój remontowanej jezdni zgodnie z Rozporządzeniem  w sprawie przepisów techniczno-budowlanych dotyczących dróg "]
[null,"szerokość jezdni ",null,null,null,null,null,null,null,null,null,null,null,null,null,null,"m",null,null,null,null,null,null,null,null,null,null,null,null,null,"Wpisz szerokość remontowanej jezdni"]
[null,"szerokość pasa ruchu ",null,null,null,null,null,null,null,null,null,null,null,null,null,null,"m",null,null,null,null,null,null,null,null,null,null,null,null,null,"Wpisz szerokość pasa ruchu remontowanej jezdni"]
[null,null,null,null,null,null,null,"pobocza o nawierzchni gruntowej ",null,null,null,null,null,null,null,null,null,null,null,null,null,null,null,null,null,null,null,null,null,null,{"$f":"IF(AY69=\"b\",\"Sprawdź poprawność danych (lista rozwijana, długości, szerokości) dotyczących poboczy o nawierzchni gruntowej\",\"Wybierz z listy rozwijanej, czy odcinek posiada pobocza o nawierzchni gruntowej, które będą remontowane w ramach zadania.\")","v":"Wybierz z listy rozwijanej, czy odcinek posiada pobocza o nawierzchni gruntowej, które będą remontowane w ramach zadania."}]
[null,"strona prawa ",null,null,null,null,null,null,"dł.",null,null,"m","szer.",null,null,null,"m",null,null,null,null,null,null,null,null,null,null,null,null,null,{"$f":"IF(OR(I69=\"\",I69=\"nie\",I69=\"nie dotyczy\"),\"\",\"Wpisz długość i szerokość remontowanych poboczy gruntowych po stronie prawej\")","v":""}]
[null,"strona lewa ",null,null,null,null,null,null,"dł.",null,null,"m","szer.",null,null,null,"m",null,null,null,null,null,null,null,null,null,null,null,null,null,{"$f":"IF(OR(I69=\"\",I69=\"nie\",I69=\"nie dotyczy\"),\"\",\"Wpisz długość i szerokość remontowanych poboczy gruntowych po stronie lewej\")","v":""}]
[null,"łączna długość ",null,null,null,null,null,null,"dł.",{"$f":"IF(AND(J70=\"\",J71=\"\"),\"\",SUM(J70:K71))","v":""},null,"m",null,null,null,null,null,null,null,null,null,null,null,null,null,null,null,null,null,null,{"$f":"IF(I69=\"tak\",\"Łączna długość remontowanych poboczy gruntowych załaduje się automatycznie\",\"\")","v":""}]
[null,null,null,null,null,null,null,"pobocza o nawierzchni twardej ",null,null,null,null,null,null,null,null,null,null,null,null,null,null,null,null,null,null,null,null,null,null,{"$f":"IF(AY73=\"b\",\"Sprawdź poprawność danych (lista rozwijana, długości, szerokości) dotyczących poboczy o nawierzchni twardej\",\"Wybierz z listy rozwijanej, czy odcinek posiada pobocza o nawierzchni twardej, które będą remontowane w ramach zadania.\")","v":"Wybierz z listy rozwijanej, czy odcinek posiada pobocza o nawierzchni twardej, które będą remontowane w ramach zadania."}]
[null,"strona prawa ",null,null,null,null,null,null,"dł.",null,null,"m","szer.",null,null,null,"m",null,null,null,null,null,null,null,null,null,null,null,null,null,{"$f":"IF(OR(I73=\"\",I73=\"nie\",I73=\"nie dotyczy\"),\"\",\"Wpisz długość i szerokość remontowanych poboczy twardych po stronie prawej\")","v":""}]
[null,"strona lewa ",null,null,null,null,null,null,"dł.",null,null,"m","szer.",null,null,null,"m",null,null,null,null,null,null,null,null,null,null,null,null,null,{"$f":"IF(OR(I73=\"\",I73=\"nie\",I73=\"nie dotyczy\"),\"\",\"Wpisz długość i szerokość remontowanych poboczy twardych po stronie lewej\")","v":""}]
[null,"łączna długość ",null,null,null,null,null,null,"dł.",{"$f":"IF(AND(J74=\"\",J75=\"\"),\"\",SUM(J74:K75))","v":""},null,"m",null,null,null,null,null,null,null,null,null,null,null,null,null,null,null,null,null,null,{"$f":"IF(I73=\"tak\",\"Łączna długość remontowanych poboczy o nawierzchni twardej załaduje się automatycznie\",\"\")","v":""}]
[null,"droga dla pieszych ",null,null,null,null,null,null,null,null,null,null,null,null,null,null,null,null,null,null,null,null,null,null,null,null,null,null,null,null,{"$f":"IF(AY77=\"b\",\"Sprawdź poprawność danych (lista rozwijana, długości, szerokości) dotyczących drogi dla pieszych\",\"Wybierz z listy rozwijanej, czy odcinek posiada drogę dla pieszych, która będzie remontowana w ramach zadania.\")","v":"Wybierz z listy rozwijanej, czy odcinek posiada drogę dla pieszych, która będzie remontowana w ramach zadania."}]
[null,"strona prawa ",null,null,null,null,null,null,"dł.",null,null,"m","szer.",null,null,null,"m",null,null,null,null,null,null,null,null,null,null,null,null,null,{"$f":"IF(OR(I77=\"\",I77=\"nie\",I77=\"nie dotyczy\"),\"\",\"Wpisz długość i szerokość remontowanej drogi dla pieszych po stronie prawej\")","v":""}]
[null,"strona lewa ",null,null,null,null,null,null,"dł.",null,null,"m","szer.",null,null,null,"m",null,null,null,null,null,null,null,null,null,null,null,null,null,{"$f":"IF(OR(I77=\"\",I77=\"nie\",I77=\"nie dotyczy\"),\"\",\"Wpisz długość i szerokość remontowanej drogi dla pieszych po stronie lewej\")","v":""}]
[null,"łączna długość ",null,null,null,null,null,null,"dł.",{"$f":"IF(AND(J78=\"\",J79=\"\"),\"\",SUM(J78:K79))","v":""},null,"m",null,null,null,null,null,null,null,null,null,null,null,null,null,null,null,null,null,null,{"$f":"IF(I77=\"tak\",\"Łączna długość remontowanej drogi dla pieszych załaduje się automatycznie\",\"\")","v":""}]
[null,"droga dla pieszych i rowerów ",null,null,null,null,null,null,null,null,null,null,null,null,null,null,null,null,null,null,null,null,null,null,null,null,null,null,null,null,{"$f":"IF(AY81=\"b\",\"Sprawdź poprawność danych (lista rozwijana, długości, szerokości) dotyczących drogi dla pieszych i rowerów\",\"Wybierz z listy rozwijanej, czy odcinek posiada drogę dla pieszych i rowerów, która będzie remontowana w ramach zadania.\")","v":"Wybierz z listy rozwijanej, czy odcinek posiada drogę dla pieszych i rowerów, która będzie remontowana w ramach zadania."}]
[null,"strona prawa ",null,null,null,null,null,null,"dł.",null,null,"m","szer.",null,null,null,"m",null,null,null,null,null,null,null,null,null,null,null,null,null,{"$f":"IF(OR(I81=\"\",I81=\"nie\",I81=\"nie dotyczy\"),\"\",\"Wpisz długość i szerokość remontowanej drogi dla pieszych i rowerów po stronie prawej\")","v":""}]
[null,"strona lewa ",null,null,null,null,null,null,"dł.",null,null,"m","szer.",null,null,null,"m",null,null,null,null,null,null,null,null,null,null,null,null,null,{"$f":"IF(OR(I81=\"\",I81=\"nie\",I81=\"nie dotyczy\"),\"\",\"Wpisz długość i szerokość remontowanej drogi dla pieszych i rowerów po stronie lewej\")","v":""}]
[null,"łączna długość ",null,null,null,null,null,null,"dł.",{"$f":"IF(AND(J82=\"\",J83=\"\"),\"\",SUM(J82:K83))","v":""},null,"m",null,null,null,null,null,null,null,null,null,null,null,null,null,null,null,null,null,null,{"$f":"IF(I81=\"tak\",\"Łączna długość remontowanej drogi dla pieszych i rowerów załaduje się automatycznie\",\"\")","v":""}]
[null,"droga dla rowerów ",null,null,null,null,null,null,null,null,null,null,null,null,null,null,null,null,null,null,null,null,null,null,null,null,null,null,null,null,{"$f":"IF(AY85=\"b\",\"Sprawdź poprawność danych (lista rozwijana, długości, szerokości) dotyczących drogi dla rowerów\",\"Wybierz z listy rozwijanej, czy odcinek posiada drogę dla rowerów, która będzie remontowana w ramach zadania.\")","v":"Wybierz z listy rozwijanej, czy odcinek posiada drogę dla rowerów, która będzie remontowana w ramach zadania."}]
[null,"strona prawa ",null,null,null,null,null,null,"dł.",null,null,"m","szer.",null,null,null,"m",null,null,null,null,null,null,null,null,null,null,null,null,null,{"$f":"IF(OR(I85=\"\",I85=\"nie\",I85=\"nie dotyczy\"),\"\",\"Wpisz długość i szerokość remontowanej drogi dla rowerów po stronie prawej\")","v":""}]
[null,"strona lewa ",null,null,null,null,null,null,"dł.",null,null,"m","szer.",null,null,null,"m",null,null,null,null,null,null,null,null,null,null,null,null,null,{"$f":"IF(OR(I85=\"\",I85=\"nie\",I85=\"nie dotyczy\"),\"\",\"Wpisz długość i szerokość remontowanej drogi dla rowerów po stronie lewej\")","v":""}]
[null,"łączna długość ",null,null,null,null,null,null,"dł.",{"$f":"IF(AND(J86=\"\",J87=\"\"),\"\",SUM(J86:K87))","v":""},null,"m",null,null,null,null,null,null,null,null,null,null,null,null,null,null,null,null,null,null,{"$f":"IF(I85=\"tak\",\"Łączna długość remontowanej drogi dla rowerów załaduje się automatycznie\",\"\")","v":""}]
[null,"pas ruchu dla rowerów ",null,null,null,null,null,null,null,null,null,null,null,null,null,null,null,null,null,null,null,null,null,null,null,null,null,null,null,null,{"$f":"IF(AY89=\"b\",\"Sprawdź poprawność danych (lista rozwijana, długości, szerokości) dotyczących pasa ruchu dla rowerów\",\"Wybierz z listy rozwijanej, czy odcinek posiada pas ruchu dla rowerów, który będzie remontowany w ramach zadania.\")","v":"Wybierz z listy rozwijanej, czy odcinek posiada pas ruchu dla rowerów, który będzie remontowany w ramach zadania."}]
[null,"strona prawa ",null,null,null,null,null,null,"dł.",null,null,"m","szer.",null,null,null,"m",null,null,null,null,null,null,null,null,null,null,null,null,null,{"$f":"IF(OR(I89=\"\",I89=\"nie\",I89=\"nie dotyczy\"),\"\",\"Wpisz długość i szerokość remontowanego pasa ruchu dla rowerów po stronie prawej\")","v":""}]
[null,"strona lewa ",null,null,null,null,null,null,"dł.",null,null,"m","szer.",null,null,null,"m",null,null,null,null,null,null,null,null,null,null,null,null,null,{"$f":"IF(OR(I89=\"\",I89=\"nie\",I89=\"nie dotyczy\"),\"\",\"Wpisz długość i szerokość remontowanego pasa ruchu dla rowerów po stronie lewej\")","v":""}]
[null,"łączna długość ",null,null,null,null,null,null,"dł.",{"$f":"IF(AND(J90=\"\",J91=\"\"),\"\",SUM(J90:K91))","v":""},null,"m",null,null,null,null,null,null,null,null,null,null,null,null,null,null,null,null,null,null,{"$f":"IF(I89=\"tak\",\"Łączna długość remontowanego pasa ruchu dla rowerów załaduje się automatycznie\",\"\")","v":""}]
[null,"stan istniejący",null,null,null,null,null,null,null,null,null,null,null,null,null,null,null,null,null,null,null,null,null,null,null,null,{"$f":"LEN(F93)","v":0},"z",1200,null,"Opisz stan istniejący odcinka, czyli stan w jakim znajdują się elementy drogi.\nMożna użyć do 1200 wszystkich znaków."]
[null,"stan projektowany",null,null,null,null,null,null,null,null,null,null,null,null,null,null,null,null,null,null,null,null,null,null,null,null,{"$f":"LEN(F94)","v":0},"z",1200,null,"Opisz stan jaki ma zostać osiągnięty w wyniku realizacji zadania.\nMożna użyć do 1200 wszystkich znaków."]
[null,"uzasadnienie",null,null,null,null,null,null,null,null,null,null,null,null,null,null,null,null,null,null,null,null,null,null,null,null,{"$f":"LEN(F95)","v":0},"z",1200,null,"Uzasadnij realizację zadania.\nMożna użyć do 1200 wszystkich znaków."]
["10. ","CHARAKTERYSTYKA ZADANIA WEDŁUG KRYTERIÓW OCENY MERYTORYCZNEJ",null,null,null,null,null,null,null,null,null,null,null,null,null,null,null,null,null,null,null,null,null,null,null,null,null,null,null,null,{"$f":"_xlfn.CONCAT(A96,B96)","v":"10. CHARAKTERYSTYKA ZADANIA WEDŁUG KRYTERIÓW OCENY MERYTORYCZNEJ"}]
[null,"Kryterium nr 1",null,null,null,"-","Poprawa stanu bezpieczeństwa ruchu drogowego, ze szczególnym uwzględnieniem bezpieczeństwa ruchu drogowego niechronionych uczestników ruchu",null,null,null,null,null,null,null,null,null,null,null,null,null,null,null,null,null,null,null,null,null,null,null,{"$f":"_xlfn.CONCAT(A97,B97,\" \",F97,\" \",G97)","v":"Kryterium nr 1 - Poprawa stanu bezpieczeństwa ruchu drogowego, ze szczególnym uwzględnieniem bezpieczeństwa ruchu drogowego niechronionych uczestników ruchu"}]
["A. \n","Ryzyko wypadków.\nOdcinek drogi przebiega przez gminę/powiat o dużym poziomie ryzyka społecznego pod względem:",null,null,null,null,null,null,null,null,null,null,null,null,null,null,null,null,null,null,null,null,null,null,null,null,null,null,null,null,"Dane (lit. A ppkt 1-3) ładują się automatycznie po poprawnym uzupełnieniu pkt 1 oraz pkt 3 wniosku"]
[null,"1)","wypadków drogowych z udziałem pieszych ",null,null,null,null,null,null,null,null,null,null,null,null,null,null,null,null,null,null,null,null,null,{"$f":"IF($Q$11=\"\",\"\",IF($Q$11=\"powiat\",VLOOKUP($Q$12,DANE!$D$46:$K$58,6,0),VLOOKUP($Q$13,DANE!$E$59:$K$159,5,0)))","v":""}]
[null,"2)","wypadków drogowych ogółem",null,null,null,null,null,null,null,null,null,null,null,null,null,null,null,null,null,null,null,null,null,{"$f":"IF($Q$11=\"\",\"\",IF($Q$11=\"powiat\",VLOOKUP($Q$12,DANE!$D$46:$K$58,7,0),VLOOKUP($Q$13,DANE!$E$59:$K$159,6,0)))","v":""}]
[null,"3)","ofiar śmiertelnych w wypadkach drogowych",null,null,null,null,null,null,null,null,null,null,null,null,null,null,null,null,null,null,null,null,null,{"$f":"IF($Q$11=\"\",\"\",IF($Q$11=\"powiat\",VLOOKUP($Q$12,DANE!$D$46:$K$58,8,0),VLOOKUP($Q$13,DANE!$E$59:$K$159,7,0)))","v":""}]
["B. \n\n","Bezpieczeństwo uczestników ruchu drogowego. \nRealizacja rozwiązań zwiększających bezpieczeństwo uczestników ruchu drogowego \n(poprzez remont):",null,null,null,null,null,null,null,null,null,null,null,null,null,null,null,null,null,null,null,null,null,null,null,null,null,null,null,null,"Wybierz z list rozwijanych \"TAK/NIE\", czy w ramach zadania będą realizowane rozwiązania zwiększające bezpieczeństwo uczestników ruchu drogowego (w pkt 1 lit. a-e oraz pkt 2 lit. a-d)"]
[null,"1)","przejścia dla pieszych lub/i przejazdu dla rowerów o podwyższonym standardzie bezpieczeństwa:"]
[null,null,"a)","z oświetleniem lub/i doświetleniem"]
[null,null,"b)","z wyspą dzielącą (tzw. azylem)"]
[null,null,"c)","wyniesionego przejścia dla pieszych lub/i przejazdu dla rowerów"]
[null,null,"d)","z sygnalizacją świetlną"]
[null,null,"e)","z oznakowaniem aktywnym lub sygnalizacją ostrzegawczą"]
[null,"2)\n","innego rozwiązania w zakresie bezpieczeństwa nie związanego z przejściem dla pieszych lub/i przejazdem dla rowerów:"]
[null,null,"a)","wyniesionego skrzyżowania"]
[null,null,"b)","wyspy dzielącej na jezdni wraz z odgięciem toru jazdy na wjeździe do miejscowości"]
[null,null,"c)","radaru ze znakiem/tablicą zmiennej treści (aktywną), informującym o prędkości ruchu pojazdu"]
[null,null,"d)","oznakowania aktywnego na dojeździe do przejazdu kolejowo-drogowego"]
[null,"Kryterium nr 2",null,null,null,"-","Zapewnienie spójności sieci dróg publicznych ",null,null,null,null,null,null,null,null,null,null,null,null,null,null,null,null,null,null,null,null,null,null,null,{"$f":"_xlfn.CONCAT(A114,B114,\" \",F114,\" \",G114)","v":"Kryterium nr 2 - Zapewnienie spójności sieci dróg publicznych "}]
["A.\n ","Połączenie z innymi drogami publicznymi. \nBezpośrednie połączenie odcinka drogi z inną drogą publiczną wyższego rzędu",null,null,null,null,null,null,null,null,null,null,null,null,null,null,null,null,null,null,null,null,null,null,null,null,null,null,null,null,"Wybierz z listy rozwijanej, czy odcinek drogi ma bezpośrednie połączenie z drogą wyższego rzędu.\nJeśli TAK podaj numer drogi wyższego rzędu stosując oznaczenia: DK – droga krajowa, DW – droga wojewódzka, DP – droga powiatowa, DG – droga gminna. Numer należy podać w formacie np. DP-1234T (można użyć do 100 wszystkich znaków). Zaznacz to połączenie na załączonej mapie poglądowej."]
[null,null,null,null,null,null,null,null,null,null,null,null,null,null,null,null,null,null,null,null,null,null,null,null,null,null,{"$f":"LEN(D116)","v":0},"z",100]
[null,"jeżeli wybrano odpowiedź TAK, należy wskazać to połączenie na załączonej mapie poglądowej"]
["B.\n\n ","Kontynuacja zadania. \nKontynuacja robót budowlanych* realizowanych na podstawie umowy dofinansowania w ramach RFRD oraz zakończonych w ciągu 3 lat przed datą złożenia wniosku o dofinansowanie"]
[null,"*kontynuacja robót budowlanych oznacza, że wcześniejsze roboty budowlane realizowane były na odcinku drogi bezpośrednio połączonym z odcinkiem drogi objętym wnioskowanym zadaniem ",null,null,null,null,null,null,null,null,null,null,null,null,null,null,null,null,null,null,null,null,null,null,null,null,null,null,null,null,"Wybierz z listy rozwijanej, czy odcinek stanowi kontynuację robót budowlanych (budowy, przebudowy lub remontu) w ramach wcześniej zawartych umów o dofinansowanie ze środków RFRD i zakończonych w ciągu 3 lat przed datą złożenia wniosku o dofinansowanie.\nJeśli TAK wpisz numer umowy z wojewodą i datę jej zawarcia (np. 175/RFRD/A/2023 z dnia 30.04.2023) (można użyć do 100 znaków) oraz zaznacz to połącznie na załączonej mapie poglądowej."]
[null,null,null,null,null,null,null,null,null,null,null,null,null,null,null,null,null,null,null,null,null,null,null,null,null,null,{"$f":"LEN(D120)","v":0},"z",100]
[null,"jeżeli wybrano odpowiedź TAK, należy wskazać to połączenie na załączonej mapie poglądowej"]
["C. \n\n","Peryferyjność. \nOdcinek drogi biegnie przez gminę, dla której wskaźnik peryferyjności czasowej jest mniejszy niż 30 min., mieści się w przedziale od 30 do 50 minut, jest większy niż 50 min.",null,null,null,null,null,null,null,null,null,null,null,null,null,null,null,null,null,null,null,null,null,null,null,null,null,null,null,null,"Dana ładuje się automatycznie, po poprawnym wypełnieniu pkt 3 wniosku"]
[null,"wskaźnik peryferyjności czasowej:",null,null,null,null,null,null,null,null,null,null,null,{"$f":"IF(OR(L20=\"\",L20=0),\"\",VLOOKUP(L20,DANE!E46:M159,9,0))","v":""}]
["D.\n\n\n ","Uszkodzenie w wyniku niekorzystnych zjawisk atmosferycznych. \nOdcinek drogi został uszkodzony w wyniku działania niekorzystnych zjawisk atmosferycznych w ciągu \n3 lat przed datą złożenia wniosku o dofinansowanie i jest ujęty w protokole strat potwierdzonym przez Wojewodę Świętokrzyskiego",null,null,null,null,null,null,null,null,null,null,null,null,null,null,null,null,null,null,null,null,null,null,null,null,null,null,null,null,"Wybierz z listy rozwijanej, czy odcinek drogi został uszkodzony w wyniku działania niekorzystnych zjawisk atmosferycznych w ciągu 3 lat przed datą złożenia wniosku o dofinansowanie i jest ujęty w protokole strat potwierdzonym przez Wojewodę Świętokrzyskiego.\n\nJeśli TAK, to wpisz rodzaj klęski i jej datę (można użyć do 70 wszystkich znaków) oraz numer i datę protokołu strat potwierdzonego przez Wojewodę Świętokrzyskiego (można  użyć do 70 wszystkich znaków).\n\nZałącz kopię protokołu do wniosku. \nZaznacz uszkodzony fragment na mapie poglądowej."]
[null,null,null,"rodzaj i data zjawiska",null,null,null,null,null,null,null,null,null,null,null,null,null,null,null,null,null,null,null,null,null,null,{"$f":"LEN(L125)","v":0},"z",70]
[null,null,null,"protokół strat potwierdzony przez Wojewodę Świętokrzyskiego",null,null,null,null,null,null,null,null,null,null,null,null,null,null,null,null,null,null,null,null,null,null,{"$f":"LEN(L126)","v":0},"z",70]
[null,"jeżeli wybrano odpowiedź TAK, należy załączyć do wniosku kopię protokołu strat potwierdzonego przez Wojewodę Świętokrzyskiego oraz zaznaczyć uszkodzony odcinek na mapie poglądowej"]
[null,"Kryterium nr 3\n",null,null,null,"-","Podnoszenie standardów technicznych dróg powiatowych i dróg gminnych, \nw szczególności dostosowanie ich do ruchu pojazdów o dopuszczalnym nacisku pojedynczej osi napędowej do 11,5 t, oraz zachowanie jednorodności sieci dróg powiatowych i dróg gminnych pod względem spełniania tych standardów ",null,null,null,null,null,null,null,null,null,null,null,null,null,null,null,null,null,null,null,null,null,null,null,{"$f":"_xlfn.CONCAT(A128,B128,\" \",F128,\" \",G128)","v":"Kryterium nr 3\n - Podnoszenie standardów technicznych dróg powiatowych i dróg gminnych, \nw szczególności dostosowanie ich do ruchu pojazdów o dopuszczalnym nacisku pojedynczej osi napędowej do 11,5 t, oraz zachowanie jednorodności sieci dróg powiatowych i dróg gminnych pod względem spełniania tych standardów "}]
["A.\n","Skrzyżowania. \nRemont skrzyżowań:",null,null,null,null,null,null,null,null,null,null,null,null,null,null,null,null,null,null,null,null,null,null,null,null,null,null,null,null,"Wybierz z list rozwijanych, czy w ramach zadania będzie realizowany remont podanych rodzajów skrzyżowań (lit. A, pkt 1-2).\nJeśli TAK, to podaj ich ilości w sztukach oraz zaznacz te skrzyżowania na załączonej mapie poglądowej."]
[null,"1)","zwykłych z drogami publicznymi",null,null,null,null,null,null,null,null,null,null,null,null,null,null,null,null,null,null,null,null,null,null,"szt.",null,null,null,null,{"$f":"IF(AND(AY130=\"b\",V130=\"tak\"),\"Błąd - wybrano TAK i nie podano ilości sztuk\",IF(AND(AY130=\"b\",OR(V130=\"nie\",V130=\"\")),\"Błąd - wybrano NIE i podano ilość sztuk (pozostawienie pustego pola wyboru jest jednoznaczne z wybraniem NIE)\",\"\"))","v":""},null,null,null,null,null,null,null,null,null,null,null,null,null,null,null,null,null,null,null,{"$f":"IF(AND(V130=\"\",X130=\"\"),\"ok\",IF(AND(V130=\"tak\",X130>0),\"ok\",IF(AND(V130=\"nie\",X130=0),\"ok\",IF(AND(V130=\"nie\",X130>\"\"),\"ok\",IF(AND(V130=\"\",X130=0),\"ok\",\"b\")))))","v":"ok"}]
[null,"2)","innych:"]
[null,null,"•","skanalizowanych",null,null,null,null,null,null,null,null,null,null,null,null,null,null,null,null,null,null,null,null,null,"szt.",null,null,null,null,{"$f":"IF(AND(AY132=\"b\",V132=\"tak\"),\"Błąd - wybrano TAK i nie podano ilości sztuk\",IF(AND(AY132=\"b\",OR(V132=\"nie\",V132=\"\")),\"Błąd - wybrano NIE i podano ilość sztuk (pozostawienie pustego pola wyboru jest jednoznaczne z wybraniem NIE)\",\"\"))","v":""},null,null,null,null,null,null,null,null,null,null,null,null,null,null,null,null,null,null,null,{"$f":"IF(AND(V132=\"\",X132=\"\"),\"ok\",IF(AND(V132=\"tak\",X132>0),\"ok\",IF(AND(V132=\"nie\",X132=0),\"ok\",IF(AND(V132=\"nie\",X132>\"\"),\"ok\",IF(AND(V132=\"\",X132=0),\"ok\",\"b\")))))","v":"ok"}]
[null,null,"•","w formie ronda",null,null,null,null,null,null,null,null,null,null,null,null,null,null,null,null,null,null,null,null,null,"szt.",null,null,null,null,{"$f":"IF(AND(AY133=\"b\",V133=\"tak\"),\"Błąd - wybrano TAK i nie podano ilości sztuk\",IF(AND(AY133=\"b\",OR(V133=\"nie\",V133=\"\")),\"Błąd - wybrano NIE i podano ilość sztuk (pozostawienie pustego pola wyboru jest jednoznaczne z wybraniem NIE)\",\"\"))","v":""},null,null,null,null,null,null,null,null,null,null,null,null,null,null,null,null,null,null,null,{"$f":"IF(AND(V133=\"\",X133=\"\"),\"ok\",IF(AND(V133=\"tak\",X133>0),\"ok\",IF(AND(V133=\"nie\",X133=0),\"ok\",IF(AND(V133=\"nie\",X133>\"\"),\"ok\",IF(AND(V133=\"\",X133=0),\"ok\",\"b\")))))","v":"ok"}]
[null,null,"•","innych podnoszących poziom bezpieczeństwa np. z sygnalizacją świetlną ",null,null,null,null,null,null,null,null,null,null,null,null,null,null,null,null,null,null,null,null,null,"szt.",null,null,null,null,{"$f":"IF(AND(AY134=\"b\",V134=\"tak\"),\"Błąd - wybrano TAK i nie podano ilości sztuk\",IF(AND(AY134=\"b\",OR(V134=\"nie\",V134=\"\")),\"Błąd - wybrano NIE i podano ilość sztuk (pozostawienie pustego pola wyboru jest jednoznaczne z wybraniem NIE)\",\"\"))","v":""},null,null,null,null,null,null,null,null,null,null,null,null,null,null,null,null,null,null,null,{"$f":"IF(AND(V134=\"\",X134=\"\"),\"ok\",IF(AND(V134=\"tak\",X134>0),\"ok\",IF(AND(V134=\"nie\",X134=0),\"ok\",IF(AND(V134=\"nie\",X134>\"\"),\"ok\",IF(AND(V134=\"\",X134=0),\"ok\",\"b\")))))","v":"ok"}]
[null,"jeśli wybrano odpowiedź TAK, należy wskazać to skrzyżowanie na załączonej mapie poglądowej"]
["B.\n","Drogowe obiekty inżynierskie. \nRemont drogowych obiektów inżynierskich:",null,null,null,null,null,null,null,null,null,null,null,null,null,null,null,null,null,null,null,null,null,null,null,null,null,null,null,null,"Wybierz z list rozwijanych, czy w ramach zadania będzie realizowany remont podanych obiektów inżynierskich (lit. B pkt 1-3).\nJeśli TAK, to podaj ich ilości w sztukach oraz zaznacz te obiekty na załączonej mapie poglądowej."]
[null,"1)\n\n\n","•","mostów",null,null,null,null,null,null,null,null,null,null,null,null,null,null,null,null,null,null,null,null,null,"szt.",null,null,null,null,{"$f":"IF(AND(AY137=\"b\",V137=\"tak\"),\"Błąd - wybrano TAK i nie podano ilości sztuk\",IF(AND(AY137=\"b\",OR(V137=\"nie\",V137=\"\")),\"Błąd - wybrano NIE i podano ilość sztuk (pozostawienie pustego pola wyboru jest jednoznaczne z wybraniem NIE)\",\"\"))","v":""},null,null,null,null,null,null,null,null,null,null,null,null,null,null,null,null,null,null,null,{"$f":"IF(AND(V137=\"\",X137=\"\"),\"ok\",IF(AND(V137=\"tak\",X137>0),\"ok\",IF(AND(V137=\"nie\",X137=0),\"ok\",IF(AND(V137=\"nie\",X137>\"\"),\"ok\",IF(AND(V137=\"\",X137=0),\"ok\",\"b\")))))","v":"ok"}]
[null,null,"•","wiaduktów",null,null,null,null,null,null,null,null,null,null,null,null,null,null,null,null,null,null,null,null,null,"szt.",null,null,null,null,"",null,null,null,null,null,null,null,null,null,null,null,null,null,null,null,null,null,null,null,{"$f":"IF(AND(V138=\"\",X138=\"\"),\"ok\",IF(AND(V138=\"tak\",X138>0),\"ok\",IF(AND(V138=\"nie\",X138=0),\"ok\",IF(AND(V138=\"nie\",X138>\"\"),\"ok\",IF(AND(V138=\"\",X138=0),\"ok\",\"b\")))))","v":"ok"}]
[null,null,"•","estakad",null,null,null,null,null,null,null,null,null,null,null,null,null,null,null,null,null,null,null,null,null,"szt.",null,null,null,null,"",null,null,null,null,null,null,null,null,null,null,null,null,null,null,null,null,null,null,null,"ok"]
[null,null,"•","kładek dla pieszych",null,null,null,null,null,null,null,null,null,null,null,null,null,null,null,null,null,null,null,null,null,"szt.",null,null,null,null,"",null,null,null,null,null,null,null,null,null,null,null,null,null,null,null,null,null,null,null,"ok"]
[null,"2)","przepustów pod koroną drogi",null,null,null,null,null,null,null,null,null,null,null,null,null,null,null,null,null,null,null,null,null,null,"szt.",null,null,null,null,"",null,null,null,null,null,null,null,null,null,null,null,null,null,null,null,null,null,null,null,"ok"]
[null,"3)","konstrukcji oporowej",null,null,null,null,null,null,null,null,null,null,null,null,null,null,null,null,null,null,null,null,null,null,"szt.",null,null,null,null,"",null,null,null,null,null,null,null,null,null,null,null,null,null,null,null,null,null,null,null,"ok"]
[null,"jeśli wybrano odpowiedź TAK, należy wskazać ten obiekt na załączonej mapie poglądowej"]
["C.\n","Inne. \nRemont elementów w ramach wnioskowanego zadania:",null,null,null,null,null,null,null,null,null,null,null,null,null,null,null,null,null,null,null,null,null,null,null,null,null,null,null,null,"Wybierz z list rozwijanych, czy w ramach zadania będzie realizowany remont podanych elementów (lit. C pkt 1-4)."]
[null,"1)","drogi dla pieszych lub rowerów ",null,null,null,null,null,null,null,null,null,null,null,null,null,null,null,null,null,null,null,null,null,null,null,null,null,null,null,{"$f":"IF(Y145=\"\",\"Wybierz z listy rozwijanej, czy w ramach zadania będzie realizowana droga dla pieszych lub droga dla rowerów\", IF(AND(OR(I77=\"tak\",I85=\"tak\"),Y145<>\"tak\"),\"BŁĄD - w pkt 9 wybrano TAK; należy wybrać TAK lub zmienić odpowiedź w pkt 9 wniosku (droga dla pieszych lub droga dla rowerów)\",IF(AND(OR(I77<>\"tak\",I85<>\"tak\"),Y145=\"tak\"),\"BŁĄD - w pkt 9 wybrano NIE (pozostawienie komórki pustej jest jednoznaczne z wybraniem NIE); należy wybrać NIE lub zmienić odpowiedź w pkt 9 wniosku (droga dla pieszych lub droga rowerów)\",\"OK\")))","v":"Wybierz z listy rozwijanej, czy w ramach zadania będzie realizowana droga dla pieszych lub droga dla rowerów"},null,null,null,null,null,null,null,null,null,null,null,null,null,null,null,null,null,null,null,{"$f":"IF(Y145=\"\",\"w\",IF(AND(OR(I77=\"tak\",I85=\"tak\"),Y145<>\"tak\"),\"b\",IF(AND(OR(I77<>\"tak\",I85<>\"tak\"),Y145=\"tak\"),\"b\",\"OK\")))","v":"w"}]
[null,"2)","drogi dla pieszych i rowerów (ciągu pieszo-rowerowego) ",null,null,null,null,null,null,null,null,null,null,null,null,null,null,null,null,null,null,null,null,null,null,null,null,null,null,null,{"$f":"IF(Y146=\"\",\"Wybierz z listy rozwijanej, czy w ramach zadania będzie realizowana droga dla pieszych i rowerów\", IF(AND(I81=\"tak\",Y146<>\"tak\"),\"BŁĄD - w pkt 9 wybrano TAK; należy wybrać TAK lub zmienić odpowiedź w pkt 9 wniosku (droga dla pieszych i rowerów)\",IF(AND(I81<>\"tak\",Y146=\"tak\"),\"BŁĄD - w pkt 9 wybrano NIE (pozostawienie komórki pustej jest jednoznaczne z wybraniem NIE); należy wybrać NIE lub zmienić odpowiedź w pkt 9 wniosku (droga dla pieszych i rowerów)\",\"OK\")))","v":"Wybierz z listy rozwijanej, czy w ramach zadania będzie realizowana droga dla pieszych i rowerów"},null,null,null,null,null,null,null,null,null,null,null,null,null,null,null,null,null,null,null,{"$f":"IF(Y146=\"\",\"w\",IF(AND(I81=\"tak\",Y146<>\"tak\"),\"b\",IF(AND(I81<>\"tak\",Y146=\"tak\"),\"b\",\"OK\")))","v":"w"}]
[null,"3)","oświetlenia ulicznego "]
[null,"4)","odwodnienia drogi (kanału deszczowego, rowu) "]
[null,"5)","przebudowy drogi wewnętrznej i zaliczenie jej do kategorii dróg ",null,null,null,null,null,null,null,null,null,null,null,null,null,null,null,null,null,null,null,null,null,"NIE",null,null,null,null,null,"NIE DOTYCZY REMONTU",null,null,null,null,null,null,null,null,null,null,null,null,null,null,null,null,null,null,null,{"$f":"IF(Y149=\"nie\",\"OK\",\"B\")","v":"OK"}]
[null,"6)","dostosowania drogi do ruchu pojazdów o dopuszczalnym nacisku pojedynczej osi napędowej do 11,5 t ",null,null,null,null,null,null,null,null,null,null,null,null,null,null,null,null,null,null,null,null,null,"NIE",null,null,null,null,null,"NIE DOTYCZY REMONTU",null,null,null,null,null,null,null,null,null,null,null,null,null,null,null,null,null,null,null,{"$f":"IF(Y150=\"nie\",\"OK\",\"B\")","v":"OK"}]
[null,"Kryterium nr 4",null,null,null,"-","Zwiększenie dostępności transportowej jednostek administracyjnych",null,null,null,null,null,null,null,null,null,null,null,null,null,null,null,null,null,null,null,null,null,null,null,{"$f":"_xlfn.CONCAT(A151,B151,\" \",F151,\" \",G151)","v":"Kryterium nr 4 - Zwiększenie dostępności transportowej jednostek administracyjnych"}]
["A.\n\n","Obszar wiejski. \nOdcinek drogi przebiega w całości lub w części na obszarze wiejskim (wykracza poza granice administracyjne miasta)",null,null,null,null,null,null,null,null,null,null,null,null,null,null,null,null,null,null,null,null,null,null,null,null,null,null,null,null,"Wybierz z listy rozwijanej , czy odcinek drogi przebiega w całości lub w części na obszarze wiejskim (wykracza poza granice administracyjne miasta)."]
[]
["B.\n\n\n","Utrata funkcji społeczno-gospodarczych. \nOdcinek drogi przebiega w całości lub w części w granicach administracyjnych miast ujętych w pakiecie dla średnich miast uznanych za zagrożone utratą funkcji społeczno-gospodarczych (na podstawie Analizy Instytutu Geografii i Przestrzennego Zagospodarowania PAN)"]
[null,null,null,null,null,null,null,null,null,null,null,null,null,null,null,null,null,null,null,null,null,null,null,null,null,null,null,null,null,null,"Wybierz z listy rozwijanej, czy odcinek przebiega w granicach administracyjnych jednego z miast ujętych w Pakiecie dla średnich miast uznanych za zagrożone utratą funkcji społeczno-gospodarczych. \nJeśli TAK, to wybierz z listy rozwijanej miasto, przez które przebiega odcinek."]
[null,{"$f":"IFERROR(IF(FIND(\"TAK\",B155)=1,\"miasto\",\"\"),\"\")","v":""}]
[null,"średnie miasta uznane za zagrożone utratą funkcji społeczno-gospodarczych w województwie świętokrzyskim – \nBusko-Zdrój, Jędrzejów,  Końskie, Ostrowiec Świętokrzyski, Sandomierz, Skarżysko-Kamienna, Starachowice, Staszów."]
["C.\n","Instytucje publiczne i miejsca zgromadzeń. \nOdcinek drogi zapewnia bezpośredni dojazd* do:"]
[null,"• \n\n• ","miejsc zgromadzeń ludności (np.: cmentarz, boisko, amfiteatr, obiekty zabytkowe, sakralne, turystyczne, itp.)\ninstytucji publicznych lub świadczących usługi publiczne (np.: urząd gminy, szkoła, ośrodek zdrowia, ośrodek pomocy społecznej, remiza OSP, świetlica wiejska, żłobek, przedszkole, klub seniora. itp.)"]
[null," *bezpośredni dojazd - położenie do 200 m od odcinka drogi"]
[null,null,null,null,null,null,null,null,null,null,null,null,null,null,null,null,null,null,null,null,null,null,null,null,null,null,{"$f":"LEN(D161)","v":0},"z",500,null,"Wybierz z listy rozwijanej, czy odcinek drogi zapewnia bezpośredni dojazd (do 200 m od odcinka) do miejsc zgromadzeń ludności, instytucji publicznych lub świadczących usługi publiczne.\nJeśli TAK, to wymień do jakich miejsc zgromadzeń ludności, instytucji publicznych lub świadczących usługi publiczne odcinek zapewnia bezpośredni dojazd  (można użyć do 500 wszystkich znaków) oraz zaznacz te miejsca na załączonej mapie poglądowej mapie poglądowej."]
[null,"jeżeli wybrano odpowiedź TAK, należy wskazać te miejsca i instytucje na załączonej mapie poglądowej"]
["D.\n\n\n","Transport publiczny. \nNa odcinku drogi przebiega linia autobusowa objęta wsparciem z Funduszu Rozwoju Przewozów Autobusowych, realizowane są usługi transportu publicznego, uchwalono planowany przebieg linii użyteczności publicznej"]
[null,null,null,null,null,null,null,null,null,null,null,null,null,null,null,null,null,null,null,null,null,null,null,null,null,null,{"$f":"LEN(D164)","v":0},"z",300,null,"Wybierz z listy rozwijanej, czy na odcinku drogi przebiega linia autobusowa objęta wsparciem z Funduszu Rozwoju Przewozów Autobusowych, realizowane są usługi transportu publicznego, uchwalono planowany przebieg linii użyteczności publicznej.\nJeśli TAK, to wpisz nr umowy z wojewodą i datę jej zawarcia oraz nr linii autobusowej lub usługi transportu publicznego lub numer i datę uchwały o planowanym przebiegu linii użyteczności publicznej (można użyć do 300 wszystkich znaków), zaznacz przebieg linii na załączonej mapie poglądowej oraz załącz do wniosku kopię odpowiedniego dokumentu."]
[null,"jeżeli wybrano odpowiedź TAK, należy załączyć do wniosku kopię odpowiedniego dokumentu oraz zaznaczyć przebieg linii na załączonej mapie poglądowej."]
["E.\n","Dostępność komunikacyjna. \nWpływ odcinka drogi na dostępność komunikacyjną obszaru, na którym znajduje się ta droga "]
[null,null,null,null,null,null,null,null,null,null,null,null,null,null,null,null,null,null,null,null,null,null,null,null,null,null,{"$f":"LEN(D167)","v":0},"z",500,null,"Wybierz z listy rozwijanej, czy odcinek drogi wpływa na dostępność komunikacyjną obszaru, na którym znajduje się ta droga.\nJeśli TAK, to opisz wpływ odcinka drogi na dostępność komunikacyjną obszaru, na którym znajduje się ta droga (można użyć do 500 wszystkich znaków)."]
[null,"Kryterium nr 5",null,null,null,"-","Poprawa dostępności terenów inwestycyjnych i gospodarczych",null,null,null,null,null,null,null,null,null,null,null,null,null,null,null,null,null,null,null,null,null,null,null,{"$f":"_xlfn.CONCAT(A168,B168,\" \",F168,\" \",G168)","v":"Kryterium nr 5 - Poprawa dostępności terenów inwestycyjnych i gospodarczych"}]
["A.\n\n\n","Lokalne ośrodki gospodarcze. \nOdcinek drogi zapewnia bezpośredni dojazd* do lokalnych ośrodków gospodarczych np. do strefy ekonomicznej, podmiotów gospodarczych, lokalnego targowiska \n*bezpośredni dojazd - położenie do 200 m od odcinka drogi"]
[null,null,null,null,null,null,null,null,null,null,null,null,null,null,null,null,null,null,null,null,null,null,null,null,null,null,{"$f":"LEN(D170)","v":0},"z",400,null,"Wybierz z listy rozwijanej , czy odcinek drogi zapewnia bezpośredni dojazd (do 200 m od odcinka) do lokalnych ośrodków gospodarczych np. do strefy ekonomicznej, podmiotów gospodarczych, lokalnego targowiska.\nJeśli TAK, to wymień do jakich lokalnych ośrodków gospodarczych odcinek stanowi bezpośredni dojazd (można użyć do 400 wszystkich znaków) oraz zaznacz te ośrodki na załączonej mapie poglądowej."]
[null,"jeżeli wybrano odpowiedź TAK, należy wskazać te ośrodki gospodarcze na załączonej mapie poglądowej"]
["B.\n\n\n\n","Tereny inwestycyjne. \nOdcinek drogi zapewnia bezpośredni dojazd* do terenów inwestycyjnych, rozumianych jako tereny przeznaczone pod działalność gospodarczą w studium uwarunkowań przestrzennych, miejscowym planie zagospodarowania, warunkach zabudowy lub decyzji lokalizacyjnej celu publicznego \n*bezpośredni dojazd - położenie do 200 m od odcinka drogi"]
[null,null,null,null,null,null,null,null,null,null,null,null,null,null,null,null,null,null,null,null,null,null,null,null,null,null,{"$f":"LEN(D173)","v":0},"z",400,null,"Wybierz z listy rozwijanej, czy odcinek drogi zapewnia bezpośredni dojazd (do 200 m od odcinka) do terenów inwestycyjnych, rozumianych jako tereny przeznaczone pod działalność gospodarczą w studium uwarunkowań przestrzennych, miejscowym planie zagospodarowania, warunkach zabudowy lub decyzji lokalizacyjnej celu publicznego.\nJeśli TAK, to wymień do jakich terenów inwestycyjnych odcinek stanowi bezpośredni dojazd (można użyć do 400 wszystkich znaków) oraz zaznacz te tereny na załączonej mapie poglądowej."]
[null,"jeżeli wybrano odpowiedź TAK, należy wskazać te tereny inwestycyjne na załączonej mapie poglądowej"]
["C.\n\n\n\n","Tereny rolne. \nOdcinek drogi zapewnia bezpośredni dojazd* do terenów, na których prowadzona jest produkcja rolna, sadownictwo, ogrodnictwo lub/i zlokalizowane są gospodarstwa agroturystyczne ważne ze względu na specyfikę obszaru \n*bezpośredni dojazd - położenie do 200 m od odcinka drogi"]
[null,null,null,null,null,null,null,null,null,null,null,null,null,null,null,null,null,null,null,null,null,null,null,null,null,null,{"$f":"LEN(D176)","v":0},"z",400,null,"Wybierz z listy rozwijanej, czy odcinek drogi zapewnia bezpośredni dojazd (do 200 m od odcinka) do terenów, na których prowadzona jest produkcja rolna, sadownictwo, ogrodnictwo lub/i zlokalizowane są gospodarstwa agroturystyczne ważne ze względu na specyfikę obszaru.\nJeśli TAK, to wymień do jakich terenów rolnych odcinek stanowi bezpośredni dojazd (można użyć do 400 wszystkich znaków) oraz zaznacz te tereny na załączonej mapie poglądowej."]
[null,"jeżeli wybrano odpowiedź TAK, należy wskazać te tereny rolne na załączonej mapie poglądowej"]
["D.\n","Rozwój społeczno-gospodarczy. \nStrategiczne znaczenia odcinka drogi dla rozwoju społeczno-gospodarczego województwa"]
[null,null,null,null,null,null,null,null,null,null,null,null,null,null,null,null,null,null,null,null,null,null,null,null,null,null,{"$f":"LEN(D179)","v":0},"z",500,null,"Wybierz z listy rozwijanej, czy odcinek drogi ma strategiczne znaczenie dla rozwoju społeczno-gospodarczego województwa.\nJeśli TAK, to opisz przewidywane znaczenie wnioskowanego odcinka drogi dla rozwoju społeczno-gospodarczego województwa (można użyć do 500 wszystkich znaków)."]
[null,"Kryterium nr 6",null,null,null,"-","Zwiększenie liczby obwodnic w ciągu dróg powiatowych i dróg gminnych",null,null,null,null,null,null,null,null,null,null,null,null,null,null,null,null,null,null,null,null,null,null,null,{"$f":"_xlfn.CONCAT(A180,B180,\" \",F180,\" \",G180)","v":"Kryterium nr 6 - Zwiększenie liczby obwodnic w ciągu dróg powiatowych i dróg gminnych"}]
[null,"Zwiększenie liczby obwodnic. \nOdcinek drogi przyczynia się do zwiększenia liczby dróg spełniających funkcję obwodnicy, która w rozumieniu art. 2 ust.1 pkt 2a ustawy o RFRD oznacza drogę omijającą miejscowość lub teren zwartej zabudowy miejscowości, planowaną do realizacji w większości w nowym przebiegu i mającą na celu wyprowadzenie części ruchu pojazdów z tej miejscowości"]
[null,"NIE",null,"NIE DOTYCZY",null,null,null,null,null,null,null,null,null,null,null,null,null,null,null,null,null,null,null,null,null,null,null,null,null,null,"NIE DOTYCZY REMONTU"]
[null,"Kryterium nr 7",null,null,null,"-","Poprawa dostępności terenów objętych przedsięwzięciami lub inwestycjami powiązanymi z przedsięwzięciem infrastrukturalnym",null,null,null,null,null,null,null,null,null,null,null,null,null,null,null,null,null,null,null,null,null,null,null,{"$f":"_xlfn.CONCAT(A183,B183,\" \",F183,\" \",G183)","v":"Kryterium nr 7 - Poprawa dostępności terenów objętych przedsięwzięciami lub inwestycjami powiązanymi z przedsięwzięciem infrastrukturalnym"}]
[null,"Tereny powiązane z przedsięwzięciem infrastrukturalnym. \nOdcinek drogi przyczynia się do poprawy dostępności terenów objętych przedsięwzięciami lub inwestycjami powiązanymi z przedsięwzięciem infrastrukturalnym, o których mowa w art. 5c ust. 1 ustawy z dnia 8 grudnia 2006 r. o finansowym wsparciu niektórych przedsięwzięć mieszkaniowych (Dz. U. z 2024 r. poz. 304)"]
[null,null,null,null,null,null,null,null,null,null,null,null,null,null,null,null,null,null,null,null,null,null,null,null,null,null,{"$f":"LEN(D185)","v":0},"z",500,null,"Wybierz z listy rozwijanej, czy odcinek drogi przyczynia się do poprawy dostępności terenów objętych przedsięwzięciami lub inwestycjami powiązanymi z przedsięwzięciem infrastrukturalnym.\nJeśli TAK wymień te tereny i krótko opisz (można użyć do 500 wszystkich znaków)."]
[null,"jeżeli wybrano odpowiedź TAK, należy wskazać te tereny na załączonej mapie poglądowej"]
["11. ","OSOBY UPOWAŻNIONE DO UDZIELANIA WYJAŚNIEŃ KOMISJI",null,null,null,null,null,null,null,null,null,null,null,null,null,null,null,null,null,null,null,null,null,null,null,null,null,null,null,null,{"$f":"_xlfn.CONCAT(A187,B187)","v":"11. OSOBY UPOWAŻNIONE DO UDZIELANIA WYJAŚNIEŃ KOMISJI"}]
["Lp.","imię i nazwisko",null,null,null,null,null,null,"stanowisko służbowe",null,null,null,null,null,"nr telefonu",null,null,null,null,"e-mail",null,null,null,null,null,null,null,null,null,null,"Wskaż osobę/osoby do kontaktu przez podanie następujących danych:\n - imię i nazwisko, \n - zajmowane stanowisko służbowe, \n - nr telefonu (ze wskazaniem nr wewnętrznego - jeśli dotyczy), \n - adres e-mail."]
[1]
[2]
["12. ","ZŁĄCZNIKI",null,null,null,null,null,null,null,null,null,null,null,null,null,null,null,null,null,null,null,null,null,null,null,null,null,null,null,null,{"$f":"_xlfn.CONCAT(A191,B191)","v":"12. ZŁĄCZNIKI"}]
[null,"Do wniosku dołączone zostały załączniki:   ",null,null,null,null,null,null,null,null,null,null,null,null,null,null,null,null,null,null,null,null,null,null,null,null,null,null,null,null,"Wybierz z list rozwijanych, które z wymienionych załączników zostały dołączone do wniosku."]
[null,"a)","kopia prawomocnej* decyzji o pozwoleniu na budowę - dotyczy robót realizowanych na podstawie pozwolenia na budowę (nie dotyczy),\n*w przypadku nadania decyzji rygoru natychmiastowej wykonalności prawomocność nie jest wymagana",null,null,null,null,null,null,null,null,null,null,null,null,null,null,null,null,null,null,null,null,"NIE DOTYCZY",null,null,null,null,null,null,"NIE DOTYCZY REMONTU"]
[null,null,"lub",null,null,null,null,null,null,null,null,null,null,null,null,null,null,null,null,null,null,null,null,"NIE DOTYCZY"]
[null,null,"kopia prawomocnej* decyzji o zezwoleniu na realizację inwestycji drogowej (ZRID)- dotyczy robót realizowanych na podstawie ZRID (nie dotyczy), \n*w przypadku nadania decyzji rygoru natychmiastowej wykonalności prawomocność nie jest wymagana",null,null,null,null,null,null,null,null,null,null,null,null,null,null,null,null,null,null,null,null,null,null,null,null,null,null,null,"NIE DOTYCZY REMONTU"]
[null,null,"lub"]
[null,null,"kopia zgłoszenia robót budowlanych z poświadczeniem o braku podstaw do wniesienia sprzeciwu na zgłoszenie wykonania robót budowlanych potwierdzonym:\n      - zaświadczeniem organu administracji architektoniczno-budowlanej \n        lub \n      - pieczęcią organu administracji architektoniczno-budowlanej \ndotyczy robót realizowanych na podstawie zgłoszenia (obligatoryjnie).",null,null,null,null,null,null,null,null,null,null,null,null,null,null,null,null,null,null,null,null,null,null,null,null,null,null,null,{"$f":"IF(X196=\"\",\"Wybierz z listy rozwijanej, czy załączono kopię zgłoszenia robót budowlanych z poświadczeniem o braku podstaw do wniesienia sprzeciwu na zgłoszenie wykonania robót budowlanych.\"&\"\nZałącznik jest OBLIGATORYJNY.\nPozostawienie komórki pustej jest jednoznaczne z wybraniem NIE.\",IF(OR(X196=\"\",X196=\"nie\",X196=\"nie dotyczy\"),\"BŁĄD - kopia zgłoszenia robót budowlanych z poświadczeniem o braku podstaw do wniesienia sprzeciwu na zgłoszenie wykonania robót budowlanych jest załącznikiem OBLIGATORYJNYM\",\"OK - wnioskodawca oświadczył, że załączył do wniosku kopię zgłoszenia robót budowlanych z poświadczeniem o braku podstaw do wniesienia sprzeciwu na zgłoszenie wykonania robót budowlanych\"))","v":"Wybierz z listy rozwijanej, czy załączono kopię zgłoszenia robót budowlanych z poświadczeniem o braku podstaw do wniesienia sprzeciwu na zgłoszenie wykonania robót budowlanych.\nZałącznik jest OBLIGATORYJNY.\nPozostawienie komórki pustej jest jednoznaczne z wybraniem NIE."},null,null,null,null,null,null,null,null,null,null,null,null,null,null,null,null,null,null,null,{"$f":"IF(X196=\"tak\",\"OK\",\"B\")","v":"B"},{"$f":"IF(OR(X196=\"nie\",X196=\"nie dotyczy\"),\"B\",\"OK\")","v":"OK"}]
[null,"b)","zgodna ze stanem faktycznym, czytelna mapa poglądowa zawierająca: \n   - naniesioną skalę, \n   - zaznaczone miejsce/odcinek realizacji wnioskowanego zadania, \n   - obszar obrazujący odległość 200 m od odcinka drogi objętego zadaniem, \n   - zaznaczone elementy mające wpływ na ocenę merytoryczną wniosku - \n     dotyczy kryterium: nr 2 lit. A, B, D; nr 3 lit. A, B; nr 4 lit. C, D; nr 5 lit. A, B, C; nr 7\n(obligatoryjnie).",null,null,null,null,null,null,null,null,null,null,null,null,null,null,null,null,null,null,null,null,null,null,null,null,null,null,null,{"$f":"IF(X198=\"\",\"Wybierz z listy rozwijanej, czy załączono mapę poglądową.\nZałącznik jest OBLIGATORYJNY.\nPozostawienie komórki pustej jest jednoznaczne z wybraniem NIE.\",IF(OR(X198=\"\",X198=\"nie\",X198=\"nie dotyczy\"),\"BŁĄD - mapa poglądowa jest załącznikiem OBLIGATORYJNYM\",\"OK - wnioskodawca oświadczył, że załączył do wniosku mapę poglądową\"))","v":"Wybierz z listy rozwijanej, czy załączono mapę poglądową.\nZałącznik jest OBLIGATORYJNY.\nPozostawienie komórki pustej jest jednoznaczne z wybraniem NIE."},null,null,null,null,null,null,null,null,null,null,null,null,null,null,null,null,null,null,null,{"$f":"IF(X198=\"tak\",\"OK\",\"B\")","v":"B"},{"$f":"IF(OR(X198=\"nie\",X198=\"nie dotyczy\"),\"B\",\"OK\")","v":"OK"}]
[null,"c)","rysunki  z charakterystycznymi przekrojami poprzecznymi pasa drogowego w liniach rozgraniczających ze zwymiarowanymi elementami drogi – szerokość jezdni, pasa ruchu drogowego, pobocza, drogi dla pieszych, itp. (nie dotyczy).",null,null,null,null,null,null,null,null,null,null,null,null,null,null,null,null,null,null,null,null,"NIE DOTYCZY",null,null,null,null,null,null,"NIE DOTYCZY REMONTU"]
[null,"d)","kopia kosztorysu inwestorskiego (obligatoryjnie).",null,null,null,null,null,null,null,null,null,null,null,null,null,null,null,null,null,null,null,null,null,null,null,null,null,null,null,{"$f":"IF(X200=\"\",\"Wybierz z listy rozwijanej, czy załączono kopię aktualnego kosztorysu inwestorskiego (sporządzonego nie wcześniej niż 6 miesięcy przed złożeniem wniosku).\"&\" Załącznik jest OBLIGATORYJNY. Pozostawienie komórki pustej jest jednoznaczne z wybraniem NIE.\",IF(OR(X200=\"\",X200=\"nie\",X200=\"nie dotyczy\"),\"BŁĄD - kopia aktualnego kosztorysu inwestorskiego jest załącznikiem OBLIGATORYJNYM\",\"OK - wnioskodawca oświadczył, że załączył do wniosku kopię aktualnego kosztorysu inwestorskiego\"))","v":"Wybierz z listy rozwijanej, czy załączono kopię aktualnego kosztorysu inwestorskiego (sporządzonego nie wcześniej niż 6 miesięcy przed złożeniem wniosku). Załącznik jest OBLIGATORYJNY. Pozostawienie komórki pustej jest jednoznaczne z wybraniem NIE."},null,null,null,null,null,null,null,null,null,null,null,null,null,null,null,null,null,null,null,{"$f":"IF(X200=\"tak\",\"OK\",\"B\")","v":"B"},{"$f":"IF(OR(X200=\"nie\",X200=\"nie dotyczy\"),\"B\",\"OK\")","v":"OK"}]
[null,"e)","kopia zgody na odstępstwo od przepisów techniczno-budowlanych (nie dotyczy).",null,null,null,null,null,null,null,null,null,null,null,null,null,null,null,null,null,null,null,null,"NIE DOTYCZY",null,null,null,null,null,null,"NIE DOTYCZY REMONTU"]
[null,"f)","kopia protokołu strat potwierdzonego przez Wojewodę Świętokrzyskiego - dotyczy kryterium nr 2 lit. D (jeśli dotyczy).",null,null,null,null,null,null,null,null,null,null,null,null,null,null,null,null,null,null,null,null,null,null,null,null,null,null,null,{"$f":"IF(X202=\"\",\"Wybierz z listy rozwijanej, czy załączono kopię protokołu strat potwierdzonego przez Wojewodę Świętokrzyskiego\"&\" - jeśli dotyczy, czyli gdy w kryterium nr 2 lit. D wybrano TAK\",IF(AND(B125=\"tak\",X202=\"tak\"),\"OK - wnioskodawca oświadczył, że załączył kopię protokołu strat potwierdzonego przez Wojewodę Świętokrzyskiego\", IF(AND(B125=\"tak\", OR(X202=\"nie\",X202=\"nie dotyczy\")),\"BŁĄD - protokół jest załącznikiem OBLIGATORYJNYM w przypadku, gdy w kryterium nr 2 lit. D wybrano TAK.\"&\"\nWybierz TAK lub zmień odpowiedź w kryterium nr 2 lit. D\",IF(AND(OR(B125=\"nie\",B125=\"\"),OR(X202=\"nie\",X202=\"nie dotyczy\",X202=\"\")),\"OK - wnioskodawca oświadczył, że nie załączył protokołu strat potwierdzonego przez Wojewodę Świętokrzyskiego\", IF(AND(OR(B125=\"nie\",B125=\"\"),OR(X202=\"tak\")),\"BŁĄD - w kryterium nr 2 lit. D wybrano NIE (pozostawienie komórki pustej jest jednoznaczne z wybraniem NIE). Wybierz NIE lub zmień odpowiedź w kryterium nr 2 lit. D\", \"Błąd danej - wprowadzono daną spoza listy rozwijanej\")))))","v":"Wybierz z listy rozwijanej, czy załączono kopię protokołu strat potwierdzonego przez Wojewodę Świętokrzyskiego - jeśli dotyczy, czyli gdy w kryterium nr 2 lit. D wybrano TAK"},null,null,null,null,null,null,null,null,null,null,null,null,null,null,null,null,null,null,null,{"$f":"IF(X202=\"\",\"W\",IF(AND(X202=\"tak\",OR(B125=\"\",B125=\"nie\",B125=\"nie dotyczy\")),\"B\",IF(AND(X202<>\"tak\",B125=\"tak\"),\"B\",\"OK\")))","v":"W"}]
[null,"g)","kopia dokumentu potwierdzającego przebieg linii autobusowej objętej wsparciem  z FRPA, linii użyteczności publicznej lub realizowanie usług transportu publicznego - dotyczy kryterium nr 4 lit. D (jeśli dotyczy).",null,null,null,null,null,null,null,null,null,null,null,null,null,null,null,null,null,null,null,null,null,null,null,null,null,null,null,{"$f":"IF(X203=\"\",\"Wybierz z listy rozwijanej, czy załączono dokument potwierdzający przebieg linii autobusowej objętej wsparciem z FRPA, linii użyteczności publicznej lub realizowanie usług transportu publicznego\"&\" - jeśli dotyczy, czyli gdy w kryterium nr 4 lit. D wybrano TAK\",IF(AND(B164=\"tak\",X203=\"tak\"),\"OK - wnioskodawca oświadczył, że załączył dokument potwierdzający przebieg linii autobusowej objętej wsparciem z FRPA, linii użyteczności publicznej lub realizowanie usług transportu publicznego\", IF(AND(B164=\"tak\", OR(X203=\"nie\",X203=\"nie dotyczy\")),\"BŁĄD - dokument jest załącznikiem OBLIGATORYJNYM w przypadku, gdy w kryterium nr 4 lit. D wybrano TAK.\"&\"\nWybierz TAK lub zmień odpowiedź w kryterium nr 4 lit. D\",IF(AND(OR(B164=\"nie\",B164=\"\"),OR(X203=\"nie\",X203=\"nie dotyczy\",X203=\"\")),\"OK - wnioskodawca oświadczył, że nie załączył dokumentu potwierdzającego przebieg linii autobusowej objętej wsparciem z FRPA, linii użyteczności publicznej lub realizowania usług transportu publicznego\", IF(AND(OR(B164=\"nie\",B164=\"\"),OR(X203=\"tak\")),\"BŁĄD - w kryterium nr 4 lit. D wybrano NIE (pozostawienie komórki pustej jest jednoznaczne z wybraniem NIE). Wybierz NIE lub zmień odpowiedź w kryterium nr 4 lit. D\", \"Błąd danej - wprowadzono daną spoza listy rozwijanej\")))))","v":"Wybierz z listy rozwijanej, czy załączono dokument potwierdzający przebieg linii autobusowej objętej wsparciem z FRPA, linii użyteczności publicznej lub realizowanie usług transportu publicznego - jeśli dotyczy, czyli gdy w kryterium nr 4 lit. D wybrano TAK"},null,null,null,null,null,null,null,null,null,null,null,null,null,null,null,null,null,null,null,{"$f":"IF(X203=\"\",\"W\",IF(AND(X203=\"tak\",OR(B164=\"\",B164=\"nie\",B164=\"nie dotyczy\")),\"B\",IF(AND(X203<>\"tak\",B164=\"tak\"),\"B\",\"OK\")))","v":"W"}]
[null,"h)","kopia uchwały o zaliczeniu drogi do odpowiedniej kategorii dróg publicznych (obligatoryjnie) oraz uchwała o zmianie numerów dróg publicznych* (jeśli dotyczy).\n* w przypadku, numer drogi wskazany we wniosku jest inny niż w uchwale o zliczeniu drogi do dróg publicznych, czyli gdy po zaliczeniu drogi do odpowiedniej kategorii dróg publicznych nastąpiła zmiana numeru drogi - fakt ten należy odnotować poniżej w pkt 12 lit. i (dodatkowe załączniki)",null,null,null,null,null,null,null,null,null,null,null,null,null,null,null,null,null,null,null,null,null,null,null,null,null,null,null,{"$f":"IF(X204=\"\",\"Wybierz z listy rozwijanej, czy załączono uchwałę o zaliczeniu drogi do odpowiedniej kategorii dróg publicznych - dotyczy dróg publicznych. Załącznik jest OBLIGATORYJNY.\"&\"\nNależy załączyć uchwałę o zmianie numeru drogi, jeśli numer drogi podany we wniosku jest inny niż numer wynikający z uchwały o zaliczeniu drogi do dróg publicznych,\"&\" czyli gdy po zaliczeniu drogi do kategorii dróg publicznych zmieniono jej numer.\", IF(X204=\"tak\",\"OK - wnioskodawca oświadczył, że załączył uchwałę o zaliczeniu drogi do dróg publicznych\", IF(OR(X204=\"nie\",X204=\"nie dotyczy\"),\"BŁĄD - remontować można tylko drogi publiczne; uchwała jest załącznikiem OBLIGATORYJNYM w przypadku remontów\", \"Błąd danej - wprowadzono daną spoza listy rozwijanej\")))","v":"Wybierz z listy rozwijanej, czy załączono uchwałę o zaliczeniu drogi do odpowiedniej kategorii dróg publicznych - dotyczy dróg publicznych. Załącznik jest OBLIGATORYJNY.\nNależy załączyć uchwałę o zmianie numeru drogi, jeśli numer drogi podany we wniosku jest inny niż numer wynikający z uchwały o zaliczeniu drogi do dróg publicznych, czyli gdy po zaliczeniu drogi do kategorii dróg publicznych zmieniono jej numer."},null,null,null,null,null,null,null,null,null,null,null,null,null,null,null,null,null,null,null,{"$f":"IF(X204=\"tak\",\"OK\",\"B\")","v":"B"},{"$f":"IF(OR(X204=\"nie\",X204=\"nie dotyczy\"),\"B\",\"OK\")","v":"OK"}]
[null,"i)","dodatkowe załączniki (jeśli dotyczy):"]
[null,null,null,null,null,null,null,null,null,null,null,null,null,null,null,null,null,null,null,null,null,null,null,null,null,null,{"$f":"LEN(C206)","v":0},"z",500,null,"Wybierz z listy rozwijanej, czy do wniosku dołączono dodatkowe załączniki.\nJeśli TAK, to wpisz /wymień jakie dodatkowe załączniki dołączono do wniosku.\n\nPisanie od nowej linii  - wciśnij jednocześnie dwa klawisze: lewy ALT oraz ENTER"]
["13. ","OŚWIADCZENIA WNIOSKODAWCY (ustawowego zarządcy drogi)",null,null,null,null,null,null,null,null,null,null,null,null,null,null,null,null,null,null,null,null,null,null,null,null,null,null,null,null,{"$f":"_xlfn.CONCAT(A207,B207)","v":"13. OŚWIADCZENIA WNIOSKODAWCY (ustawowego zarządcy drogi)"}]
["Wnioskodawca oświadcza, że: "]
["1)","do wniosku dołączone zostały załączniki wskazane w pkt 12 wniosku;"]
["2)","dane i informacje zawarte we wniosku są prawidłowe i kompletne;"]
["3)","na dzień złożenia wniosku, zadanie obejmuje inwestycję wyłącznie na drodze dla której wnioskodawca pełni rolę ustawowego zarządcy;"]
["4)","na dzień złożenia wniosku, zadanie obejmuje inwestycję wyłącznie na drodze, która:",null,null,null,null,null,null,null,null,null,null,null,null,null,null,null,null,null,null,null,null,null,null,null,null,null,null,null,null,"Wybierz z listy rozwijanej, czy droga została zaliczona do odpowiedniej kategorii dróg publicznych"]
[null,"•","została zaliczona do kategorii dróg publicznych",null,null,null,null,null,null,null,null,null,null,null,null,null,null,null,null,null,null,null,null,null,null,null,null,null,null,null,{"$f":"IF(W213=\"\",\"Wybierz z listy rozwijanej, czy droga została zaliczona do odpowiedniej kategorii dróg\",IF(W213=\"nie\",\"Wnioskodawca oświadczył, że droga nie jest zaliczona do odpowiedniej kategorii dróg - NIE MOŻNA JEJ REMONTOWAĆ\",IF(W213=\"nie dotyczy\",\"Wnioskodawca oświadczył, że droga nie jest zaliczona do odpowiedniej kategorii dróg - NIE MOŻNA JEJ REMONTOWAĆ\",IF(W213=\"tak\",\"Wnioskodawca oświadczył, że droga jest zaliczona do odpowiedniej kategorii dróg\",IF(AND(#REF!<>\"\",W213=\"\"),\"Błąd danej - wprowadzono daną spoza listy rozwijanej\")))))","v":"Wybierz z listy rozwijanej, czy droga została zaliczona do odpowiedniej kategorii dróg"},null,null,null,null,null,null,null,null,null,null,null,null,null,null,null,null,null,null,null,{"$f":"IF(AND(W214=\"nie dotyczy\",W213=\"\"),\"W\",IF(AND(W214=\"nie dotyczy\",W213=\"nie dotyczy\"),\"B\",IF(AND(W214=\"nie dotyczy\",W213=\"NIE\"),\"B\",\"OK\")))","v":"W"}]
[null,"•","zostanie zaliczona do kategorii dróg publicznych*",null,null,null,null,null,null,null,null,null,null,null,null,null,null,null,null,null,null,null,"NIE DOTYCZY",null,null,null,null,null,null,null,"NIE DOTYCZY REMONTU"]
[null,null,"* uchwałą właściwego organu jst w sprawie zaliczenia drogi/dróg do odpowiedniej kategorii w terminie \n12 miesięcy od dnia zatwierdzenia rozliczenia; "]
["5)","zapewnione zostanie zabezpieczenie całości zadeklarowanego we wniosku wkładu własnego;"]
["6)","dopełnił lub dopełni wszelkich wymogów wynikających z przepisów prawa uprawniających do realizacji wnioskowanego zadania;"]
["7)","przeprowadzi postępowanie o zamówienie publiczne zgodnie z obowiązującymi przepisami Prawa zamówień publicznych (t.j. Dz. U. z 2024 r. poz. 1320 ze zm.)."]
["OŚWIADCZENIE O REALIZACJI ZADANIA W PASIE DROGOWYM (obligatoryjnie)",null,null,null,null,null,null,null,null,null,null,null,null,null,null,null,null,null,null,null,null,null,null,null,null,null,null,null,null,null,{"$f":"A219","v":"OŚWIADCZENIE O REALIZACJI ZADANIA W PASIE DROGOWYM (obligatoryjnie)"}]
[null,"Wnioskodawca oświadcza, że planowane do realizacji elementy drogi mieszczą się w granicach pasa drogowego (nie zaplanowano ich na działkach stanowiących własność prywatną bądź na działkach niestanowiących pasa drogowego)",null,null,null,null,null,null,null,null,null,null,null,null,null,null,null,null,null,null,null,null,null,null,null,null,null,null,null,null,{"$f":"IF(X219=\"\",\"Wybierz z listy rozwijanej czy wnioskodawca oświadcza, że zadnie realizowane jest w pasie drogowym.\nRealizacja zadania w pasie drogowym jest OBLIGATORYJNA.\",IF(X219=\"tak\",\"OK - wnioskodawca oświadczył, że zadnie realizowane jest w pasie drogowym.\",IF(X219=\"nie\",\"Oświadczenie jest OBLIGATORYJNE\",\"Błąd danej - wprowadzono daną spoza listy rozwijanej\")))","v":"Wybierz z listy rozwijanej czy wnioskodawca oświadcza, że zadnie realizowane jest w pasie drogowym.\nRealizacja zadania w pasie drogowym jest OBLIGATORYJNA."},null,null,null,null,null,null,null,null,null,null,null,null,null,null,null,null,null,null,null,{"$f":"IF(X219=\"\",\"W\",IF(X219=\"tak\",\"OK\",\"B\"))","v":"W"}]
["OŚWIADCZENIE O PRZEKAZANIU DANYCH O SIECI DRÓG PUBLICZNYCH (obligatoryjnie)",null,null,null,null,null,null,null,null,null,null,null,null,null,null,null,null,null,null,null,null,null,null,null,null,null,null,null,null,null,{"$f":"A221","v":"OŚWIADCZENIE O PRZEKAZANIU DANYCH O SIECI DRÓG PUBLICZNYCH (obligatoryjnie)"}]
[null,"Wnioskodawca oświadcza, że zgodnie z zapisami § 2 rozporządzenia Ministra Infrastruktury z dnia 16 lutego 2005 r. w sprawie trybu sporządzania informacji oraz gromadzenia i udostępniania danych o sieci dróg publicznych, obiektach mostowych, tunelach oraz promach (Dz. U. 2005 nr 67 poz. 583) sporządzono oraz przekazano do Generalnego Dyrektora Dróg Krajowych i Autostrad informacje dla celów statystycznych o sieci dróg publicznych według stanu na dzień 31 grudnia 2024 r. ",null,null,null,null,null,null,null,null,null,null,null,null,null,null,null,null,null,null,null,null,null,null,null,null,null,null,null,null,{"$f":"IF(X221=\"\",\"Wybierz z listy rozwijanej czy wnioskodawca oświadczył, że sporządził i przekazał do Generalnego Dyrektora Dróg Krajowych i Autostrad informacje do celów statystycznych o sieci dróg publicznych.\nOświadczenie jest OBLIGATORYJNE.\",IF(X221=\"tak\",\"OK - wnioskodawca oświadcza, że sporządził i przekazał do Generalnego Dyrektora Dróg Krajowych i Autostrad informacje do celów statystycznych o sieci dróg publicznych.\",IF(X221=\"nie\",\"Oświadczenie jest OBLIGATORYJNE\",\"Błąd danej - wprowadzono daną spoza listy rozwijanej\")))","v":"Wybierz z listy rozwijanej czy wnioskodawca oświadczył, że sporządził i przekazał do Generalnego Dyrektora Dróg Krajowych i Autostrad informacje do celów statystycznych o sieci dróg publicznych.\nOświadczenie jest OBLIGATORYJNE."},null,null,null,null,null,null,null,null,null,null,null,null,null,null,null,null,null,null,null,{"$f":"IF(X221=\"\",\"W\",IF(X221=\"tak\",\"OK\",\"B\"))","v":"W"}]
["OŚWIADCZENIE O POSIADANIU TYTUŁU PRAWNEGO DO NIERUCHOMOŚCI (obligatoryjnie)",null,null,null,null,null,null,null,null,null,null,null,null,null,null,null,null,null,null,null,null,null,null,null,null,null,null,null,null,null,{"$f":"A223","v":"OŚWIADCZENIE O POSIADANIU TYTUŁU PRAWNEGO DO NIERUCHOMOŚCI (obligatoryjnie)"}]
[null,"Wnioskodawca oświadcza, że posiada tytuł prawny do nieruchomości wskazanych w oświadczeniu o dysponowaniu nieruchomością na cele budowlane zgodnie z art. 3 ustawy z dnia 7 lipca 1994 r. prawo budowlane (t.j. Dz.U. z 2025 r. poz. 418), tj. tytuł prawny wynikający z prawa własności, użytkowania wieczystego, zarządu, ograniczonego prawa rzeczowego albo stosunku zobowiązaniowego, przewidującego uprawnienia do wykonywania robót budowlanych, ponadto tytuł ten nie wynika z posiadania samoistnego/władania lub z mocy prawa na podst. art. 73 ustawy z dnia 13 października 1998 r. Przepisy wprowadzające ustawy reformujące administrację publiczną (t.j. Dz. U. Nr 133, poz. 872 ze zm.) - dotyczy sytuacji gdy jst nie posiada decyzji potwierdzającej ten fakt.",null,null,null,null,null,null,null,null,null,null,null,null,null,null,null,null,null,null,null,null,null,null,null,null,null,null,null,null,{"$f":"IF(X223=\"\",\"Wybierz z listy rozwijanej czy wnioskodawca oświadczył, że posiada tytuł prawny do nieruchomości.\nPosiadanie tytułu prawnego do nieruchomości jest OBLIGATORYJNE.\",IF(X223=\"tak\",\"OK - wnioskodawca oświadcza, że posiada tytuł prawny do nieruchomości.\",IF(X223=\"nie\",\"Oświadczenie jest OBLIGATORYJNE\",\"Błąd danej - wprowadzono daną spoza listy rozwijanej\")))","v":"Wybierz z listy rozwijanej czy wnioskodawca oświadczył, że posiada tytuł prawny do nieruchomości.\nPosiadanie tytułu prawnego do nieruchomości jest OBLIGATORYJNE."},null,null,null,null,null,null,null,null,null,null,null,null,null,null,null,null,null,null,null,{"$f":"IF(X223=\"\",\"W\",IF(X223=\"tak\",\"OK\",\"B\"))","v":"W"}]
["OŚWIADCZENIE O ZGODNOŚCI Z PRZEPISAMI PRAWA (obligatoryjnie)",null,null,null,null,null,null,null,null,null,null,null,null,null,null,null,null,null,null,null,null,null,null,null,null,null,null,null,null,null,{"$f":"A225","v":"OŚWIADCZENIE O ZGODNOŚCI Z PRZEPISAMI PRAWA (obligatoryjnie)"}]
[null,"Wnioskodawca oświadcza, że realizacja zgłoszonego zadania odbędzie się z zachowaniem przepisów prawa budowlanego, w tym warunków techniczno-budowlanych dotyczących dróg, w szczególności z:",null,null,null,null,null,null,null,null,null,null,null,null,null,null,null,null,null,null,null,null,null,null,null,null,null,null,null,null,{"$f":"IF(X225=\"\",\"Wybierz z listy rozwijanej czy wnioskodawca oświadcza, że realizując zgłoszone we wniosku zadanie zostaną zachowane przepisy prawa budowlanego, w tym warunków techniczno-budowlanych dotyczących dróg.\"&\"\nPrzestrzeganie przepisów prawa budowlanego, w tym warunków-techniczno-budowlanych jest OBLIGATORYJNE.\",IF(X225=\"tak\",\"OK - wnioskodawca oświadczył, że realizując zgłoszone we wniosku zadanie zostaną zachowane przepisy prawa budowlanego, w tym warunków techniczno-budowlanych dotyczących dróg.\",IF(X225=\"nie\",\"Oświadczenie jest OBLIGATORYJNE.\",\"Błąd danej - wprowadzono daną spoza listy rozwijanej\")))","v":"Wybierz z listy rozwijanej czy wnioskodawca oświadcza, że realizując zgłoszone we wniosku zadanie zostaną zachowane przepisy prawa budowlanego, w tym warunków techniczno-budowlanych dotyczących dróg.\nPrzestrzeganie przepisów prawa budowlanego, w tym warunków-techniczno-budowlanych jest OBLIGATORYJNE."},null,null,null,null,null,null,null,null,null,null,null,null,null,null,null,null,null,null,null,{"$f":"IF(X225=\"\",\"W\",IF(X225=\"tak\",\"OK\",\"B\"))","v":"W"}]
[null,"•  ","ustawą z dnia 7 lipca 1994 r. prawo budowlane (t.j. Dz. U. z 2025 r. poz. 418);"]
[null,"•  ","rozporządzeniem Ministra Infrastruktury z dnia 24 czerwca 2022 r. w sprawie przepisów techniczno-budowlanych dotyczących dróg publicznych (t.j. Dz. U. z 2022 r. poz. 1518);\nlub\nrozporządzeniem Ministra Transportu i Gospodarki Morskiej z dnia 2 marca 1999 r. w sprawie warunków technicznych, jakim powinny odpowiadać drogi publiczne i ich usytuowanie (t.j. Dz. U. z 2016 r. poz. 124 ze zm.) - w przypadku, gdy ZRID jest sprzed 2022 roku"]
[null,"•  ","ustawą z dnia 21 marca 1985 r. o drogach publicznych (t.j. Dz. U. z 2025 r. poz. 889)."]
["OŚWIADCZENIE O DZIAŁANIACH INFORMACYJNYCH (obligatoryjnie)",null,null,null,null,null,null,null,null,null,null,null,null,null,null,null,null,null,null,null,null,null,null,null,null,null,null,null,null,null,{"$f":"A230","v":"OŚWIADCZENIE O DZIAŁANIACH INFORMACYJNYCH (obligatoryjnie)"}]
[null,"Wnioskodawca oświadcza, że realizując zgłoszone zadanie dopełni działań informacyjnych wynikających z art. 38 ustawy z dnia 23 października 2018 r. o Rządowym Funduszu Rozwoju Dróg (t.j. Dz. U. z 2025 r. poz. 94).",null,null,null,null,null,null,null,null,null,null,null,null,null,null,null,null,null,null,null,null,null,null,null,null,null,null,null,null,{"$f":"IF(X230=\"\",\"Wybierz z listy rozwijanej czy wnioskodawca oświadcza, że realizując zgłoszone we wniosku zadanie dopełni działań informacyjnych wynikających z ustawy o RFRD.\nDopełnienie działań informacyjnych jest OBLIGATORYJNE.\",IF(X230=\"TAK\",\"OK - wnioskodawca oświadczył, że dopełni działań informacyjnych wynikających z ustawy o RFRD.\",IF(X230=\"nie\",\"Oświadczenie jest OBLIGATORYJNE.\",\"Błąd danej - wprowadzono daną spoza listy rozwijanej\")))","v":"Wybierz z listy rozwijanej czy wnioskodawca oświadcza, że realizując zgłoszone we wniosku zadanie dopełni działań informacyjnych wynikających z ustawy o RFRD.\nDopełnienie działań informacyjnych jest OBLIGATORYJNE."},null,null,null,null,null,null,null,null,null,null,null,null,null,null,null,null,null,null,null,{"$f":"IF(X230=\"\",\"W\",IF(X230=\"tak\",\"OK\",\"B\"))","v":"W"}]
["OŚWIADCZENIE O ODPOWIEDZIALNOŚCI KARNEJ (obligatoryjnie)",null,null,null,null,null,null,null,null,null,null,null,null,null,null,null,null,null,null,null,null,null,null,null,null,null,null,null,null,null,{"$f":"A232","v":"OŚWIADCZENIE O ODPOWIEDZIALNOŚCI KARNEJ (obligatoryjnie)"}]
[null,"Ja, niżej podpisana/y, oświadczam, że informacje zawarte we wniosku oraz przedłożonych załącznikach są zgodne z prawdą. Jestem świadomy odpowiedzialności karnej wynikającej z art. 271 Kodeksu Karnego, dotyczącego poświadczenia nieprawdy, co do okoliczności mającej znaczenie prawne.",null,null,null,null,null,null,null,null,null,null,null,null,null,null,null,null,null,null,null,null,null,null,null,null,null,null,null,null,{"$f":"IF(X232=\"\",\"Wybierz z listy rozwijanej czy wnioskodawca oświadcza, że informacje zawarte we wniosku i załącznikach są zgodne z prawdą. \nOświadczenie to jest OBLIGATORYJNE.\",IF(X232=\"TAK\",\"OK - wnioskodawca oświadczył, że informacje zawarte we wniosku i załącznikach są zgodne z prawdą.\",IF(X232=\"nie\",\"Oświadczenie jest OBLIGATORYJNE.\",\"Błąd danej - wprowadzono daną spoza listy rozwijanej\")))","v":"Wybierz z listy rozwijanej czy wnioskodawca oświadcza, że informacje zawarte we wniosku i załącznikach są zgodne z prawdą. \nOświadczenie to jest OBLIGATORYJNE."},null,null,null,null,null,null,null,null,null,null,null,null,null,null,null,null,null,null,null,{"$f":"IF(X232=\"\",\"W\",IF(X232=\"tak\",\"OK\",\"B\"))","v":"W"}]
["Podpisy i pieczęcie osób upoważnionych z ramienia wnioskodawcy (ustawowego zarządcy drogi) \nwraz z podpisem i piećzęcią Skarbnika",null,null,null,null,null,null,null,null,null,null,null,null,null,null,null,null,null,null,null,null,null,null,null,null,null,null,null,null,null,{"$f":"A234","v":"Podpisy i pieczęcie osób upoważnionych z ramienia wnioskodawcy (ustawowego zarządcy drogi) \nwraz z podpisem i piećzęcią Skarbnika"}]
[null,null,null,null,null,null,null,null,null,null,null,null,null,null,null,null,null,null,null,null,null,null,null,null,null,null,null,null,null,null,"Jeśli wnioskodawcą (ustawowym zarządcą drogi) jest :\n - GMINA (samorząd gminy) - podpis i pieczątka wójta/burmistrza/prezydenta oraz skarbnika/głównego księgowego (łącznie 2 podpisy),\n - POWIAT (samorząd powiatu) - podpisy i pieczątki dwóch członków zarządu powiatu oraz skarbnika/głównego księgowego (łącznie 3 podpisy).\n\nW przypadku, gdy właściwa osoba nie może złożyć podpisu i pieczątki dopuszcza się, żeby w jej zastępstwie podpis i pieczątkę złożyła osoba upoważniona. Należy wtedy załączyć do wniosku kopię stosownego upoważnienia potwierdzoną za zgodność z oryginałem.\n"]

{"sheet":"SŁOWNIK","index":2,"n_rows":12,"n_cols":6,"rows_kept":12,"cut":false,"hidden":true,"merged":[[2,1,2,3]]}
[null,"WYKAZ POJĘĆ - jeszcze w opracowaniu"]
[]
[null,"Ustawa z dnia 7 lipca 1994 r. Prawo budowlane (t.j. Dz.U. z 2025 r. poz. 418)"]
[null,"art. 3, pkt 1","obiekt budowlany","budynek, budowla bądź obiekt małej architektury, wraz z instalacjami\nzapewniającymi możliwość użytkowania obiektu zgodnie z jego przeznaczeniem, wzniesiony z użyciem\nwyrobów budowlanych",null,{"$f":"UPPER(C4)","v":"OBIEKT BUDOWLANY"}]
[null,"art. 3, pkt 3","budowla","każdy obiekt budowlany niebędący budynkiem lub obiektem małej architektury,\njak: obiekty liniowe, lotniska, mosty, wiadukty, estakady, tunele, przepusty, sieci techniczne, wolno stojące\nmaszty antenowe, wolno stojące trwale związane z gruntem tablice reklamowe i urządzenia reklamowe, budowle\nziemne, obronne (fortyfikacje), ochronne, hydrotechniczne, zbiorniki, wolno stojące instalacje przemysłowe lub\nurządzenia techniczne, oczyszczalnie ścieków, składowiska odpadów, stacje uzdatniania wody, konstrukcje oporowe,\nnadziemne i podziemne przejścia dla pieszych, sieci uzbrojenia terenu, budowle sportowe, cmentarze, pomniki,\na także części budowlane urządzeń technicznych (kotłów, pieców przemysłowych, elektrowni jądrowych, elektrowni\nwiatrowych, morskich turbin wiatrowych i innych urządzeń) oraz fundamenty pod maszyny i urządzenia, jako\nodrębne pod względem technicznym części przedmiotów składających się na całość użytkową",null,{"$f":"UPPER(C5)","v":"BUDOWLA"}]
[null,"art. 3, pkt 3a","obiekt liniowy","obiekt budowlany, którego charakterystycznym parametrem jest\ndługość, w szczególności droga wraz ze zjazdami, droga kolejowa, wodociąg, kanał, gazociąg, ciepłociąg, rurociąg,\nlinia i trakcja elektroenergetyczna, linia kablowa nadziemna i, umieszczona bezpośrednio w ziemi, podziemna, wał\nprzeciwpowodziowy oraz kanalizacja kablowa, przy czym kable zainstalowane w kanalizacji kablowej, kable zainstalowane\nw kanale technologicznym oraz kable telekomunikacyjne dowieszone do już istniejącej linii kablowej\nnadziemnej nie stanowią obiektu budowlanego lub jego części ani urządzenia budowlanego",null,"OBIEKT LINIOWY"]
[null,"art. 3, pkt 4","obiekt małej architektury","niewielkie obiekty, a w szczególności:\n   a) kultu religijnego, jak: kapliczki, krzyże przydrożne, figury,\n   b) posągi, wodotryski i inne obiekty architektury ogrodowej,\n   c) użytkowe służące rekreacji codziennej i utrzymaniu porządku, jak: piaskownice, huśtawki, drabinki, śmietniki",null,"OBIEKT MAŁEJ ARCHITEKTURY"]
[null,"art. 3, pkt 6","budowa","wykonywanie obiektu budowlanego w określonym miejscu, a także odbudowę,\nrozbudowę, nadbudowę obiektu budowlanego",null,"BUDOWA"]
[null,"art. 3, pkt 7","roboty budowlane","budowa, a także prace polegające na przebudowie, montażu,\nremoncie lub rozbiórce obiektu budowlanego",null,"ROBOTY BUDOWLANE"]
[null,"art. 3, pkt 7a","przebudowa","wykonywanie robót budowlanych, w wyniku których następuje zmiana\nparametrów użytkowych lub technicznych istniejącego obiektu budowlanego, z wyjątkiem charakterystycznych parametrów,\njak: kubatura, powierzchnia zabudowy, wysokość, długość, szerokość bądź liczba kondygnacji; w przypadku\ndróg są dopuszczalne zmiany charakterystycznych parametrów w zakresie niewymagającym zmiany granic\npasa drogowego",null,"PRZEBUDOWA"]
[null,"art. 3, pkt 8","remont","wykonywanie w istniejącym obiekcie budowlanym robót budowlanych polegających\nna odtworzeniu stanu pierwotnego, a niestanowiących bieżącej konserwacji, przy czym dopuszcza się\nstosowanie wyrobów budowlanych innych niż użyto w stanie pierwotnym",null,"REMONT"]
[null,"art. 3, pkt 11","prawo do dysponowania nieruchomością na cele budowlane ","tytuł prawny wynikający z prawa własności, użytkowania wieczystego, zarządu, ograniczonego prawa rzeczowego albo stosunku zobowiązaniowego, przewidującego uprawnienia do wykonywania robót budowlanych",null,"PRAWO DO DYSPONOWANIA NIERUCHOMOŚCIĄ NA CELE BUDOWLANE "]

{"sheet":"DANE","index":3,"n_rows":183,"n_cols":19,"rows_kept":183,"cut":false,"hidden":true,"merged":[[43,6,43,7],[43,8,43,10]]}
[null,"DANE DO WNIOSKU - proszę nic nie zmieniać w tym arkuszu !!!"]
[]
[]
[]
[]
[]
[null,"JST",null,"GMINA","POWIAT","Buski","Jędrzejowski","Kazimierski","Kielecki","Konecki","Opatowski","Ostrowiecki","Pińczowski","Sandomierski","Skarżyski","Starachowicki","Staszowski","Włoszczowski"]
[null,"GMINA",null,"Buski","Buski","Busko-Zdrój","Imielno","Bejsce","Bieliny","Fałków","Baćkowice","Bałtów","Działoszyce","Dwikozy","Bliżyn","Brody","Bogoria","Kluczewsko",1]
[null,"POWIAT",null,"Jędrzejowski","Jędrzejowski","Gnojno","Jędrzejów","Czarnocin","Bodzentyn","Gowarczów","Iwaniska","Bodzechów","Kije","Klimontów","Łączna","Mirzec","Łubnice","Krasocin",2]
[null,null,null,"Kazimierski","Kazimierski","Nowy Korczyn","Małogoszcz","Kazimierza Wielka","Chęciny","Końskie","Lipnik","Ćmielów","Michałów","Koprzywnica","Skarżysko-Kamienna","Pawłów","Oleśnica","Moskorzew",3]
[null,null,null,"Kielecki","Kielecki","Pacanów","Nagłowice","Opatowiec","Chmielnik","Radoszyce","Opatów","Kunów","Pińczów","Łoniów","Skarżysko Kościelne","Starachowice","Osiek","Radków",4]
[null,null,null,"Konecki","Konecki","Solec-Zdrój","Oksa","Skalbmierz","Daleszyce","Ruda Maleniecka","Ożarów","Ostrowiec Świętokrzyski","Złota","Obrazów","Suchedniów","Wąchock","Połaniec","Secemin",5]
[null,"RODZAJ ROBÓT",null,"Opatowski","Opatowski","Stopnica","Sędziszów",null,"Górno","Słupia Konecka","Sadowie","Waśniów",null,"Samborzec",null,null,"Rytwiany","Włoszczowa",6]
[null,"BUDOWA",null,"Ostrowiecki","Ostrowiecki","Tuczępy","Słupia (Jędrzejowska)",null,"Kielce","Smyków","Tarłów",null,null,"Sandomierz",null,null,"Staszów",null,7]
[null,"PRZEBUDOWA",null,"Pińczowski","Pińczowski","Wiślica","Sobków",null,"Łagów","Stąporków","Wojciechowice",null,null,"Wilczyce",null,null,"Szydłów",null,8]
[null,{"$f":"\"\"","v":""},null,"Sandomierski","Sandomierski",null,"Wodzisław",null,"Łopuszno",null,null,null,null,"Zawichost",null,null,null,null,9]
[null,"REMONT",null,"Skarżyski","Skarżyski",null,null,null,"Masłów",null,null,null,null,null,null,null,null,null,10]
[null,null,null,"Starachowicki","Starachowicki",null,null,null,"Miedziana Góra",null,null,null,null,null,null,null,null,null,11]
[null,null,null,"Staszowski","Staszowski",null,null,null,"Mniów",null,null,null,null,null,null,null,null,null,12]
[null,null,null,"Włoszczowski","Włoszczowski",null,null,null,"Morawica",null,null,null,null,null,null,null,null,null,13]
[null,"TAK / NIE / NIE DOTYCZY",null,null,null,null,null,null,"Nowa Słupia"]
[null,"TAK",null,null,null,null,null,null,"Nowiny"]
[null,"NIE",null,null,null,null,null,null,"Piekoszów"]
[null,"NIE DOTYCZY",null,null,null,null,null,null,"Pierzchnica"]
[null,null,null,null,null,null,null,null,"Raków"]
[null,null,null,null,null,null,null,null,"Strawczyn"]
[null,null,null,null,null,null,null,null,"Zagnańsk"]
[]
[]
[null,null,null,"KLASA DROGI"]
[null,"Klasa drogi",null,"KATEGORIA \n(pkt 3 wniosku)","gminna","powiatowa","brak",null,"RODZAJ DROGI\n(pkt 9 wniosku)"]
[null,"D - dojazdowa",null,"gminna","D - dojazdowa","Z - zbiorcza","D - dojazdowa",null,"droga zamiejska"]
[null,"L - lokalna",null,"powiatowa","L - lokalna","G - główna","L - lokalna",null,"ulica"]
[null,"Z - zbiorcza",null,"brak","Z - zbiorcza","GP - główna ruchu przyspieszonego","Z - zbiorcza"]
[null,"G - główna",null,null,"G - główna","L - lokalna","G - główna"]
[null,"GP - główna ruchu przyspieszonego",null,null,"GP - główna ruchu przyspieszonego",null,"GP - główna ruchu przyspieszonego"]
[]
[]
[]
[]
[]
[]
[]
[null,null,null,null,null,null,2025,null,"RYZYKO WYPADKÓW",null,null,"PAN"]
[null,null,null,"powiat","gmina","JST","Teryt\nTERC","SKRÓT - typ JST","z udziałem pieszych","ogółem","ofiary śmiertelne","utrata funkcji","Peryferyjność",null,"% RFRD [ 2025]"]
[null,null,null,"buski",null,"powiat buski",{"$f":"VLOOKUP($F46,'DANE - TERC'!$D$6:$P$119,10,0)","v":2601},{"$f":"VLOOKUP($F46,'DANE - TERC'!$D$6:$P$119,12,0)","v":"PZ"},{"$f":"VLOOKUP($F46,'DANE - K1 lit.A'!$D$6:$M$119,4,0)","v":"NIE"},{"$f":"VLOOKUP($F46,'DANE - K1 lit.A'!$D$6:$M$119,5,0)","v":"NIE"},{"$f":"VLOOKUP($F46,'DANE - K1 lit.A'!$D$6:$M$119,6,0)","v":"NIE"},{"$f":"IF($E46=\"\",\"\",VLOOKUP($F46,'DANE - K4 lit.B'!$D$6:$E$107,2,0))","v":""},{"$f":"IF($E46=\"\",\"\",VLOOKUP($F46,'DANE - K2 lit.C'!$B$14:$I$114,8,0))","v":""},null,0.7,{"$f":"VLOOKUP($D46,POWIAT[POWIAT],1,0)","v":"Buski"},{"$f":"D46","v":"buski"}]
[null,null,null,"jędrzejowski",null,"powiat jędrzejowski",{"$f":"VLOOKUP($F47,'DANE - TERC'!$D$6:$P$119,10,0)","v":2602},{"$f":"VLOOKUP($F47,'DANE - TERC'!$D$6:$P$119,12,0)","v":"PZ"},{"$f":"VLOOKUP($F47,'DANE - K1 lit.A'!$D$6:$M$119,4,0)","v":"TAK"},{"$f":"VLOOKUP($F47,'DANE - K1 lit.A'!$D$6:$M$119,5,0)","v":"TAK"},{"$f":"VLOOKUP($F47,'DANE - K1 lit.A'!$D$6:$M$119,6,0)","v":"NIE"},{"$f":"IF($E47=\"\",\"\",VLOOKUP($F47,'DANE - K4 lit.B'!$D$6:$E$107,2,0))","v":""},{"$f":"IF($E47=\"\",\"\",VLOOKUP($F47,'DANE - K2 lit.C'!$B$14:$I$114,8,0))","v":""},null,0.7,{"$f":"VLOOKUP($D47,POWIAT[POWIAT],1,0)","v":"Jędrzejowski"},{"$f":"D47","v":"jędrzejowski"}]
[null,null,null,"kazimierski",null,"powiat kazimierski",{"$f":"VLOOKUP($F48,'DANE - TERC'!$D$6:$P$119,10,0)","v":2603},{"$f":"VLOOKUP($F48,'DANE - TERC'!$D$6:$P$119,12,0)","v":"PZ"},{"$f":"VLOOKUP($F48,'DANE - K1 lit.A'!$D$6:$M$119,4,0)","v":"TAK"},{"$f":"VLOOKUP($F48,'DANE - K1 lit.A'!$D$6:$M$119,5,0)","v":"NIE"},{"$f":"VLOOKUP($F48,'DANE - K1 lit.A'!$D$6:$M$119,6,0)","v":"TAK"},{"$f":"IF($E48=\"\",\"\",VLOOKUP($F48,'DANE - K4 lit.B'!$D$6:$E$107,2,0))","v":""},{"$f":"IF($E48=\"\",\"\",VLOOKUP($F48,'DANE - K2 lit.C'!$B$14:$I$114,8,0))","v":""},null,0.7,{"$f":"VLOOKUP($D48,POWIAT[POWIAT],1,0)","v":"Kazimierski"},"kazimierski"]
[null,null,null,"kielecki",null,"powiat kielecki",{"$f":"VLOOKUP($F49,'DANE - TERC'!$D$6:$P$119,10,0)","v":2604},{"$f":"VLOOKUP($F49,'DANE - TERC'!$D$6:$P$119,12,0)","v":"PZ"},{"$f":"VLOOKUP($F49,'DANE - K1 lit.A'!$D$6:$M$119,4,0)","v":"TAK"},{"$f":"VLOOKUP($F49,'DANE - K1 lit.A'!$D$6:$M$119,5,0)","v":"TAK"},{"$f":"VLOOKUP($F49,'DANE - K1 lit.A'!$D$6:$M$119,6,0)","v":"TAK"},{"$f":"IF($E49=\"\",\"\",VLOOKUP($F49,'DANE - K4 lit.B'!$D$6:$E$107,2,0))","v":""},{"$f":"IF($E49=\"\",\"\",VLOOKUP($F49,'DANE - K2 lit.C'!$B$14:$I$114,8,0))","v":""},null,0.7,{"$f":"VLOOKUP($D49,POWIAT[POWIAT],1,0)","v":"Kielecki"},"kielecki"]
[null,null,null,"konecki",null,"powiat konecki",{"$f":"VLOOKUP($F50,'DANE - TERC'!$D$6:$P$119,10,0)","v":2605},{"$f":"VLOOKUP($F50,'DANE - TERC'!$D$6:$P$119,12,0)","v":"PZ"},{"$f":"VLOOKUP($F50,'DANE - K1 lit.A'!$D$6:$M$119,4,0)","v":"TAK"},{"$f":"VLOOKUP($F50,'DANE - K1 lit.A'!$D$6:$M$119,5,0)","v":"NIE"},{"$f":"VLOOKUP($F50,'DANE - K1 lit.A'!$D$6:$M$119,6,0)","v":"TAK"},{"$f":"IF($E50=\"\",\"\",VLOOKUP($F50,'DANE - K4 lit.B'!$D$6:$E$107,2,0))","v":""},{"$f":"IF($E50=\"\",\"\",VLOOKUP($F50,'DANE - K2 lit.C'!$B$14:$I$114,8,0))","v":""},null,0.6,{"$f":"VLOOKUP($D50,POWIAT[POWIAT],1,0)","v":"Konecki"},"konecki"]
[null,null,null,"opatowski",null,"powiat opatowski",{"$f":"VLOOKUP($F51,'DANE - TERC'!$D$6:$P$119,10,0)","v":2606},{"$f":"VLOOKUP($F51,'DANE - TERC'!$D$6:$P$119,12,0)","v":"PZ"},{"$f":"VLOOKUP($F51,'DANE - K1 lit.A'!$D$6:$M$119,4,0)","v":"NIE"},{"$f":"VLOOKUP($F51,'DANE - K1 lit.A'!$D$6:$M$119,5,0)","v":"NIE"},{"$f":"VLOOKUP($F51,'DANE - K1 lit.A'!$D$6:$M$119,6,0)","v":"TAK"},{"$f":"IF($E51=\"\",\"\",VLOOKUP($F51,'DANE - K4 lit.B'!$D$6:$E$107,2,0))","v":""},{"$f":"IF($E51=\"\",\"\",VLOOKUP($F51,'DANE - K2 lit.C'!$B$14:$I$114,8,0))","v":""},null,0.6,{"$f":"VLOOKUP($D51,POWIAT[POWIAT],1,0)","v":"Opatowski"},"opatowski"]
[null,null,null,"ostrowiecki",null,"powiat ostrowiecki",{"$f":"VLOOKUP($F52,'DANE - TERC'!$D$6:$P$119,10,0)","v":2607},{"$f":"VLOOKUP($F52,'DANE - TERC'!$D$6:$P$119,12,0)","v":"PZ"},{"$f":"VLOOKUP($F52,'DANE - K1 lit.A'!$D$6:$M$119,4,0)","v":"NIE"},{"$f":"VLOOKUP($F52,'DANE - K1 lit.A'!$D$6:$M$119,5,0)","v":"NIE"},{"$f":"VLOOKUP($F52,'DANE - K1 lit.A'!$D$6:$M$119,6,0)","v":"NIE"},{"$f":"IF($E52=\"\",\"\",VLOOKUP($F52,'DANE - K4 lit.B'!$D$6:$E$107,2,0))","v":""},{"$f":"IF($E52=\"\",\"\",VLOOKUP($F52,'DANE - K2 lit.C'!$B$14:$I$114,8,0))","v":""},null,0.7,{"$f":"VLOOKUP($D52,POWIAT[POWIAT],1,0)","v":"Ostrowiecki"},"ostrowiecki"]
[null,null,null,"pińczowski",null,"powiat pińczowski",{"$f":"VLOOKUP($F53,'DANE - TERC'!$D$6:$P$119,10,0)","v":2608},{"$f":"VLOOKUP($F53,'DANE - TERC'!$D$6:$P$119,12,0)","v":"PZ"},{"$f":"VLOOKUP($F53,'DANE - K1 lit.A'!$D$6:$M$119,4,0)","v":"NIE"},{"$f":"VLOOKUP($F53,'DANE - K1 lit.A'!$D$6:$M$119,5,0)","v":"TAK"},{"$f":"VLOOKUP($F53,'DANE - K1 lit.A'!$D$6:$M$119,6,0)","v":"NIE"},{"$f":"IF($E53=\"\",\"\",VLOOKUP($F53,'DANE - K4 lit.B'!$D$6:$E$107,2,0))","v":""},{"$f":"IF($E53=\"\",\"\",VLOOKUP($F53,'DANE - K2 lit.C'!$B$14:$I$114,8,0))","v":""},null,0.7,{"$f":"VLOOKUP($D53,POWIAT[POWIAT],1,0)","v":"Pińczowski"},"pińczowski"]
[null,null,null,"sandomierski",null,"powiat sandomierski",{"$f":"VLOOKUP($F54,'DANE - TERC'!$D$6:$P$119,10,0)","v":2609},{"$f":"VLOOKUP($F54,'DANE - TERC'!$D$6:$P$119,12,0)","v":"PZ"},{"$f":"VLOOKUP($F54,'DANE - K1 lit.A'!$D$6:$M$119,4,0)","v":"TAK"},{"$f":"VLOOKUP($F54,'DANE - K1 lit.A'!$D$6:$M$119,5,0)","v":"TAK"},{"$f":"VLOOKUP($F54,'DANE - K1 lit.A'!$D$6:$M$119,6,0)","v":"NIE"},{"$f":"IF($E54=\"\",\"\",VLOOKUP($F54,'DANE - K4 lit.B'!$D$6:$E$107,2,0))","v":""},{"$f":"IF($E54=\"\",\"\",VLOOKUP($F54,'DANE - K2 lit.C'!$B$14:$I$114,8,0))","v":""},null,0.7,{"$f":"VLOOKUP($D54,POWIAT[POWIAT],1,0)","v":"Sandomierski"},"sandomierski"]
[null,null,null,"skarżyski",null,"powiat skarżyski",{"$f":"VLOOKUP($F55,'DANE - TERC'!$D$6:$P$119,10,0)","v":2610},{"$f":"VLOOKUP($F55,'DANE - TERC'!$D$6:$P$119,12,0)","v":"PZ"},{"$f":"VLOOKUP($F55,'DANE - K1 lit.A'!$D$6:$M$119,4,0)","v":"TAK"},{"$f":"VLOOKUP($F55,'DANE - K1 lit.A'!$D$6:$M$119,5,0)","v":"TAK"},{"$f":"VLOOKUP($F55,'DANE - K1 lit.A'!$D$6:$M$119,6,0)","v":"NIE"},{"$f":"IF($E55=\"\",\"\",VLOOKUP($F55,'DANE - K4 lit.B'!$D$6:$E$107,2,0))","v":""},{"$f":"IF($E55=\"\",\"\",VLOOKUP($F55,'DANE - K2 lit.C'!$B$14:$I$114,8,0))","v":""},null,0.6,{"$f":"VLOOKUP($D55,POWIAT[POWIAT],1,0)","v":"Skarżyski"},"skarżyski"]
[null,null,null,"starachowicki",null,"powiat starachowicki",{"$f":"VLOOKUP($F56,'DANE - TERC'!$D$6:$P$119,10,0)","v":2611},{"$f":"VLOOKUP($F56,'DANE - TERC'!$D$6:$P$119,12,0)","v":"PZ"},{"$f":"VLOOKUP($F56,'DANE - K1 lit.A'!$D$6:$M$119,4,0)","v":"NIE"},{"$f":"VLOOKUP($F56,'DANE - K1 lit.A'!$D$6:$M$119,5,0)","v":"NIE"},{"$f":"VLOOKUP($F56,'DANE - K1 lit.A'!$D$6:$M$119,6,0)","v":"NIE"},{"$f":"IF($E56=\"\",\"\",VLOOKUP($F56,'DANE - K4 lit.B'!$D$6:$E$107,2,0))","v":""},{"$f":"IF($E56=\"\",\"\",VLOOKUP($F56,'DANE - K2 lit.C'!$B$14:$I$114,8,0))","v":""},null,0.7,{"$f":"VLOOKUP($D56,POWIAT[POWIAT],1,0)","v":"Starachowicki"},"starachowicki"]
[null,null,null,"staszowski",null,"powiat staszowski",{"$f":"VLOOKUP($F57,'DANE - TERC'!$D$6:$P$119,10,0)","v":2612},{"$f":"VLOOKUP($F57,'DANE - TERC'!$D$6:$P$119,12,0)","v":"PZ"},{"$f":"VLOOKUP($F57,'DANE - K1 lit.A'!$D$6:$M$119,4,0)","v":"NIE"},{"$f":"VLOOKUP($F57,'DANE - K1 lit.A'!$D$6:$M$119,5,0)","v":"NIE"},{"$f":"VLOOKUP($F57,'DANE - K1 lit.A'!$D$6:$M$119,6,0)","v":"TAK"},{"$f":"IF($E57=\"\",\"\",VLOOKUP($F57,'DANE - K4 lit.B'!$D$6:$E$107,2,0))","v":""},{"$f":"IF($E57=\"\",\"\",VLOOKUP($F57,'DANE - K2 lit.C'!$B$14:$I$114,8,0))","v":""},null,0.7,{"$f":"VLOOKUP($D57,POWIAT[POWIAT],1,0)","v":"Staszowski"},"staszowski"]
[null,null,null,"włoszczowski",null,"powiat włoszczowski",{"$f":"VLOOKUP($F58,'DANE - TERC'!$D$6:$P$119,10,0)","v":2613},{"$f":"VLOOKUP($F58,'DANE - TERC'!$D$6:$P$119,12,0)","v":"PZ"},{"$f":"VLOOKUP($F58,'DANE - K1 lit.A'!$D$6:$M$119,4,0)","v":"NIE"},{"$f":"VLOOKUP($F58,'DANE - K1 lit.A'!$D$6:$M$119,5,0)","v":"TAK"},{"$f":"VLOOKUP($F58,'DANE - K1 lit.A'!$D$6:$M$119,6,0)","v":"TAK"},{"$f":"IF($E58=\"\",\"\",VLOOKUP($F58,'DANE - K4 lit.B'!$D$6:$E$107,2,0))","v":""},{"$f":"IF($E58=\"\",\"\",VLOOKUP($F58,'DANE - K2 lit.C'!$B$14:$I$114,8,0))","v":""},null,0.7,{"$f":"VLOOKUP($D58,POWIAT[POWIAT],1,0)","v":"Włoszczowski"},"włoszczowski"]
[null,null,null,"buski","Busko-Zdrój","gmina Busko-Zdrój",{"$f":"VLOOKUP($F59,'DANE - TERC'!$D$6:$P$119,10,0)","v":2601013},{"$f":"VLOOKUP($F59,'DANE - TERC'!$D$6:$P$119,12,0)","v":"GM-W"},{"$f":"VLOOKUP($F59,'DANE - K1 lit.A'!$D$6:$M$119,4,0)","v":"TAK"},{"$f":"VLOOKUP($F59,'DANE - K1 lit.A'!$D$6:$M$119,5,0)","v":"NIE"},{"$f":"VLOOKUP($F59,'DANE - K1 lit.A'!$D$6:$M$119,6,0)","v":"NIE"},{"$f":"IF($E59=\"\",\"\",VLOOKUP($F59,'DANE - K4 lit.B'!$D$6:$E$107,2,0))","v":"TAK"},{"$f":"IF($E59=\"\",\"\",VLOOKUP($F59,'DANE - K2 lit.C'!$B$14:$I$114,8,0))","v":"w przedziale od 30 do 50 minut"},null,0.8,{"$f":"IF($D59=Buski[[#Headers],[Buski]],VLOOKUP($E59,Buski[Buski],1,0),IF($D59=Jędrzejowski[[#Headers],[Jędrzejowski]],VLOOKUP($E59,Jędrzejowski[Jędrzejowski],1,0),IF($D59=Kazimierski[[#Headers],[Kazimierski]],VLOOKUP($E59,Kazimierski[Kazimierski],1,0),IF($D59=Kielecki[[#Headers],[Kielecki]],VLOOKUP($E59,Kielecki[Kielecki],1,0),IF($D59=Konecki[[#Headers],[Konecki]],VLOOKUP($E59,Konecki[Konecki],1,0),IF($D59=Opatowski[[#Headers],[Opatowski]],VLOOKUP($E59,Opatowski[Opatowski],1,0),IF($D59=Ostrowiecki[[#Headers],[Ostrowiecki]],VLOOKUP($E59,Ostrowiecki[Ostrowiecki],1,0),IF($D59=Pińczowski[[#Headers],[Pińczowski]],VLOOKUP($E59,Pińczowski[Pińczowski],1,0),IF($D59=Sandomierski[[#Headers],[Sandomierski]],VLOOKUP($E59,Sandomierski[Sandomierski],1,0),IF($D59=Skarżyski[[#Headers],[Skarżyski]],VLOOKUP($E59,Skarżyski[Skarżyski],1,0),IF($D59=Starachowicki[[#Headers],[Starachowicki]],VLOOKUP($E59,Starachowicki[Starachowicki],1,0),IF($D59=Staszowski[[#Headers],[Staszowski]],VLOOKUP($E59,Staszowski[Staszowski],1,0),IF($D59=Włoszczowski[[#Headers],[Włoszczowski]],VLOOKUP($E59,Włoszczowski[Włoszczowski],1,0),\"\")))))))))))))","v":"Busko-Zdrój"},"buski"]
[null,null,null,"buski","Gnojno","gmina Gnojno",{"$f":"VLOOKUP($F60,'DANE - TERC'!$D$6:$P$119,10,0)","v":2601022},{"$f":"VLOOKUP($F60,'DANE - TERC'!$D$6:$P$119,12,0)","v":"GW"},{"$f":"VLOOKUP($F60,'DANE - K1 lit.A'!$D$6:$M$119,4,0)","v":"NIE"},{"$f":"VLOOKUP($F60,'DANE - K1 lit.A'!$D$6:$M$119,5,0)","v":"NIE"},{"$f":"VLOOKUP($F60,'DANE - K1 lit.A'!$D$6:$M$119,6,0)","v":"NIE"},{"$f":"IF($E60=\"\",\"\",VLOOKUP($F60,'DANE - K4 lit.B'!$D$6:$E$107,2,0))","v":"NIE"},{"$f":"IF($E60=\"\",\"\",VLOOKUP($F60,'DANE - K2 lit.C'!$B$14:$I$114,8,0))","v":"w przedziale od 30 do 50 minut"},null,0.8,{"$f":"IF($D60=Buski[[#Headers],[Buski]],VLOOKUP($E60,Buski[Buski],1,0),IF($D60=Jędrzejowski[[#Headers],[Jędrzejowski]],VLOOKUP($E60,Jędrzejowski[Jędrzejowski],1,0),IF($D60=Kazimierski[[#Headers],[Kazimierski]],VLOOKUP($E60,Kazimierski[Kazimierski],1,0),IF($D60=Kielecki[[#Headers],[Kielecki]],VLOOKUP($E60,Kielecki[Kielecki],1,0),IF($D60=Konecki[[#Headers],[Konecki]],VLOOKUP($E60,Konecki[Konecki],1,0),IF($D60=Opatowski[[#Headers],[Opatowski]],VLOOKUP($E60,Opatowski[Opatowski],1,0),IF($D60=Ostrowiecki[[#Headers],[Ostrowiecki]],VLOOKUP($E60,Ostrowiecki[Ostrowiecki],1,0),IF($D60=Pińczowski[[#Headers],[Pińczowski]],VLOOKUP($E60,Pińczowski[Pińczowski],1,0),IF($D60=Sandomierski[[#Headers],[Sandomierski]],VLOOKUP($E60,Sandomierski[Sandomierski],1,0),IF($D60=Skarżyski[[#Headers],[Skarżyski]],VLOOKUP($E60,Skarżyski[Skarżyski],1,0),IF($D60=Starachowicki[[#Headers],[Starachowicki]],VLOOKUP($E60,Starachowicki[Starachowicki],1,0),IF($D60=Staszowski[[#Headers],[Staszowski]],VLOOKUP($E60,Staszowski[Staszowski],1,0),IF($D60=Włoszczowski[[#Headers],[Włoszczowski]],VLOOKUP($E60,Włoszczowski[Włoszczowski],1,0),\"\")))))))))))))","v":"Gnojno"},"buski"]
[null,null,null,"buski","Nowy Korczyn","gmina Nowy Korczyn",{"$f":"VLOOKUP($F61,'DANE - TERC'!$D$6:$P$119,10,0)","v":2601033},{"$f":"VLOOKUP($F61,'DANE - TERC'!$D$6:$P$119,12,0)","v":"GM-W"},{"$f":"VLOOKUP($F61,'DANE - K1 lit.A'!$D$6:$M$119,4,0)","v":"TAK"},{"$f":"VLOOKUP($F61,'DANE - K1 lit.A'!$D$6:$M$119,5,0)","v":"TAK"},{"$f":"VLOOKUP($F61,'DANE - K1 lit.A'!$D$6:$M$119,6,0)","v":"NIE"},{"$f":"IF($E61=\"\",\"\",VLOOKUP($F61,'DANE - K4 lit.B'!$D$6:$E$107,2,0))","v":"NIE"},{"$f":"IF($E61=\"\",\"\",VLOOKUP($F61,'DANE - K2 lit.C'!$B$14:$I$114,8,0))","v":"większy niż 50 minut"},null,0.8,{"$f":"IF($D61=Buski[[#Headers],[Buski]],VLOOKUP($E61,Buski[Buski],1,0),IF($D61=Jędrzejowski[[#Headers],[Jędrzejowski]],VLOOKUP($E61,Jędrzejowski[Jędrzejowski],1,0),IF($D61=Kazimierski[[#Headers],[Kazimierski]],VLOOKUP($E61,Kazimierski[Kazimierski],1,0),IF($D61=Kielecki[[#Headers],[Kielecki]],VLOOKUP($E61,Kielecki[Kielecki],1,0),IF($D61=Konecki[[#Headers],[Konecki]],VLOOKUP($E61,Konecki[Konecki],1,0),IF($D61=Opatowski[[#Headers],[Opatowski]],VLOOKUP($E61,Opatowski[Opatowski],1,0),IF($D61=Ostrowiecki[[#Headers],[Ostrowiecki]],VLOOKUP($E61,Ostrowiecki[Ostrowiecki],1,0),IF($D61=Pińczowski[[#Headers],[Pińczowski]],VLOOKUP($E61,Pińczowski[Pińczowski],1,0),IF($D61=Sandomierski[[#Headers],[Sandomierski]],VLOOKUP($E61,Sandomierski[Sandomierski],1,0),IF($D61=Skarżyski[[#Headers],[Skarżyski]],VLOOKUP($E61,Skarżyski[Skarżyski],1,0),IF($D61=Starachowicki[[#Headers],[Starachowicki]],VLOOKUP($E61,Starachowicki[Starachowicki],1,0),IF($D61=Staszowski[[#Headers],[Staszowski]],VLOOKUP($E61,Staszowski[Staszowski],1,0),IF($D61=Włoszczowski[[#Headers],[Włoszczowski]],VLOOKUP($E61,Włoszczowski[Włoszczowski],1,0),\"\")))))))))))))","v":"Nowy Korczyn"},"buski"]
[null,null,null,"buski","Pacanów","gmina Pacanów",{"$f":"VLOOKUP($F62,'DANE - TERC'!$D$6:$P$119,10,0)","v":2601043},{"$f":"VLOOKUP($F62,'DANE - TERC'!$D$6:$P$119,12,0)","v":"GM-W"},{"$f":"VLOOKUP($F62,'DANE - K1 lit.A'!$D$6:$M$119,4,0)","v":"NIE"},{"$f":"VLOOKUP($F62,'DANE - K1 lit.A'!$D$6:$M$119,5,0)","v":"NIE"},{"$f":"VLOOKUP($F62,'DANE - K1 lit.A'!$D$6:$M$119,6,0)","v":"NIE"},{"$f":"IF($E62=\"\",\"\",VLOOKUP($F62,'DANE - K4 lit.B'!$D$6:$E$107,2,0))","v":"NIE"},{"$f":"IF($E62=\"\",\"\",VLOOKUP($F62,'DANE - K2 lit.C'!$B$14:$I$114,8,0))","v":"większy niż 50 minut"},null,0.8,{"$f":"IF($D62=Buski[[#Headers],[Buski]],VLOOKUP($E62,Buski[Buski],1,0),IF($D62=Jędrzejowski[[#Headers],[Jędrzejowski]],VLOOKUP($E62,Jędrzejowski[Jędrzejowski],1,0),IF($D62=Kazimierski[[#Headers],[Kazimierski]],VLOOKUP($E62,Kazimierski[Kazimierski],1,0),IF($D62=Kielecki[[#Headers],[Kielecki]],VLOOKUP($E62,Kielecki[Kielecki],1,0),IF($D62=Konecki[[#Headers],[Konecki]],VLOOKUP($E62,Konecki[Konecki],1,0),IF($D62=Opatowski[[#Headers],[Opatowski]],VLOOKUP($E62,Opatowski[Opatowski],1,0),IF($D62=Ostrowiecki[[#Headers],[Ostrowiecki]],VLOOKUP($E62,Ostrowiecki[Ostrowiecki],1,0),IF($D62=Pińczowski[[#Headers],[Pińczowski]],VLOOKUP($E62,Pińczowski[Pińczowski],1,0),IF($D62=Sandomierski[[#Headers],[Sandomierski]],VLOOKUP($E62,Sandomierski[Sandomierski],1,0),IF($D62=Skarżyski[[#Headers],[Skarżyski]],VLOOKUP($E62,Skarżyski[Skarżyski],1,0),IF($D62=Starachowicki[[#Headers],[Starachowicki]],VLOOKUP($E62,Starachowicki[Starachowicki],1,0),IF($D62=Staszowski[[#Headers],[Staszowski]],VLOOKUP($E62,Staszowski[Staszowski],1,0),IF($D62=Włoszczowski[[#Headers],[Włoszczowski]],VLOOKUP($E62,Włoszczowski[Włoszczowski],1,0),\"\")))))))))))))","v":"Pacanów"},"buski"]
[null,null,null,"buski","Solec-Zdrój","gmina Solec-Zdrój",{"$f":"VLOOKUP($F63,'DANE - TERC'!$D$6:$P$119,10,0)","v":2601052},{"$f":"VLOOKUP($F63,'DANE - TERC'!$D$6:$P$119,12,0)","v":"GW"},{"$f":"VLOOKUP($F63,'DANE - K1 lit.A'!$D$6:$M$119,4,0)","v":"TAK"},{"$f":"VLOOKUP($F63,'DANE - K1 lit.A'!$D$6:$M$119,5,0)","v":"TAK"},{"$f":"VLOOKUP($F63,'DANE - K1 lit.A'!$D$6:$M$119,6,0)","v":"NIE"},{"$f":"IF($E63=\"\",\"\",VLOOKUP($F63,'DANE - K4 lit.B'!$D$6:$E$107,2,0))","v":"NIE"},{"$f":"IF($E63=\"\",\"\",VLOOKUP($F63,'DANE - K2 lit.C'!$B$14:$I$114,8,0))","v":"większy niż 50 minut"},null,0.8,{"$f":"IF($D63=Buski[[#Headers],[Buski]],VLOOKUP($E63,Buski[Buski],1,0),IF($D63=Jędrzejowski[[#Headers],[Jędrzejowski]],VLOOKUP($E63,Jędrzejowski[Jędrzejowski],1,0),IF($D63=Kazimierski[[#Headers],[Kazimierski]],VLOOKUP($E63,Kazimierski[Kazimierski],1,0),IF($D63=Kielecki[[#Headers],[Kielecki]],VLOOKUP($E63,Kielecki[Kielecki],1,0),IF($D63=Konecki[[#Headers],[Konecki]],VLOOKUP($E63,Konecki[Konecki],1,0),IF($D63=Opatowski[[#Headers],[Opatowski]],VLOOKUP($E63,Opatowski[Opatowski],1,0),IF($D63=Ostrowiecki[[#Headers],[Ostrowiecki]],VLOOKUP($E63,Ostrowiecki[Ostrowiecki],1,0),IF($D63=Pińczowski[[#Headers],[Pińczowski]],VLOOKUP($E63,Pińczowski[Pińczowski],1,0),IF($D63=Sandomierski[[#Headers],[Sandomierski]],VLOOKUP($E63,Sandomierski[Sandomierski],1,0),IF($D63=Skarżyski[[#Headers],[Skarżyski]],VLOOKUP($E63,Skarżyski[Skarżyski],1,0),IF($D63=Starachowicki[[#Headers],[Starachowicki]],VLOOKUP($E63,Starachowicki[Starachowicki],1,0),IF($D63=Staszowski[[#Headers],[Staszowski]],VLOOKUP($E63,Staszowski[Staszowski],1,0),IF($D63=Włoszczowski[[#Headers],[Włoszczowski]],VLOOKUP($E63,Włoszczowski[Włoszczowski],1,0),\"\")))))))))))))","v":"Solec-Zdrój"},"buski"]
[null,null,null,"buski","Stopnica","gmina Stopnica",{"$f":"VLOOKUP($F64,'DANE - TERC'!$D$6:$P$119,10,0)","v":2601063},{"$f":"VLOOKUP($F64,'DANE - TERC'!$D$6:$P$119,12,0)","v":"GM-W"},{"$f":"VLOOKUP($F64,'DANE - K1 lit.A'!$D$6:$M$119,4,0)","v":"NIE"},{"$f":"VLOOKUP($F64,'DANE - K1 lit.A'!$D$6:$M$119,5,0)","v":"NIE"},{"$f":"VLOOKUP($F64,'DANE - K1 lit.A'!$D$6:$M$119,6,0)","v":"NIE"},{"$f":"IF($E64=\"\",\"\",VLOOKUP($F64,'DANE - K4 lit.B'!$D$6:$E$107,2,0))","v":"NIE"},{"$f":"IF($E64=\"\",\"\",VLOOKUP($F64,'DANE - K2 lit.C'!$B$14:$I$114,8,0))","v":"w przedziale od 30 do 50 minut"},null,0.8,{"$f":"IF($D64=Buski[[#Headers],[Buski]],VLOOKUP($E64,Buski[Buski],1,0),IF($D64=Jędrzejowski[[#Headers],[Jędrzejowski]],VLOOKUP($E64,Jędrzejowski[Jędrzejowski],1,0),IF($D64=Kazimierski[[#Headers],[Kazimierski]],VLOOKUP($E64,Kazimierski[Kazimierski],1,0),IF($D64=Kielecki[[#Headers],[Kielecki]],VLOOKUP($E64,Kielecki[Kielecki],1,0),IF($D64=Konecki[[#Headers],[Konecki]],VLOOKUP($E64,Konecki[Konecki],1,0),IF($D64=Opatowski[[#Headers],[Opatowski]],VLOOKUP($E64,Opatowski[Opatowski],1,0),IF($D64=Ostrowiecki[[#Headers],[Ostrowiecki]],VLOOKUP($E64,Ostrowiecki[Ostrowiecki],1,0),IF($D64=Pińczowski[[#Headers],[Pińczowski]],VLOOKUP($E64,Pińczowski[Pińczowski],1,0),IF($D64=Sandomierski[[#Headers],[Sandomierski]],VLOOKUP($E64,Sandomierski[Sandomierski],1,0),IF($D64=Skarżyski[[#Headers],[Skarżyski]],VLOOKUP($E64,Skarżyski[Skarżyski],1,0),IF($D64=Starachowicki[[#Headers],[Starachowicki]],VLOOKUP($E64,Starachowicki[Starachowicki],1,0),IF($D64=Staszowski[[#Headers],[Staszowski]],VLOOKUP($E64,Staszowski[Staszowski],1,0),IF($D64=Włoszczowski[[#Headers],[Włoszczowski]],VLOOKUP($E64,Włoszczowski[Włoszczowski],1,0),\"\")))))))))))))","v":"Stopnica"},"buski"]
[null,null,null,"buski","Tuczępy","gmina Tuczępy",{"$f":"VLOOKUP($F65,'DANE - TERC'!$D$6:$P$119,10,0)","v":2601072},{"$f":"VLOOKUP($F65,'DANE - TERC'!$D$6:$P$119,12,0)","v":"GW"},{"$f":"VLOOKUP($F65,'DANE - K1 lit.A'!$D$6:$M$119,4,0)","v":"NIE"},{"$f":"VLOOKUP($F65,'DANE - K1 lit.A'!$D$6:$M$119,5,0)","v":"NIE"},{"$f":"VLOOKUP($F65,'DANE - K1 lit.A'!$D$6:$M$119,6,0)","v":"NIE"},{"$f":"IF($E65=\"\",\"\",VLOOKUP($F65,'DANE - K4 lit.B'!$D$6:$E$107,2,0))","v":"NIE"},{"$f":"IF($E65=\"\",\"\",VLOOKUP($F65,'DANE - K2 lit.C'!$B$14:$I$114,8,0))","v":"w przedziale od 30 do 50 minut"},null,0.6,{"$f":"IF($D65=Buski[[#Headers],[Buski]],VLOOKUP($E65,Buski[Buski],1,0),IF($D65=Jędrzejowski[[#Headers],[Jędrzejowski]],VLOOKUP($E65,Jędrzejowski[Jędrzejowski],1,0),IF($D65=Kazimierski[[#Headers],[Kazimierski]],VLOOKUP($E65,Kazimierski[Kazimierski],1,0),IF($D65=Kielecki[[#Headers],[Kielecki]],VLOOKUP($E65,Kielecki[Kielecki],1,0),IF($D65=Konecki[[#Headers],[Konecki]],VLOOKUP($E65,Konecki[Konecki],1,0),IF($D65=Opatowski[[#Headers],[Opatowski]],VLOOKUP($E65,Opatowski[Opatowski],1,0),IF($D65=Ostrowiecki[[#Headers],[Ostrowiecki]],VLOOKUP($E65,Ostrowiecki[Ostrowiecki],1,0),IF($D65=Pińczowski[[#Headers],[Pińczowski]],VLOOKUP($E65,Pińczowski[Pińczowski],1,0),IF($D65=Sandomierski[[#Headers],[Sandomierski]],VLOOKUP($E65,Sandomierski[Sandomierski],1,0),IF($D65=Skarżyski[[#Headers],[Skarżyski]],VLOOKUP($E65,Skarżyski[Skarżyski],1,0),IF($D65=Starachowicki[[#Headers],[Starachowicki]],VLOOKUP($E65,Starachowicki[Starachowicki],1,0),IF($D65=Staszowski[[#Headers],[Staszowski]],VLOOKUP($E65,Staszowski[Staszowski],1,0),IF($D65=Włoszczowski[[#Headers],[Włoszczowski]],VLOOKUP($E65,Włoszczowski[Włoszczowski],1,0),\"\")))))))))))))","v":"Tuczępy"},"buski"]
[null,null,null,"buski","Wiślica","gmina Wiślica",{"$f":"VLOOKUP($F66,'DANE - TERC'!$D$6:$P$119,10,0)","v":2601083},{"$f":"VLOOKUP($F66,'DANE - TERC'!$D$6:$P$119,12,0)","v":"GM-W"},{"$f":"VLOOKUP($F66,'DANE - K1 lit.A'!$D$6:$M$119,4,0)","v":"NIE"},{"$f":"VLOOKUP($F66,'DANE - K1 lit.A'!$D$6:$M$119,5,0)","v":"TAK"},{"$f":"VLOOKUP($F66,'DANE - K1 lit.A'!$D$6:$M$119,6,0)","v":"NIE"},{"$f":"IF($E66=\"\",\"\",VLOOKUP($F66,'DANE - K4 lit.B'!$D$6:$E$107,2,0))","v":"NIE"},{"$f":"IF($E66=\"\",\"\",VLOOKUP($F66,'DANE - K2 lit.C'!$B$14:$I$114,8,0))","v":"w przedziale od 30 do 50 minut"},null,0.8,{"$f":"IF($D66=Buski[[#Headers],[Buski]],VLOOKUP($E66,Buski[Buski],1,0),IF($D66=Jędrzejowski[[#Headers],[Jędrzejowski]],VLOOKUP($E66,Jędrzejowski[Jędrzejowski],1,0),IF($D66=Kazimierski[[#Headers],[Kazimierski]],VLOOKUP($E66,Kazimierski[Kazimierski],1,0),IF($D66=Kielecki[[#Headers],[Kielecki]],VLOOKUP($E66,Kielecki[Kielecki],1,0),IF($D66=Konecki[[#Headers],[Konecki]],VLOOKUP($E66,Konecki[Konecki],1,0),IF($D66=Opatowski[[#Headers],[Opatowski]],VLOOKUP($E66,Opatowski[Opatowski],1,0),IF($D66=Ostrowiecki[[#Headers],[Ostrowiecki]],VLOOKUP($E66,Ostrowiecki[Ostrowiecki],1,0),IF($D66=Pińczowski[[#Headers],[Pińczowski]],VLOOKUP($E66,Pińczowski[Pińczowski],1,0),IF($D66=Sandomierski[[#Headers],[Sandomierski]],VLOOKUP($E66,Sandomierski[Sandomierski],1,0),IF($D66=Skarżyski[[#Headers],[Skarżyski]],VLOOKUP($E66,Skarżyski[Skarżyski],1,0),IF($D66=Starachowicki[[#Headers],[Starachowicki]],VLOOKUP($E66,Starachowicki[Starachowicki],1,0),IF($D66=Staszowski[[#Headers],[Staszowski]],VLOOKUP($E66,Staszowski[Staszowski],1,0),IF($D66=Włoszczowski[[#Headers],[Włoszczowski]],VLOOKUP($E66,Włoszczowski[Włoszczowski],1,0),\"\")))))))))))))","v":"Wiślica"},"buski"]
[null,null,null,"jędrzejowski","Imielno","gmina Imielno",{"$f":"VLOOKUP($F67,'DANE - TERC'!$D$6:$P$119,10,0)","v":2602012},{"$f":"VLOOKUP($F67,'DANE - TERC'!$D$6:$P$119,12,0)","v":"GW"},{"$f":"VLOOKUP($F67,'DANE - K1 lit.A'!$D$6:$M$119,4,0)","v":"NIE"},{"$f":"VLOOKUP($F67,'DANE - K1 lit.A'!$D$6:$M$119,5,0)","v":"NIE"},{"$f":"VLOOKUP($F67,'DANE - K1 lit.A'!$D$6:$M$119,6,0)","v":"NIE"},{"$f":"IF($E67=\"\",\"\",VLOOKUP($F67,'DANE - K4 lit.B'!$D$6:$E$107,2,0))","v":"NIE"},{"$f":"IF($E67=\"\",\"\",VLOOKUP($F67,'DANE - K2 lit.C'!$B$14:$I$114,8,0))","v":"w przedziale od 30 do 50 minut"},null,0.8,{"$f":"IF($D67=Buski[[#Headers],[Buski]],VLOOKUP($E67,Buski[Buski],1,0),IF($D67=Jędrzejowski[[#Headers],[Jędrzejowski]],VLOOKUP($E67,Jędrzejowski[Jędrzejowski],1,0),IF($D67=Kazimierski[[#Headers],[Kazimierski]],VLOOKUP($E67,Kazimierski[Kazimierski],1,0),IF($D67=Kielecki[[#Headers],[Kielecki]],VLOOKUP($E67,Kielecki[Kielecki],1,0),IF($D67=Konecki[[#Headers],[Konecki]],VLOOKUP($E67,Konecki[Konecki],1,0),IF($D67=Opatowski[[#Headers],[Opatowski]],VLOOKUP($E67,Opatowski[Opatowski],1,0),IF($D67=Ostrowiecki[[#Headers],[Ostrowiecki]],VLOOKUP($E67,Ostrowiecki[Ostrowiecki],1,0),IF($D67=Pińczowski[[#Headers],[Pińczowski]],VLOOKUP($E67,Pińczowski[Pińczowski],1,0),IF($D67=Sandomierski[[#Headers],[Sandomierski]],VLOOKUP($E67,Sandomierski[Sandomierski],1,0),IF($D67=Skarżyski[[#Headers],[Skarżyski]],VLOOKUP($E67,Skarżyski[Skarżyski],1,0),IF($D67=Starachowicki[[#Headers],[Starachowicki]],VLOOKUP($E67,Starachowicki[Starachowicki],1,0),IF($D67=Staszowski[[#Headers],[Staszowski]],VLOOKUP($E67,Staszowski[Staszowski],1,0),IF($D67=Włoszczowski[[#Headers],[Włoszczowski]],VLOOKUP($E67,Włoszczowski[Włoszczowski],1,0),\"\")))))))))))))","v":"Imielno"},"jędrzejowski"]
[null,null,null,"jędrzejowski","Jędrzejów","gmina Jędrzejów",{"$f":"VLOOKUP($F68,'DANE - TERC'!$D$6:$P$119,10,0)","v":2602023},{"$f":"VLOOKUP($F68,'DANE - TERC'!$D$6:$P$119,12,0)","v":"GM-W"},{"$f":"VLOOKUP($F68,'DANE - K1 lit.A'!$D$6:$M$119,4,0)","v":"TAK"},{"$f":"VLOOKUP($F68,'DANE - K1 lit.A'!$D$6:$M$119,5,0)","v":"TAK"},{"$f":"VLOOKUP($F68,'DANE - K1 lit.A'!$D$6:$M$119,6,0)","v":"TAK"},{"$f":"IF($E68=\"\",\"\",VLOOKUP($F68,'DANE - K4 lit.B'!$D$6:$E$107,2,0))","v":"TAK"},{"$f":"IF($E68=\"\",\"\",VLOOKUP($F68,'DANE - K2 lit.C'!$B$14:$I$114,8,0))","v":"w przedziale od 30 do 50 minut"},null,0.8,{"$f":"IF($D68=Buski[[#Headers],[Buski]],VLOOKUP($E68,Buski[Buski],1,0),IF($D68=Jędrzejowski[[#Headers],[Jędrzejowski]],VLOOKUP($E68,Jędrzejowski[Jędrzejowski],1,0),IF($D68=Kazimierski[[#Headers],[Kazimierski]],VLOOKUP($E68,Kazimierski[Kazimierski],1,0),IF($D68=Kielecki[[#Headers],[Kielecki]],VLOOKUP($E68,Kielecki[Kielecki],1,0),IF($D68=Konecki[[#Headers],[Konecki]],VLOOKUP($E68,Konecki[Konecki],1,0),IF($D68=Opatowski[[#Headers],[Opatowski]],VLOOKUP($E68,Opatowski[Opatowski],1,0),IF($D68=Ostrowiecki[[#Headers],[Ostrowiecki]],VLOOKUP($E68,Ostrowiecki[Ostrowiecki],1,0),IF($D68=Pińczowski[[#Headers],[Pińczowski]],VLOOKUP($E68,Pińczowski[Pińczowski],1,0),IF($D68=Sandomierski[[#Headers],[Sandomierski]],VLOOKUP($E68,Sandomierski[Sandomierski],1,0),IF($D68=Skarżyski[[#Headers],[Skarżyski]],VLOOKUP($E68,Skarżyski[Skarżyski],1,0),IF($D68=Starachowicki[[#Headers],[Starachowicki]],VLOOKUP($E68,Starachowicki[Starachowicki],1,0),IF($D68=Staszowski[[#Headers],[Staszowski]],VLOOKUP($E68,Staszowski[Staszowski],1,0),IF($D68=Włoszczowski[[#Headers],[Włoszczowski]],VLOOKUP($E68,Włoszczowski[Włoszczowski],1,0),\"\")))))))))))))","v":"Jędrzejów"},"jędrzejowski"]
[null,null,null,"jędrzejowski","Małogoszcz","gmina Małogoszcz",{"$f":"VLOOKUP($F69,'DANE - TERC'!$D$6:$P$119,10,0)","v":2602033},{"$f":"VLOOKUP($F69,'DANE - TERC'!$D$6:$P$119,12,0)","v":"GM-W"},{"$f":"VLOOKUP($F69,'DANE - K1 lit.A'!$D$6:$M$119,4,0)","v":"TAK"},{"$f":"VLOOKUP($F69,'DANE - K1 lit.A'!$D$6:$M$119,5,0)","v":"TAK"},{"$f":"VLOOKUP($F69,'DANE - K1 lit.A'!$D$6:$M$119,6,0)","v":"TAK"},{"$f":"IF($E69=\"\",\"\",VLOOKUP($F69,'DANE - K4 lit.B'!$D$6:$E$107,2,0))","v":"NIE"},{"$f":"IF($E69=\"\",\"\",VLOOKUP($F69,'DANE - K2 lit.C'!$B$14:$I$114,8,0))","v":"w przedziale od 30 do 50 minut"},null,0.6,{"$f":"IF($D69=Buski[[#Headers],[Buski]],VLOOKUP($E69,Buski[Buski],1,0),IF($D69=Jędrzejowski[[#Headers],[Jędrzejowski]],VLOOKUP($E69,Jędrzejowski[Jędrzejowski],1,0),IF($D69=Kazimierski[[#Headers],[Kazimierski]],VLOOKUP($E69,Kazimierski[Kazimierski],1,0),IF($D69=Kielecki[[#Headers],[Kielecki]],VLOOKUP($E69,Kielecki[Kielecki],1,0),IF($D69=Konecki[[#Headers],[Konecki]],VLOOKUP($E69,Konecki[Konecki],1,0),IF($D69=Opatowski[[#Headers],[Opatowski]],VLOOKUP($E69,Opatowski[Opatowski],1,0),IF($D69=Ostrowiecki[[#Headers],[Ostrowiecki]],VLOOKUP($E69,Ostrowiecki[Ostrowiecki],1,0),IF($D69=Pińczowski[[#Headers],[Pińczowski]],VLOOKUP($E69,Pińczowski[Pińczowski],1,0),IF($D69=Sandomierski[[#Headers],[Sandomierski]],VLOOKUP($E69,Sandomierski[Sandomierski],1,0),IF($D69=Skarżyski[[#Headers],[Skarżyski]],VLOOKUP($E69,Skarżyski[Skarżyski],1,0),IF($D69=Starachowicki[[#Headers],[Starachowicki]],VLOOKUP($E69,Starachowicki[Starachowicki],1,0),IF($D69=Staszowski[[#Headers],[Staszowski]],VLOOKUP($E69,Staszowski[Staszowski],1,0),IF($D69=Włoszczowski[[#Headers],[Włoszczowski]],VLOOKUP($E69,Włoszczowski[Włoszczowski],1,0),\"\")))))))))))))","v":"Małogoszcz"},"jędrzejowski"]
[null,null,null,"jędrzejowski","Nagłowice","gmina Nagłowice",{"$f":"VLOOKUP($F70,'DANE - TERC'!$D$6:$P$119,10,0)","v":2602042},{"$f":"VLOOKUP($F70,'DANE - TERC'!$D$6:$P$119,12,0)","v":"GW"},{"$f":"VLOOKUP($F70,'DANE - K1 lit.A'!$D$6:$M$119,4,0)","v":"NIE"},{"$f":"VLOOKUP($F70,'DANE - K1 lit.A'!$D$6:$M$119,5,0)","v":"TAK"},{"$f":"VLOOKUP($F70,'DANE - K1 lit.A'!$D$6:$M$119,6,0)","v":"NIE"},{"$f":"IF($E70=\"\",\"\",VLOOKUP($F70,'DANE - K4 lit.B'!$D$6:$E$107,2,0))","v":"NIE"},{"$f":"IF($E70=\"\",\"\",VLOOKUP($F70,'DANE - K2 lit.C'!$B$14:$I$114,8,0))","v":"w przedziale od 30 do 50 minut"},null,0.8,{"$f":"IF($D70=Buski[[#Headers],[Buski]],VLOOKUP($E70,Buski[Buski],1,0),IF($D70=Jędrzejowski[[#Headers],[Jędrzejowski]],VLOOKUP($E70,Jędrzejowski[Jędrzejowski],1,0),IF($D70=Kazimierski[[#Headers],[Kazimierski]],VLOOKUP($E70,Kazimierski[Kazimierski],1,0),IF($D70=Kielecki[[#Headers],[Kielecki]],VLOOKUP($E70,Kielecki[Kielecki],1,0),IF($D70=Konecki[[#Headers],[Konecki]],VLOOKUP($E70,Konecki[Konecki],1,0),IF($D70=Opatowski[[#Headers],[Opatowski]],VLOOKUP($E70,Opatowski[Opatowski],1,0),IF($D70=Ostrowiecki[[#Headers],[Ostrowiecki]],VLOOKUP($E70,Ostrowiecki[Ostrowiecki],1,0),IF($D70=Pińczowski[[#Headers],[Pińczowski]],VLOOKUP($E70,Pińczowski[Pińczowski],1,0),IF($D70=Sandomierski[[#Headers],[Sandomierski]],VLOOKUP($E70,Sandomierski[Sandomierski],1,0),IF($D70=Skarżyski[[#Headers],[Skarżyski]],VLOOKUP($E70,Skarżyski[Skarżyski],1,0),IF($D70=Starachowicki[[#Headers],[Starachowicki]],VLOOKUP($E70,Starachowicki[Starachowicki],1,0),IF($D70=Staszowski[[#Headers],[Staszowski]],VLOOKUP($E70,Staszowski[Staszowski],1,0),IF($D70=Włoszczowski[[#Headers],[Włoszczowski]],VLOOKUP($E70,Włoszczowski[Włoszczowski],1,0),\"\")))))))))))))","v":"Nagłowice"},"jędrzejowski"]
[null,null,null,"jędrzejowski","Oksa","gmina Oksa",{"$f":"VLOOKUP($F71,'DANE - TERC'!$D$6:$P$119,10,0)","v":2602052},{"$f":"VLOOKUP($F71,'DANE - TERC'!$D$6:$P$119,12,0)","v":"GW"},{"$f":"VLOOKUP($F71,'DANE - K1 lit.A'!$D$6:$M$119,4,0)","v":"NIE"},{"$f":"VLOOKUP($F71,'DANE - K1 lit.A'!$D$6:$M$119,5,0)","v":"NIE"},{"$f":"VLOOKUP($F71,'DANE - K1 lit.A'!$D$6:$M$119,6,0)","v":"NIE"},{"$f":"IF($E71=\"\",\"\",VLOOKUP($F71,'DANE - K4 lit.B'!$D$6:$E$107,2,0))","v":"NIE"},{"$f":"IF($E71=\"\",\"\",VLOOKUP($F71,'DANE - K2 lit.C'!$B$14:$I$114,8,0))","v":"w przedziale od 30 do 50 minut"},null,0.8,{"$f":"IF($D71=Buski[[#Headers],[Buski]],VLOOKUP($E71,Buski[Buski],1,0),IF($D71=Jędrzejowski[[#Headers],[Jędrzejowski]],VLOOKUP($E71,Jędrzejowski[Jędrzejowski],1,0),IF($D71=Kazimierski[[#Headers],[Kazimierski]],VLOOKUP($E71,Kazimierski[Kazimierski],1,0),IF($D71=Kielecki[[#Headers],[Kielecki]],VLOOKUP($E71,Kielecki[Kielecki],1,0),IF($D71=Konecki[[#Headers],[Konecki]],VLOOKUP($E71,Konecki[Konecki],1,0),IF($D71=Opatowski[[#Headers],[Opatowski]],VLOOKUP($E71,Opatowski[Opatowski],1,0),IF($D71=Ostrowiecki[[#Headers],[Ostrowiecki]],VLOOKUP($E71,Ostrowiecki[Ostrowiecki],1,0),IF($D71=Pińczowski[[#Headers],[Pińczowski]],VLOOKUP($E71,Pińczowski[Pińczowski],1,0),IF($D71=Sandomierski[[#Headers],[Sandomierski]],VLOOKUP($E71,Sandomierski[Sandomierski],1,0),IF($D71=Skarżyski[[#Headers],[Skarżyski]],VLOOKUP($E71,Skarżyski[Skarżyski],1,0),IF($D71=Starachowicki[[#Headers],[Starachowicki]],VLOOKUP($E71,Starachowicki[Starachowicki],1,0),IF($D71=Staszowski[[#Headers],[Staszowski]],VLOOKUP($E71,Staszowski[Staszowski],1,0),IF($D71=Włoszczowski[[#Headers],[Włoszczowski]],VLOOKUP($E71,Włoszczowski[Włoszczowski],1,0),\"\")))))))))))))","v":"Oksa"},"jędrzejowski"]
[null,null,null,"jędrzejowski","Sędziszów","gmina Sędziszów",{"$f":"VLOOKUP($F72,'DANE - TERC'!$D$6:$P$119,10,0)","v":2602063},{"$f":"VLOOKUP($F72,'DANE - TERC'!$D$6:$P$119,12,0)","v":"GM-W"},{"$f":"VLOOKUP($F72,'DANE - K1 lit.A'!$D$6:$M$119,4,0)","v":"TAK"},{"$f":"VLOOKUP($F72,'DANE - K1 lit.A'!$D$6:$M$119,5,0)","v":"TAK"},{"$f":"VLOOKUP($F72,'DANE - K1 lit.A'!$D$6:$M$119,6,0)","v":"TAK"},{"$f":"IF($E72=\"\",\"\",VLOOKUP($F72,'DANE - K4 lit.B'!$D$6:$E$107,2,0))","v":"NIE"},{"$f":"IF($E72=\"\",\"\",VLOOKUP($F72,'DANE - K2 lit.C'!$B$14:$I$114,8,0))","v":"większy niż 50 minut"},null,0.8,{"$f":"IF($D72=Buski[[#Headers],[Buski]],VLOOKUP($E72,Buski[Buski],1,0),IF($D72=Jędrzejowski[[#Headers],[Jędrzejowski]],VLOOKUP($E72,Jędrzejowski[Jędrzejowski],1,0),IF($D72=Kazimierski[[#Headers],[Kazimierski]],VLOOKUP($E72,Kazimierski[Kazimierski],1,0),IF($D72=Kielecki[[#Headers],[Kielecki]],VLOOKUP($E72,Kielecki[Kielecki],1,0),IF($D72=Konecki[[#Headers],[Konecki]],VLOOKUP($E72,Konecki[Konecki],1,0),IF($D72=Opatowski[[#Headers],[Opatowski]],VLOOKUP($E72,Opatowski[Opatowski],1,0),IF($D72=Ostrowiecki[[#Headers],[Ostrowiecki]],VLOOKUP($E72,Ostrowiecki[Ostrowiecki],1,0),IF($D72=Pińczowski[[#Headers],[Pińczowski]],VLOOKUP($E72,Pińczowski[Pińczowski],1,0),IF($D72=Sandomierski[[#Headers],[Sandomierski]],VLOOKUP($E72,Sandomierski[Sandomierski],1,0),IF($D72=Skarżyski[[#Headers],[Skarżyski]],VLOOKUP($E72,Skarżyski[Skarżyski],1,0),IF($D72=Starachowicki[[#Headers],[Starachowicki]],VLOOKUP($E72,Starachowicki[Starachowicki],1,0),IF($D72=Staszowski[[#Headers],[Staszowski]],VLOOKUP($E72,Staszowski[Staszowski],1,0),IF($D72=Włoszczowski[[#Headers],[Włoszczowski]],VLOOKUP($E72,Włoszczowski[Włoszczowski],1,0),\"\")))))))))))))","v":"Sędziszów"},"jędrzejowski"]
[null,null,null,"jędrzejowski","Słupia (Jędrzejowska)","gmina Słupia (Jędrzejowska)",{"$f":"VLOOKUP($F73,'DANE - TERC'!$D$6:$P$119,10,0)","v":2602072},{"$f":"VLOOKUP($F73,'DANE - TERC'!$D$6:$P$119,12,0)","v":"GW"},{"$f":"VLOOKUP($F73,'DANE - K1 lit.A'!$D$6:$M$119,4,0)","v":"NIE"},{"$f":"VLOOKUP($F73,'DANE - K1 lit.A'!$D$6:$M$119,5,0)","v":"NIE"},{"$f":"VLOOKUP($F73,'DANE - K1 lit.A'!$D$6:$M$119,6,0)","v":"NIE"},{"$f":"IF($E73=\"\",\"\",VLOOKUP($F73,'DANE - K4 lit.B'!$D$6:$E$107,2,0))","v":"NIE"},{"$f":"IF($E73=\"\",\"\",VLOOKUP($F73,'DANE - K2 lit.C'!$B$14:$I$114,8,0))","v":"większy niż 50 minut"},null,0.7,{"$f":"IF($D73=Buski[[#Headers],[Buski]],VLOOKUP($E73,Buski[Buski],1,0),IF($D73=Jędrzejowski[[#Headers],[Jędrzejowski]],VLOOKUP($E73,Jędrzejowski[Jędrzejowski],1,0),IF($D73=Kazimierski[[#Headers],[Kazimierski]],VLOOKUP($E73,Kazimierski[Kazimierski],1,0),IF($D73=Kielecki[[#Headers],[Kielecki]],VLOOKUP($E73,Kielecki[Kielecki],1,0),IF($D73=Konecki[[#Headers],[Konecki]],VLOOKUP($E73,Konecki[Konecki],1,0),IF($D73=Opatowski[[#Headers],[Opatowski]],VLOOKUP($E73,Opatowski[Opatowski],1,0),IF($D73=Ostrowiecki[[#Headers],[Ostrowiecki]],VLOOKUP($E73,Ostrowiecki[Ostrowiecki],1,0),IF($D73=Pińczowski[[#Headers],[Pińczowski]],VLOOKUP($E73,Pińczowski[Pińczowski],1,0),IF($D73=Sandomierski[[#Headers],[Sandomierski]],VLOOKUP($E73,Sandomierski[Sandomierski],1,0),IF($D73=Skarżyski[[#Headers],[Skarżyski]],VLOOKUP($E73,Skarżyski[Skarżyski],1,0),IF($D73=Starachowicki[[#Headers],[Starachowicki]],VLOOKUP($E73,Starachowicki[Starachowicki],1,0),IF($D73=Staszowski[[#Headers],[Staszowski]],VLOOKUP($E73,Staszowski[Staszowski],1,0),IF($D73=Włoszczowski[[#Headers],[Włoszczowski]],VLOOKUP($E73,Włoszczowski[Włoszczowski],1,0),\"\")))))))))))))","v":"Słupia (Jędrzejowska)"},"jędrzejowski"]
[null,null,null,"jędrzejowski","Sobków","gmina Sobków",{"$f":"VLOOKUP($F74,'DANE - TERC'!$D$6:$P$119,10,0)","v":2602083},{"$f":"VLOOKUP($F74,'DANE - TERC'!$D$6:$P$119,12,0)","v":"GM-W"},{"$f":"VLOOKUP($F74,'DANE - K1 lit.A'!$D$6:$M$119,4,0)","v":"TAK"},{"$f":"VLOOKUP($F74,'DANE - K1 lit.A'!$D$6:$M$119,5,0)","v":"TAK"},{"$f":"VLOOKUP($F74,'DANE - K1 lit.A'!$D$6:$M$119,6,0)","v":"TAK"},{"$f":"IF($E74=\"\",\"\",VLOOKUP($F74,'DANE - K4 lit.B'!$D$6:$E$107,2,0))","v":"NIE"},{"$f":"IF($E74=\"\",\"\",VLOOKUP($F74,'DANE - K2 lit.C'!$B$14:$I$114,8,0))","v":"mniejszy niż 30 minut"},null,0.8,{"$f":"IF($D74=Buski[[#Headers],[Buski]],VLOOKUP($E74,Buski[Buski],1,0),IF($D74=Jędrzejowski[[#Headers],[Jędrzejowski]],VLOOKUP($E74,Jędrzejowski[Jędrzejowski],1,0),IF($D74=Kazimierski[[#Headers],[Kazimierski]],VLOOKUP($E74,Kazimierski[Kazimierski],1,0),IF($D74=Kielecki[[#Headers],[Kielecki]],VLOOKUP($E74,Kielecki[Kielecki],1,0),IF($D74=Konecki[[#Headers],[Konecki]],VLOOKUP($E74,Konecki[Konecki],1,0),IF($D74=Opatowski[[#Headers],[Opatowski]],VLOOKUP($E74,Opatowski[Opatowski],1,0),IF($D74=Ostrowiecki[[#Headers],[Ostrowiecki]],VLOOKUP($E74,Ostrowiecki[Ostrowiecki],1,0),IF($D74=Pińczowski[[#Headers],[Pińczowski]],VLOOKUP($E74,Pińczowski[Pińczowski],1,0),IF($D74=Sandomierski[[#Headers],[Sandomierski]],VLOOKUP($E74,Sandomierski[Sandomierski],1,0),IF($D74=Skarżyski[[#Headers],[Skarżyski]],VLOOKUP($E74,Skarżyski[Skarżyski],1,0),IF($D74=Starachowicki[[#Headers],[Starachowicki]],VLOOKUP($E74,Starachowicki[Starachowicki],1,0),IF($D74=Staszowski[[#Headers],[Staszowski]],VLOOKUP($E74,Staszowski[Staszowski],1,0),IF($D74=Włoszczowski[[#Headers],[Włoszczowski]],VLOOKUP($E74,Włoszczowski[Włoszczowski],1,0),\"\")))))))))))))","v":"Sobków"},"jędrzejowski"]
[null,null,null,"jędrzejowski","Wodzisław","gmina Wodzisław",{"$f":"VLOOKUP($F75,'DANE - TERC'!$D$6:$P$119,10,0)","v":2602093},{"$f":"VLOOKUP($F75,'DANE - TERC'!$D$6:$P$119,12,0)","v":"GM-W"},{"$f":"VLOOKUP($F75,'DANE - K1 lit.A'!$D$6:$M$119,4,0)","v":"TAK"},{"$f":"VLOOKUP($F75,'DANE - K1 lit.A'!$D$6:$M$119,5,0)","v":"TAK"},{"$f":"VLOOKUP($F75,'DANE - K1 lit.A'!$D$6:$M$119,6,0)","v":"NIE"},{"$f":"IF($E75=\"\",\"\",VLOOKUP($F75,'DANE - K4 lit.B'!$D$6:$E$107,2,0))","v":"NIE"},{"$f":"IF($E75=\"\",\"\",VLOOKUP($F75,'DANE - K2 lit.C'!$B$14:$I$114,8,0))","v":"w przedziale od 30 do 50 minut"},null,0.8,{"$f":"IF($D75=Buski[[#Headers],[Buski]],VLOOKUP($E75,Buski[Buski],1,0),IF($D75=Jędrzejowski[[#Headers],[Jędrzejowski]],VLOOKUP($E75,Jędrzejowski[Jędrzejowski],1,0),IF($D75=Kazimierski[[#Headers],[Kazimierski]],VLOOKUP($E75,Kazimierski[Kazimierski],1,0),IF($D75=Kielecki[[#Headers],[Kielecki]],VLOOKUP($E75,Kielecki[Kielecki],1,0),IF($D75=Konecki[[#Headers],[Konecki]],VLOOKUP($E75,Konecki[Konecki],1,0),IF($D75=Opatowski[[#Headers],[Opatowski]],VLOOKUP($E75,Opatowski[Opatowski],1,0),IF($D75=Ostrowiecki[[#Headers],[Ostrowiecki]],VLOOKUP($E75,Ostrowiecki[Ostrowiecki],1,0),IF($D75=Pińczowski[[#Headers],[Pińczowski]],VLOOKUP($E75,Pińczowski[Pińczowski],1,0),IF($D75=Sandomierski[[#Headers],[Sandomierski]],VLOOKUP($E75,Sandomierski[Sandomierski],1,0),IF($D75=Skarżyski[[#Headers],[Skarżyski]],VLOOKUP($E75,Skarżyski[Skarżyski],1,0),IF($D75=Starachowicki[[#Headers],[Starachowicki]],VLOOKUP($E75,Starachowicki[Starachowicki],1,0),IF($D75=Staszowski[[#Headers],[Staszowski]],VLOOKUP($E75,Staszowski[Staszowski],1,0),IF($D75=Włoszczowski[[#Headers],[Włoszczowski]],VLOOKUP($E75,Włoszczowski[Włoszczowski],1,0),\"\")))))))))))))","v":"Wodzisław"},"jędrzejowski"]
[null,null,null,"kazimierski","Bejsce","gmina Bejsce",{"$f":"VLOOKUP($F76,'DANE - TERC'!$D$6:$P$119,10,0)","v":2603012},{"$f":"VLOOKUP($F76,'DANE - TERC'!$D$6:$P$119,12,0)","v":"GW"},{"$f":"VLOOKUP($F76,'DANE - K1 lit.A'!$D$6:$M$119,4,0)","v":"NIE"},{"$f":"VLOOKUP($F76,'DANE - K1 lit.A'!$D$6:$M$119,5,0)","v":"NIE"},{"$f":"VLOOKUP($F76,'DANE - K1 lit.A'!$D$6:$M$119,6,0)","v":"NIE"},{"$f":"IF($E76=\"\",\"\",VLOOKUP($F76,'DANE - K4 lit.B'!$D$6:$E$107,2,0))","v":"NIE"},{"$f":"IF($E76=\"\",\"\",VLOOKUP($F76,'DANE - K2 lit.C'!$B$14:$I$114,8,0))","v":"w przedziale od 30 do 50 minut"},null,0.8,{"$f":"IF($D76=Buski[[#Headers],[Buski]],VLOOKUP($E76,Buski[Buski],1,0),IF($D76=Jędrzejowski[[#Headers],[Jędrzejowski]],VLOOKUP($E76,Jędrzejowski[Jędrzejowski],1,0),IF($D76=Kazimierski[[#Headers],[Kazimierski]],VLOOKUP($E76,Kazimierski[Kazimierski],1,0),IF($D76=Kielecki[[#Headers],[Kielecki]],VLOOKUP($E76,Kielecki[Kielecki],1,0),IF($D76=Konecki[[#Headers],[Konecki]],VLOOKUP($E76,Konecki[Konecki],1,0),IF($D76=Opatowski[[#Headers],[Opatowski]],VLOOKUP($E76,Opatowski[Opatowski],1,0),IF($D76=Ostrowiecki[[#Headers],[Ostrowiecki]],VLOOKUP($E76,Ostrowiecki[Ostrowiecki],1,0),IF($D76=Pińczowski[[#Headers],[Pińczowski]],VLOOKUP($E76,Pińczowski[Pińczowski],1,0),IF($D76=Sandomierski[[#Headers],[Sandomierski]],VLOOKUP($E76,Sandomierski[Sandomierski],1,0),IF($D76=Skarżyski[[#Headers],[Skarżyski]],VLOOKUP($E76,Skarżyski[Skarżyski],1,0),IF($D76=Starachowicki[[#Headers],[Starachowicki]],VLOOKUP($E76,Starachowicki[Starachowicki],1,0),IF($D76=Staszowski[[#Headers],[Staszowski]],VLOOKUP($E76,Staszowski[Staszowski],1,0),IF($D76=Włoszczowski[[#Headers],[Włoszczowski]],VLOOKUP($E76,Włoszczowski[Włoszczowski],1,0),\"\")))))))))))))","v":"Bejsce"},"kazimierski"]
[null,null,null,"kazimierski","Czarnocin","gmina Czarnocin",{"$f":"VLOOKUP($F77,'DANE - TERC'!$D$6:$P$119,10,0)","v":2603022},{"$f":"VLOOKUP($F77,'DANE - TERC'!$D$6:$P$119,12,0)","v":"GW"},{"$f":"VLOOKUP($F77,'DANE - K1 lit.A'!$D$6:$M$119,4,0)","v":"NIE"},{"$f":"VLOOKUP($F77,'DANE - K1 lit.A'!$D$6:$M$119,5,0)","v":"NIE"},{"$f":"VLOOKUP($F77,'DANE - K1 lit.A'!$D$6:$M$119,6,0)","v":"NIE"},{"$f":"IF($E77=\"\",\"\",VLOOKUP($F77,'DANE - K4 lit.B'!$D$6:$E$107,2,0))","v":"NIE"},{"$f":"IF($E77=\"\",\"\",VLOOKUP($F77,'DANE - K2 lit.C'!$B$14:$I$114,8,0))","v":"większy niż 50 minut"},null,0.8,{"$f":"IF($D77=Buski[[#Headers],[Buski]],VLOOKUP($E77,Buski[Buski],1,0),IF($D77=Jędrzejowski[[#Headers],[Jędrzejowski]],VLOOKUP($E77,Jędrzejowski[Jędrzejowski],1,0),IF($D77=Kazimierski[[#Headers],[Kazimierski]],VLOOKUP($E77,Kazimierski[Kazimierski],1,0),IF($D77=Kielecki[[#Headers],[Kielecki]],VLOOKUP($E77,Kielecki[Kielecki],1,0),IF($D77=Konecki[[#Headers],[Konecki]],VLOOKUP($E77,Konecki[Konecki],1,0),IF($D77=Opatowski[[#Headers],[Opatowski]],VLOOKUP($E77,Opatowski[Opatowski],1,0),IF($D77=Ostrowiecki[[#Headers],[Ostrowiecki]],VLOOKUP($E77,Ostrowiecki[Ostrowiecki],1,0),IF($D77=Pińczowski[[#Headers],[Pińczowski]],VLOOKUP($E77,Pińczowski[Pińczowski],1,0),IF($D77=Sandomierski[[#Headers],[Sandomierski]],VLOOKUP($E77,Sandomierski[Sandomierski],1,0),IF($D77=Skarżyski[[#Headers],[Skarżyski]],VLOOKUP($E77,Skarżyski[Skarżyski],1,0),IF($D77=Starachowicki[[#Headers],[Starachowicki]],VLOOKUP($E77,Starachowicki[Starachowicki],1,0),IF($D77=Staszowski[[#Headers],[Staszowski]],VLOOKUP($E77,Staszowski[Staszowski],1,0),IF($D77=Włoszczowski[[#Headers],[Włoszczowski]],VLOOKUP($E77,Włoszczowski[Włoszczowski],1,0),\"\")))))))))))))","v":"Czarnocin"},"kazimierski"]
[null,null,null,"kazimierski","Kazimierza Wielka","gmina Kazimierza Wielka",{"$f":"VLOOKUP($F78,'DANE - TERC'!$D$6:$P$119,10,0)","v":2603033},{"$f":"VLOOKUP($F78,'DANE - TERC'!$D$6:$P$119,12,0)","v":"GM-W"},{"$f":"VLOOKUP($F78,'DANE - K1 lit.A'!$D$6:$M$119,4,0)","v":"TAK"},{"$f":"VLOOKUP($F78,'DANE - K1 lit.A'!$D$6:$M$119,5,0)","v":"TAK"},{"$f":"VLOOKUP($F78,'DANE - K1 lit.A'!$D$6:$M$119,6,0)","v":"NIE"},{"$f":"IF($E78=\"\",\"\",VLOOKUP($F78,'DANE - K4 lit.B'!$D$6:$E$107,2,0))","v":"NIE"},{"$f":"IF($E78=\"\",\"\",VLOOKUP($F78,'DANE - K2 lit.C'!$B$14:$I$114,8,0))","v":"w przedziale od 30 do 50 minut"},null,0.8,{"$f":"IF($D78=Buski[[#Headers],[Buski]],VLOOKUP($E78,Buski[Buski],1,0),IF($D78=Jędrzejowski[[#Headers],[Jędrzejowski]],VLOOKUP($E78,Jędrzejowski[Jędrzejowski],1,0),IF($D78=Kazimierski[[#Headers],[Kazimierski]],VLOOKUP($E78,Kazimierski[Kazimierski],1,0),IF($D78=Kielecki[[#Headers],[Kielecki]],VLOOKUP($E78,Kielecki[Kielecki],1,0),IF($D78=Konecki[[#Headers],[Konecki]],VLOOKUP($E78,Konecki[Konecki],1,0),IF($D78=Opatowski[[#Headers],[Opatowski]],VLOOKUP($E78,Opatowski[Opatowski],1,0),IF($D78=Ostrowiecki[[#Headers],[Ostrowiecki]],VLOOKUP($E78,Ostrowiecki[Ostrowiecki],1,0),IF($D78=Pińczowski[[#Headers],[Pińczowski]],VLOOKUP($E78,Pińczowski[Pińczowski],1,0),IF($D78=Sandomierski[[#Headers],[Sandomierski]],VLOOKUP($E78,Sandomierski[Sandomierski],1,0),IF($D78=Skarżyski[[#Headers],[Skarżyski]],VLOOKUP($E78,Skarżyski[Skarżyski],1,0),IF($D78=Starachowicki[[#Headers],[Starachowicki]],VLOOKUP($E78,Starachowicki[Starachowicki],1,0),IF($D78=Staszowski[[#Headers],[Staszowski]],VLOOKUP($E78,Staszowski[Staszowski],1,0),IF($D78=Włoszczowski[[#Headers],[Włoszczowski]],VLOOKUP($E78,Włoszczowski[Włoszczowski],1,0),\"\")))))))))))))","v":"Kazimierza Wielka"},"kazimierski"]
[null,null,null,"kazimierski","Opatowiec","gmina Opatowiec",{"$f":"VLOOKUP($F79,'DANE - TERC'!$D$6:$P$119,10,0)","v":2603043},{"$f":"VLOOKUP($F79,'DANE - TERC'!$D$6:$P$119,12,0)","v":"GM-W"},{"$f":"VLOOKUP($F79,'DANE - K1 lit.A'!$D$6:$M$119,4,0)","v":"NIE"},{"$f":"VLOOKUP($F79,'DANE - K1 lit.A'!$D$6:$M$119,5,0)","v":"NIE"},{"$f":"VLOOKUP($F79,'DANE - K1 lit.A'!$D$6:$M$119,6,0)","v":"NIE"},{"$f":"IF($E79=\"\",\"\",VLOOKUP($F79,'DANE - K4 lit.B'!$D$6:$E$107,2,0))","v":"NIE"},{"$f":"IF($E79=\"\",\"\",VLOOKUP($F79,'DANE - K2 lit.C'!$B$14:$I$114,8,0))","v":"większy niż 50 minut"},null,0.7,{"$f":"IF($D79=Buski[[#Headers],[Buski]],VLOOKUP($E79,Buski[Buski],1,0),IF($D79=Jędrzejowski[[#Headers],[Jędrzejowski]],VLOOKUP($E79,Jędrzejowski[Jędrzejowski],1,0),IF($D79=Kazimierski[[#Headers],[Kazimierski]],VLOOKUP($E79,Kazimierski[Kazimierski],1,0),IF($D79=Kielecki[[#Headers],[Kielecki]],VLOOKUP($E79,Kielecki[Kielecki],1,0),IF($D79=Konecki[[#Headers],[Konecki]],VLOOKUP($E79,Konecki[Konecki],1,0),IF($D79=Opatowski[[#Headers],[Opatowski]],VLOOKUP($E79,Opatowski[Opatowski],1,0),IF($D79=Ostrowiecki[[#Headers],[Ostrowiecki]],VLOOKUP($E79,Ostrowiecki[Ostrowiecki],1,0),IF($D79=Pińczowski[[#Headers],[Pińczowski]],VLOOKUP($E79,Pińczowski[Pińczowski],1,0),IF($D79=Sandomierski[[#Headers],[Sandomierski]],VLOOKUP($E79,Sandomierski[Sandomierski],1,0),IF($D79=Skarżyski[[#Headers],[Skarżyski]],VLOOKUP($E79,Skarżyski[Skarżyski],1,0),IF($D79=Starachowicki[[#Headers],[Starachowicki]],VLOOKUP($E79,Starachowicki[Starachowicki],1,0),IF($D79=Staszowski[[#Headers],[Staszowski]],VLOOKUP($E79,Staszowski[Staszowski],1,0),IF($D79=Włoszczowski[[#Headers],[Włoszczowski]],VLOOKUP($E79,Włoszczowski[Włoszczowski],1,0),\"\")))))))))))))","v":"Opatowiec"},"kazimierski"]
[null,null,null,"kazimierski","Skalbmierz","gmina Skalbmierz",{"$f":"VLOOKUP($F80,'DANE - TERC'!$D$6:$P$119,10,0)","v":2603053},{"$f":"VLOOKUP($F80,'DANE - TERC'!$D$6:$P$119,12,0)","v":"GM-W"},{"$f":"VLOOKUP($F80,'DANE - K1 lit.A'!$D$6:$M$119,4,0)","v":"TAK"},{"$f":"VLOOKUP($F80,'DANE - K1 lit.A'!$D$6:$M$119,5,0)","v":"TAK"},{"$f":"VLOOKUP($F80,'DANE - K1 lit.A'!$D$6:$M$119,6,0)","v":"NIE"},{"$f":"IF($E80=\"\",\"\",VLOOKUP($F80,'DANE - K4 lit.B'!$D$6:$E$107,2,0))","v":"NIE"},{"$f":"IF($E80=\"\",\"\",VLOOKUP($F80,'DANE - K2 lit.C'!$B$14:$I$114,8,0))","v":"w przedziale od 30 do 50 minut"},null,0.8,{"$f":"IF($D80=Buski[[#Headers],[Buski]],VLOOKUP($E80,Buski[Buski],1,0),IF($D80=Jędrzejowski[[#Headers],[Jędrzejowski]],VLOOKUP($E80,Jędrzejowski[Jędrzejowski],1,0),IF($D80=Kazimierski[[#Headers],[Kazimierski]],VLOOKUP($E80,Kazimierski[Kazimierski],1,0),IF($D80=Kielecki[[#Headers],[Kielecki]],VLOOKUP($E80,Kielecki[Kielecki],1,0),IF($D80=Konecki[[#Headers],[Konecki]],VLOOKUP($E80,Konecki[Konecki],1,0),IF($D80=Opatowski[[#Headers],[Opatowski]],VLOOKUP($E80,Opatowski[Opatowski],1,0),IF($D80=Ostrowiecki[[#Headers],[Ostrowiecki]],VLOOKUP($E80,Ostrowiecki[Ostrowiecki],1,0),IF($D80=Pińczowski[[#Headers],[Pińczowski]],VLOOKUP($E80,Pińczowski[Pińczowski],1,0),IF($D80=Sandomierski[[#Headers],[Sandomierski]],VLOOKUP($E80,Sandomierski[Sandomierski],1,0),IF($D80=Skarżyski[[#Headers],[Skarżyski]],VLOOKUP($E80,Skarżyski[Skarżyski],1,0),IF($D80=Starachowicki[[#Headers],[Starachowicki]],VLOOKUP($E80,Starachowicki[Starachowicki],1,0),IF($D80=Staszowski[[#Headers],[Staszowski]],VLOOKUP($E80,Staszowski[Staszowski],1,0),IF($D80=Włoszczowski[[#Headers],[Włoszczowski]],VLOOKUP($E80,Włoszczowski[Włoszczowski],1,0),\"\")))))))))))))","v":"Skalbmierz"},"kazimierski"]
[null,null,null,"kielecki","Bieliny","gmina Bieliny",{"$f":"VLOOKUP($F81,'DANE - TERC'!$D$6:$P$119,10,0)","v":2604012},{"$f":"VLOOKUP($F81,'DANE - TERC'!$D$6:$P$119,12,0)","v":"GW"},{"$f":"VLOOKUP($F81,'DANE - K1 lit.A'!$D$6:$M$119,4,0)","v":"NIE"},{"$f":"VLOOKUP($F81,'DANE - K1 lit.A'!$D$6:$M$119,5,0)","v":"TAK"},{"$f":"VLOOKUP($F81,'DANE - K1 lit.A'!$D$6:$M$119,6,0)","v":"NIE"},{"$f":"IF($E81=\"\",\"\",VLOOKUP($F81,'DANE - K4 lit.B'!$D$6:$E$107,2,0))","v":"NIE"},{"$f":"IF($E81=\"\",\"\",VLOOKUP($F81,'DANE - K2 lit.C'!$B$14:$I$114,8,0))","v":"w przedziale od 30 do 50 minut"},null,0.8,{"$f":"IF($D81=Buski[[#Headers],[Buski]],VLOOKUP($E81,Buski[Buski],1,0),IF($D81=Jędrzejowski[[#Headers],[Jędrzejowski]],VLOOKUP($E81,Jędrzejowski[Jędrzejowski],1,0),IF($D81=Kazimierski[[#Headers],[Kazimierski]],VLOOKUP($E81,Kazimierski[Kazimierski],1,0),IF($D81=Kielecki[[#Headers],[Kielecki]],VLOOKUP($E81,Kielecki[Kielecki],1,0),IF($D81=Konecki[[#Headers],[Konecki]],VLOOKUP($E81,Konecki[Konecki],1,0),IF($D81=Opatowski[[#Headers],[Opatowski]],VLOOKUP($E81,Opatowski[Opatowski],1,0),IF($D81=Ostrowiecki[[#Headers],[Ostrowiecki]],VLOOKUP($E81,Ostrowiecki[Ostrowiecki],1,0),IF($D81=Pińczowski[[#Headers],[Pińczowski]],VLOOKUP($E81,Pińczowski[Pińczowski],1,0),IF($D81=Sandomierski[[#Headers],[Sandomierski]],VLOOKUP($E81,Sandomierski[Sandomierski],1,0),IF($D81=Skarżyski[[#Headers],[Skarżyski]],VLOOKUP($E81,Skarżyski[Skarżyski],1,0),IF($D81=Starachowicki[[#Headers],[Starachowicki]],VLOOKUP($E81,Starachowicki[Starachowicki],1,0),IF($D81=Staszowski[[#Headers],[Staszowski]],VLOOKUP($E81,Staszowski[Staszowski],1,0),IF($D81=Włoszczowski[[#Headers],[Włoszczowski]],VLOOKUP($E81,Włoszczowski[Włoszczowski],1,0),\"\")))))))))))))","v":"Bieliny"},"kielecki"]
[null,null,null,"kielecki","Bodzentyn","gmina Bodzentyn",{"$f":"VLOOKUP($F82,'DANE - TERC'!$D$6:$P$119,10,0)","v":2604023},{"$f":"VLOOKUP($F82,'DANE - TERC'!$D$6:$P$119,12,0)","v":"GM-W"},{"$f":"VLOOKUP($F82,'DANE - K1 lit.A'!$D$6:$M$119,4,0)","v":"NIE"},{"$f":"VLOOKUP($F82,'DANE - K1 lit.A'!$D$6:$M$119,5,0)","v":"NIE"},{"$f":"VLOOKUP($F82,'DANE - K1 lit.A'!$D$6:$M$119,6,0)","v":"TAK"},{"$f":"IF($E82=\"\",\"\",VLOOKUP($F82,'DANE - K4 lit.B'!$D$6:$E$107,2,0))","v":"NIE"},{"$f":"IF($E82=\"\",\"\",VLOOKUP($F82,'DANE - K2 lit.C'!$B$14:$I$114,8,0))","v":"w przedziale od 30 do 50 minut"},null,0.7,{"$f":"IF($D82=Buski[[#Headers],[Buski]],VLOOKUP($E82,Buski[Buski],1,0),IF($D82=Jędrzejowski[[#Headers],[Jędrzejowski]],VLOOKUP($E82,Jędrzejowski[Jędrzejowski],1,0),IF($D82=Kazimierski[[#Headers],[Kazimierski]],VLOOKUP($E82,Kazimierski[Kazimierski],1,0),IF($D82=Kielecki[[#Headers],[Kielecki]],VLOOKUP($E82,Kielecki[Kielecki],1,0),IF($D82=Konecki[[#Headers],[Konecki]],VLOOKUP($E82,Konecki[Konecki],1,0),IF($D82=Opatowski[[#Headers],[Opatowski]],VLOOKUP($E82,Opatowski[Opatowski],1,0),IF($D82=Ostrowiecki[[#Headers],[Ostrowiecki]],VLOOKUP($E82,Ostrowiecki[Ostrowiecki],1,0),IF($D82=Pińczowski[[#Headers],[Pińczowski]],VLOOKUP($E82,Pińczowski[Pińczowski],1,0),IF($D82=Sandomierski[[#Headers],[Sandomierski]],VLOOKUP($E82,Sandomierski[Sandomierski],1,0),IF($D82=Skarżyski[[#Headers],[Skarżyski]],VLOOKUP($E82,Skarżyski[Skarżyski],1,0),IF($D82=Starachowicki[[#Headers],[Starachowicki]],VLOOKUP($E82,Starachowicki[Starachowicki],1,0),IF($D82=Staszowski[[#Headers],[Staszowski]],VLOOKUP($E82,Staszowski[Staszowski],1,0),IF($D82=Włoszczowski[[#Headers],[Włoszczowski]],VLOOKUP($E82,Włoszczowski[Włoszczowski],1,0),\"\")))))))))))))","v":"Bodzentyn"},"kielecki"]
[null,null,null,"kielecki","Chęciny","gmina Chęciny",{"$f":"VLOOKUP($F83,'DANE - TERC'!$D$6:$P$119,10,0)","v":2604033},{"$f":"VLOOKUP($F83,'DANE - TERC'!$D$6:$P$119,12,0)","v":"GM-W"},{"$f":"VLOOKUP($F83,'DANE - K1 lit.A'!$D$6:$M$119,4,0)","v":"NIE"},{"$f":"VLOOKUP($F83,'DANE - K1 lit.A'!$D$6:$M$119,5,0)","v":"TAK"},{"$f":"VLOOKUP($F83,'DANE - K1 lit.A'!$D$6:$M$119,6,0)","v":"NIE"},{"$f":"IF($E83=\"\",\"\",VLOOKUP($F83,'DANE - K4 lit.B'!$D$6:$E$107,2,0))","v":"NIE"},{"$f":"IF($E83=\"\",\"\",VLOOKUP($F83,'DANE - K2 lit.C'!$B$14:$I$114,8,0))","v":"mniejszy niż 30 minut"},null,0.8,{"$f":"IF($D83=Buski[[#Headers],[Buski]],VLOOKUP($E83,Buski[Buski],1,0),IF($D83=Jędrzejowski[[#Headers],[Jędrzejowski]],VLOOKUP($E83,Jędrzejowski[Jędrzejowski],1,0),IF($D83=Kazimierski[[#Headers],[Kazimierski]],VLOOKUP($E83,Kazimierski[Kazimierski],1,0),IF($D83=Kielecki[[#Headers],[Kielecki]],VLOOKUP($E83,Kielecki[Kielecki],1,0),IF($D83=Konecki[[#Headers],[Konecki]],VLOOKUP($E83,Konecki[Konecki],1,0),IF($D83=Opatowski[[#Headers],[Opatowski]],VLOOKUP($E83,Opatowski[Opatowski],1,0),IF($D83=Ostrowiecki[[#Headers],[Ostrowiecki]],VLOOKUP($E83,Ostrowiecki[Ostrowiecki],1,0),IF($D83=Pińczowski[[#Headers],[Pińczowski]],VLOOKUP($E83,Pińczowski[Pińczowski],1,0),IF($D83=Sandomierski[[#Headers],[Sandomierski]],VLOOKUP($E83,Sandomierski[Sandomierski],1,0),IF($D83=Skarżyski[[#Headers],[Skarżyski]],VLOOKUP($E83,Skarżyski[Skarżyski],1,0),IF($D83=Starachowicki[[#Headers],[Starachowicki]],VLOOKUP($E83,Starachowicki[Starachowicki],1,0),IF($D83=Staszowski[[#Headers],[Staszowski]],VLOOKUP($E83,Staszowski[Staszowski],1,0),IF($D83=Włoszczowski[[#Headers],[Włoszczowski]],VLOOKUP($E83,Włoszczowski[Włoszczowski],1,0),\"\")))))))))))))","v":"Chęciny"},"kielecki"]
[null,null,null,"kielecki","Chmielnik","gmina Chmielnik",{"$f":"VLOOKUP($F84,'DANE - TERC'!$D$6:$P$119,10,0)","v":2604043},{"$f":"VLOOKUP($F84,'DANE - TERC'!$D$6:$P$119,12,0)","v":"GM-W"},{"$f":"VLOOKUP($F84,'DANE - K1 lit.A'!$D$6:$M$119,4,0)","v":"NIE"},{"$f":"VLOOKUP($F84,'DANE - K1 lit.A'!$D$6:$M$119,5,0)","v":"TAK"},{"$f":"VLOOKUP($F84,'DANE - K1 lit.A'!$D$6:$M$119,6,0)","v":"NIE"},{"$f":"IF($E84=\"\",\"\",VLOOKUP($F84,'DANE - K4 lit.B'!$D$6:$E$107,2,0))","v":"NIE"},{"$f":"IF($E84=\"\",\"\",VLOOKUP($F84,'DANE - K2 lit.C'!$B$14:$I$114,8,0))","v":"w przedziale od 30 do 50 minut"},null,0.8,{"$f":"IF($D84=Buski[[#Headers],[Buski]],VLOOKUP($E84,Buski[Buski],1,0),IF($D84=Jędrzejowski[[#Headers],[Jędrzejowski]],VLOOKUP($E84,Jędrzejowski[Jędrzejowski],1,0),IF($D84=Kazimierski[[#Headers],[Kazimierski]],VLOOKUP($E84,Kazimierski[Kazimierski],1,0),IF($D84=Kielecki[[#Headers],[Kielecki]],VLOOKUP($E84,Kielecki[Kielecki],1,0),IF($D84=Konecki[[#Headers],[Konecki]],VLOOKUP($E84,Konecki[Konecki],1,0),IF($D84=Opatowski[[#Headers],[Opatowski]],VLOOKUP($E84,Opatowski[Opatowski],1,0),IF($D84=Ostrowiecki[[#Headers],[Ostrowiecki]],VLOOKUP($E84,Ostrowiecki[Ostrowiecki],1,0),IF($D84=Pińczowski[[#Headers],[Pińczowski]],VLOOKUP($E84,Pińczowski[Pińczowski],1,0),IF($D84=Sandomierski[[#Headers],[Sandomierski]],VLOOKUP($E84,Sandomierski[Sandomierski],1,0),IF($D84=Skarżyski[[#Headers],[Skarżyski]],VLOOKUP($E84,Skarżyski[Skarżyski],1,0),IF($D84=Starachowicki[[#Headers],[Starachowicki]],VLOOKUP($E84,Starachowicki[Starachowicki],1,0),IF($D84=Staszowski[[#Headers],[Staszowski]],VLOOKUP($E84,Staszowski[Staszowski],1,0),IF($D84=Włoszczowski[[#Headers],[Włoszczowski]],VLOOKUP($E84,Włoszczowski[Włoszczowski],1,0),\"\")))))))))))))","v":"Chmielnik"},"kielecki"]
[null,null,null,"kielecki","Daleszyce","gmina Daleszyce",{"$f":"VLOOKUP($F85,'DANE - TERC'!$D$6:$P$119,10,0)","v":2604053},{"$f":"VLOOKUP($F85,'DANE - TERC'!$D$6:$P$119,12,0)","v":"GM-W"},{"$f":"VLOOKUP($F85,'DANE - K1 lit.A'!$D$6:$M$119,4,0)","v":"NIE"},{"$f":"VLOOKUP($F85,'DANE - K1 lit.A'!$D$6:$M$119,5,0)","v":"TAK"},{"$f":"VLOOKUP($F85,'DANE - K1 lit.A'!$D$6:$M$119,6,0)","v":"NIE"},{"$f":"IF($E85=\"\",\"\",VLOOKUP($F85,'DANE - K4 lit.B'!$D$6:$E$107,2,0))","v":"NIE"},{"$f":"IF($E85=\"\",\"\",VLOOKUP($F85,'DANE - K2 lit.C'!$B$14:$I$114,8,0))","v":"w przedziale od 30 do 50 minut"},null,0.7,{"$f":"IF($D85=Buski[[#Headers],[Buski]],VLOOKUP($E85,Buski[Buski],1,0),IF($D85=Jędrzejowski[[#Headers],[Jędrzejowski]],VLOOKUP($E85,Jędrzejowski[Jędrzejowski],1,0),IF($D85=Kazimierski[[#Headers],[Kazimierski]],VLOOKUP($E85,Kazimierski[Kazimierski],1,0),IF($D85=Kielecki[[#Headers],[Kielecki]],VLOOKUP($E85,Kielecki[Kielecki],1,0),IF($D85=Konecki[[#Headers],[Konecki]],VLOOKUP($E85,Konecki[Konecki],1,0),IF($D85=Opatowski[[#Headers],[Opatowski]],VLOOKUP($E85,Opatowski[Opatowski],1,0),IF($D85=Ostrowiecki[[#Headers],[Ostrowiecki]],VLOOKUP($E85,Ostrowiecki[Ostrowiecki],1,0),IF($D85=Pińczowski[[#Headers],[Pińczowski]],VLOOKUP($E85,Pińczowski[Pińczowski],1,0),IF($D85=Sandomierski[[#Headers],[Sandomierski]],VLOOKUP($E85,Sandomierski[Sandomierski],1,0),IF($D85=Skarżyski[[#Headers],[Skarżyski]],VLOOKUP($E85,Skarżyski[Skarżyski],1,0),IF($D85=Starachowicki[[#Headers],[Starachowicki]],VLOOKUP($E85,Starachowicki[Starachowicki],1,0),IF($D85=Staszowski[[#Headers],[Staszowski]],VLOOKUP($E85,Staszowski[Staszowski],1,0),IF($D85=Włoszczowski[[#Headers],[Włoszczowski]],VLOOKUP($E85,Włoszczowski[Włoszczowski],1,0),\"\")))))))))))))","v":"Daleszyce"},"kielecki"]
[null,null,null,"kielecki","Górno","gmina Górno",{"$f":"VLOOKUP($F86,'DANE - TERC'!$D$6:$P$119,10,0)","v":2604062},{"$f":"VLOOKUP($F86,'DANE - TERC'!$D$6:$P$119,12,0)","v":"GW"},{"$f":"VLOOKUP($F86,'DANE - K1 lit.A'!$D$6:$M$119,4,0)","v":"TAK"},{"$f":"VLOOKUP($F86,'DANE - K1 lit.A'!$D$6:$M$119,5,0)","v":"TAK"},{"$f":"VLOOKUP($F86,'DANE - K1 lit.A'!$D$6:$M$119,6,0)","v":"NIE"},{"$f":"IF($E86=\"\",\"\",VLOOKUP($F86,'DANE - K4 lit.B'!$D$6:$E$107,2,0))","v":"NIE"},{"$f":"IF($E86=\"\",\"\",VLOOKUP($F86,'DANE - K2 lit.C'!$B$14:$I$114,8,0))","v":"mniejszy niż 30 minut"},null,0.8,{"$f":"IF($D86=Buski[[#Headers],[Buski]],VLOOKUP($E86,Buski[Buski],1,0),IF($D86=Jędrzejowski[[#Headers],[Jędrzejowski]],VLOOKUP($E86,Jędrzejowski[Jędrzejowski],1,0),IF($D86=Kazimierski[[#Headers],[Kazimierski]],VLOOKUP($E86,Kazimierski[Kazimierski],1,0),IF($D86=Kielecki[[#Headers],[Kielecki]],VLOOKUP($E86,Kielecki[Kielecki],1,0),IF($D86=Konecki[[#Headers],[Konecki]],VLOOKUP($E86,Konecki[Konecki],1,0),IF($D86=Opatowski[[#Headers],[Opatowski]],VLOOKUP($E86,Opatowski[Opatowski],1,0),IF($D86=Ostrowiecki[[#Headers],[Ostrowiecki]],VLOOKUP($E86,Ostrowiecki[Ostrowiecki],1,0),IF($D86=Pińczowski[[#Headers],[Pińczowski]],VLOOKUP($E86,Pińczowski[Pińczowski],1,0),IF($D86=Sandomierski[[#Headers],[Sandomierski]],VLOOKUP($E86,Sandomierski[Sandomierski],1,0),IF($D86=Skarżyski[[#Headers],[Skarżyski]],VLOOKUP($E86,Skarżyski[Skarżyski],1,0),IF($D86=Starachowicki[[#Headers],[Starachowicki]],VLOOKUP($E86,Starachowicki[Starachowicki],1,0),IF($D86=Staszowski[[#Headers],[Staszowski]],VLOOKUP($E86,Staszowski[Staszowski],1,0),IF($D86=Włoszczowski[[#Headers],[Włoszczowski]],VLOOKUP($E86,Włoszczowski[Włoszczowski],1,0),\"\")))))))))))))","v":"Górno"},"kielecki"]
[null,null,null,"kielecki","Łagów","gmina Łagów",{"$f":"VLOOKUP($F87,'DANE - TERC'!$D$6:$P$119,10,0)","v":2604073},{"$f":"VLOOKUP($F87,'DANE - TERC'!$D$6:$P$119,12,0)","v":"GM-W"},{"$f":"VLOOKUP($F87,'DANE - K1 lit.A'!$D$6:$M$119,4,0)","v":"NIE"},{"$f":"VLOOKUP($F87,'DANE - K1 lit.A'!$D$6:$M$119,5,0)","v":"NIE"},{"$f":"VLOOKUP($F87,'DANE - K1 lit.A'!$D$6:$M$119,6,0)","v":"NIE"},{"$f":"IF($E87=\"\",\"\",VLOOKUP($F87,'DANE - K4 lit.B'!$D$6:$E$107,2,0))","v":"NIE"},{"$f":"IF($E87=\"\",\"\",VLOOKUP($F87,'DANE - K2 lit.C'!$B$14:$I$114,8,0))","v":"w przedziale od 30 do 50 minut"},null,0.8,{"$f":"IF($D87=Buski[[#Headers],[Buski]],VLOOKUP($E87,Buski[Buski],1,0),IF($D87=Jędrzejowski[[#Headers],[Jędrzejowski]],VLOOKUP($E87,Jędrzejowski[Jędrzejowski],1,0),IF($D87=Kazimierski[[#Headers],[Kazimierski]],VLOOKUP($E87,Kazimierski[Kazimierski],1,0),IF($D87=Kielecki[[#Headers],[Kielecki]],VLOOKUP($E87,Kielecki[Kielecki],1,0),IF($D87=Konecki[[#Headers],[Konecki]],VLOOKUP($E87,Konecki[Konecki],1,0),IF($D87=Opatowski[[#Headers],[Opatowski]],VLOOKUP($E87,Opatowski[Opatowski],1,0),IF($D87=Ostrowiecki[[#Headers],[Ostrowiecki]],VLOOKUP($E87,Ostrowiecki[Ostrowiecki],1,0),IF($D87=Pińczowski[[#Headers],[Pińczowski]],VLOOKUP($E87,Pińczowski[Pińczowski],1,0),IF($D87=Sandomierski[[#Headers],[Sandomierski]],VLOOKUP($E87,Sandomierski[Sandomierski],1,0),IF($D87=Skarżyski[[#Headers],[Skarżyski]],VLOOKUP($E87,Skarżyski[Skarżyski],1,0),IF($D87=Starachowicki[[#Headers],[Starachowicki]],VLOOKUP($E87,Starachowicki[Starachowicki],1,0),IF($D87=Staszowski[[#Headers],[Staszowski]],VLOOKUP($E87,Staszowski[Staszowski],1,0),IF($D87=Włoszczowski[[#Headers],[Włoszczowski]],VLOOKUP($E87,Włoszczowski[Włoszczowski],1,0),\"\")))))))))))))","v":"Łagów"},"kielecki"]
[null,null,null,"kielecki","Łopuszno","gmina Łopuszno",{"$f":"VLOOKUP($F88,'DANE - TERC'!$D$6:$P$119,10,0)","v":2604083},{"$f":"VLOOKUP($F88,'DANE - TERC'!$D$6:$P$119,12,0)","v":"GM-W"},{"$f":"VLOOKUP($F88,'DANE - K1 lit.A'!$D$6:$M$119,4,0)","v":"NIE"},{"$f":"VLOOKUP($F88,'DANE - K1 lit.A'!$D$6:$M$119,5,0)","v":"NIE"},{"$f":"VLOOKUP($F88,'DANE - K1 lit.A'!$D$6:$M$119,6,0)","v":"NIE"},{"$f":"IF($E88=\"\",\"\",VLOOKUP($F88,'DANE - K4 lit.B'!$D$6:$E$107,2,0))","v":"NIE"},{"$f":"IF($E88=\"\",\"\",VLOOKUP($F88,'DANE - K2 lit.C'!$B$14:$I$114,8,0))","v":"w przedziale od 30 do 50 minut"},null,0.8,{"$f":"IF($D88=Buski[[#Headers],[Buski]],VLOOKUP($E88,Buski[Buski],1,0),IF($D88=Jędrzejowski[[#Headers],[Jędrzejowski]],VLOOKUP($E88,Jędrzejowski[Jędrzejowski],1,0),IF($D88=Kazimierski[[#Headers],[Kazimierski]],VLOOKUP($E88,Kazimierski[Kazimierski],1,0),IF($D88=Kielecki[[#Headers],[Kielecki]],VLOOKUP($E88,Kielecki[Kielecki],1,0),IF($D88=Konecki[[#Headers],[Konecki]],VLOOKUP($E88,Konecki[Konecki],1,0),IF($D88=Opatowski[[#Headers],[Opatowski]],VLOOKUP($E88,Opatowski[Opatowski],1,0),IF($D88=Ostrowiecki[[#Headers],[Ostrowiecki]],VLOOKUP($E88,Ostrowiecki[Ostrowiecki],1,0),IF($D88=Pińczowski[[#Headers],[Pińczowski]],VLOOKUP($E88,Pińczowski[Pińczowski],1,0),IF($D88=Sandomierski[[#Headers],[Sandomierski]],VLOOKUP($E88,Sandomierski[Sandomierski],1,0),IF($D88=Skarżyski[[#Headers],[Skarżyski]],VLOOKUP($E88,Skarżyski[Skarżyski],1,0),IF($D88=Starachowicki[[#Headers],[Starachowicki]],VLOOKUP($E88,Starachowicki[Starachowicki],1,0),IF($D88=Staszowski[[#Headers],[Staszowski]],VLOOKUP($E88,Staszowski[Staszowski],1,0),IF($D88=Włoszczowski[[#Headers],[Włoszczowski]],VLOOKUP($E88,Włoszczowski[Włoszczowski],1,0),\"\")))))))))))))","v":"Łopuszno"},"kielecki"]
[null,null,null,"kielecki","Masłów","gmina Masłów",{"$f":"VLOOKUP($F89,'DANE - TERC'!$D$6:$P$119,10,0)","v":2604092},{"$f":"VLOOKUP($F89,'DANE - TERC'!$D$6:$P$119,12,0)","v":"GW"},{"$f":"VLOOKUP($F89,'DANE - K1 lit.A'!$D$6:$M$119,4,0)","v":"NIE"},{"$f":"VLOOKUP($F89,'DANE - K1 lit.A'!$D$6:$M$119,5,0)","v":"NIE"},{"$f":"VLOOKUP($F89,'DANE - K1 lit.A'!$D$6:$M$119,6,0)","v":"NIE"},{"$f":"IF($E89=\"\",\"\",VLOOKUP($F89,'DANE - K4 lit.B'!$D$6:$E$107,2,0))","v":"NIE"},{"$f":"IF($E89=\"\",\"\",VLOOKUP($F89,'DANE - K2 lit.C'!$B$14:$I$114,8,0))","v":"mniejszy niż 30 minut"},null,0.8,{"$f":"IF($D89=Buski[[#Headers],[Buski]],VLOOKUP($E89,Buski[Buski],1,0),IF($D89=Jędrzejowski[[#Headers],[Jędrzejowski]],VLOOKUP($E89,Jędrzejowski[Jędrzejowski],1,0),IF($D89=Kazimierski[[#Headers],[Kazimierski]],VLOOKUP($E89,Kazimierski[Kazimierski],1,0),IF($D89=Kielecki[[#Headers],[Kielecki]],VLOOKUP($E89,Kielecki[Kielecki],1,0),IF($D89=Konecki[[#Headers],[Konecki]],VLOOKUP($E89,Konecki[Konecki],1,0),IF($D89=Opatowski[[#Headers],[Opatowski]],VLOOKUP($E89,Opatowski[Opatowski],1,0),IF($D89=Ostrowiecki[[#Headers],[Ostrowiecki]],VLOOKUP($E89,Ostrowiecki[Ostrowiecki],1,0),IF($D89=Pińczowski[[#Headers],[Pińczowski]],VLOOKUP($E89,Pińczowski[Pińczowski],1,0),IF($D89=Sandomierski[[#Headers],[Sandomierski]],VLOOKUP($E89,Sandomierski[Sandomierski],1,0),IF($D89=Skarżyski[[#Headers],[Skarżyski]],VLOOKUP($E89,Skarżyski[Skarżyski],1,0),IF($D89=Starachowicki[[#Headers],[Starachowicki]],VLOOKUP($E89,Starachowicki[Starachowicki],1,0),IF($D89=Staszowski[[#Headers],[Staszowski]],VLOOKUP($E89,Staszowski[Staszowski],1,0),IF($D89=Włoszczowski[[#Headers],[Włoszczowski]],VLOOKUP($E89,Włoszczowski[Włoszczowski],1,0),\"\")))))))))))))","v":"Masłów"},"kielecki"]
[null,null,null,"kielecki","Miedziana Góra","gmina Miedziana Góra",{"$f":"VLOOKUP($F90,'DANE - TERC'!$D$6:$P$119,10,0)","v":2604102},{"$f":"VLOOKUP($F90,'DANE - TERC'!$D$6:$P$119,12,0)","v":"GW"},{"$f":"VLOOKUP($F90,'DANE - K1 lit.A'!$D$6:$M$119,4,0)","v":"NIE"},{"$f":"VLOOKUP($F90,'DANE - K1 lit.A'!$D$6:$M$119,5,0)","v":"NIE"},{"$f":"VLOOKUP($F90,'DANE - K1 lit.A'!$D$6:$M$119,6,0)","v":"NIE"},{"$f":"IF($E90=\"\",\"\",VLOOKUP($F90,'DANE - K4 lit.B'!$D$6:$E$107,2,0))","v":"NIE"},{"$f":"IF($E90=\"\",\"\",VLOOKUP($F90,'DANE - K2 lit.C'!$B$14:$I$114,8,0))","v":"mniejszy niż 30 minut"},null,0.8,{"$f":"IF($D90=Buski[[#Headers],[Buski]],VLOOKUP($E90,Buski[Buski],1,0),IF($D90=Jędrzejowski[[#Headers],[Jędrzejowski]],VLOOKUP($E90,Jędrzejowski[Jędrzejowski],1,0),IF($D90=Kazimierski[[#Headers],[Kazimierski]],VLOOKUP($E90,Kazimierski[Kazimierski],1,0),IF($D90=Kielecki[[#Headers],[Kielecki]],VLOOKUP($E90,Kielecki[Kielecki],1,0),IF($D90=Konecki[[#Headers],[Konecki]],VLOOKUP($E90,Konecki[Konecki],1,0),IF($D90=Opatowski[[#Headers],[Opatowski]],VLOOKUP($E90,Opatowski[Opatowski],1,0),IF($D90=Ostrowiecki[[#Headers],[Ostrowiecki]],VLOOKUP($E90,Ostrowiecki[Ostrowiecki],1,0),IF($D90=Pińczowski[[#Headers],[Pińczowski]],VLOOKUP($E90,Pińczowski[Pińczowski],1,0),IF($D90=Sandomierski[[#Headers],[Sandomierski]],VLOOKUP($E90,Sandomierski[Sandomierski],1,0),IF($D90=Skarżyski[[#Headers],[Skarżyski]],VLOOKUP($E90,Skarżyski[Skarżyski],1,0),IF($D90=Starachowicki[[#Headers],[Starachowicki]],VLOOKUP($E90,Starachowicki[Starachowicki],1,0),IF($D90=Staszowski[[#Headers],[Staszowski]],VLOOKUP($E90,Staszowski[Staszowski],1,0),IF($D90=Włoszczowski[[#Headers],[Włoszczowski]],VLOOKUP($E90,Włoszczowski[Włoszczowski],1,0),\"\")))))))))))))","v":"Miedziana Góra"},"kielecki"]
[null,null,null,"kielecki","Mniów","gmina Mniów",{"$f":"VLOOKUP($F91,'DANE - TERC'!$D$6:$P$119,10,0)","v":2604112},{"$f":"VLOOKUP($F91,'DANE - TERC'!$D$6:$P$119,12,0)","v":"GW"},{"$f":"VLOOKUP($F91,'DANE - K1 lit.A'!$D$6:$M$119,4,0)","v":"NIE"},{"$f":"VLOOKUP($F91,'DANE - K1 lit.A'!$D$6:$M$119,5,0)","v":"NIE"},{"$f":"VLOOKUP($F91,'DANE - K1 lit.A'!$D$6:$M$119,6,0)","v":"NIE"},{"$f":"IF($E91=\"\",\"\",VLOOKUP($F91,'DANE - K4 lit.B'!$D$6:$E$107,2,0))","v":"NIE"},{"$f":"IF($E91=\"\",\"\",VLOOKUP($F91,'DANE - K2 lit.C'!$B$14:$I$114,8,0))","v":"w przedziale od 30 do 50 minut"},null,0.8,{"$f":"IF($D91=Buski[[#Headers],[Buski]],VLOOKUP($E91,Buski[Buski],1,0),IF($D91=Jędrzejowski[[#Headers],[Jędrzejowski]],VLOOKUP($E91,Jędrzejowski[Jędrzejowski],1,0),IF($D91=Kazimierski[[#Headers],[Kazimierski]],VLOOKUP($E91,Kazimierski[Kazimierski],1,0),IF($D91=Kielecki[[#Headers],[Kielecki]],VLOOKUP($E91,Kielecki[Kielecki],1,0),IF($D91=Konecki[[#Headers],[Konecki]],VLOOKUP($E91,Konecki[Konecki],1,0),IF($D91=Opatowski[[#Headers],[Opatowski]],VLOOKUP($E91,Opatowski[Opatowski],1,0),IF($D91=Ostrowiecki[[#Headers],[Ostrowiecki]],VLOOKUP($E91,Ostrowiecki[Ostrowiecki],1,0),IF($D91=Pińczowski[[#Headers],[Pińczowski]],VLOOKUP($E91,Pińczowski[Pińczowski],1,0),IF($D91=Sandomierski[[#Headers],[Sandomierski]],VLOOKUP($E91,Sandomierski[Sandomierski],1,0),IF($D91=Skarżyski[[#Headers],[Skarżyski]],VLOOKUP($E91,Skarżyski[Skarżyski],1,0),IF($D91=Starachowicki[[#Headers],[Starachowicki]],VLOOKUP($E91,Starachowicki[Starachowicki],1,0),IF($D91=Staszowski[[#Headers],[Staszowski]],VLOOKUP($E91,Staszowski[Staszowski],1,0),IF($D91=Włoszczowski[[#Headers],[Włoszczowski]],VLOOKUP($E91,Włoszczowski[Włoszczowski],1,0),\"\")))))))))))))","v":"Mniów"},"kielecki"]
[null,null,null,"kielecki","Morawica","gmina Morawica",{"$f":"VLOOKUP($F92,'DANE - TERC'!$D$6:$P$119,10,0)","v":2604123},{"$f":"VLOOKUP($F92,'DANE - TERC'!$D$6:$P$119,12,0)","v":"GM-W"},{"$f":"VLOOKUP($F92,'DANE - K1 lit.A'!$D$6:$M$119,4,0)","v":"NIE"},{"$f":"VLOOKUP($F92,'DANE - K1 lit.A'!$D$6:$M$119,5,0)","v":"TAK"},{"$f":"VLOOKUP($F92,'DANE - K1 lit.A'!$D$6:$M$119,6,0)","v":"NIE"},{"$f":"IF($E92=\"\",\"\",VLOOKUP($F92,'DANE - K4 lit.B'!$D$6:$E$107,2,0))","v":"NIE"},{"$f":"IF($E92=\"\",\"\",VLOOKUP($F92,'DANE - K2 lit.C'!$B$14:$I$114,8,0))","v":"mniejszy niż 30 minut"},null,0.6,{"$f":"IF($D92=Buski[[#Headers],[Buski]],VLOOKUP($E92,Buski[Buski],1,0),IF($D92=Jędrzejowski[[#Headers],[Jędrzejowski]],VLOOKUP($E92,Jędrzejowski[Jędrzejowski],1,0),IF($D92=Kazimierski[[#Headers],[Kazimierski]],VLOOKUP($E92,Kazimierski[Kazimierski],1,0),IF($D92=Kielecki[[#Headers],[Kielecki]],VLOOKUP($E92,Kielecki[Kielecki],1,0),IF($D92=Konecki[[#Headers],[Konecki]],VLOOKUP($E92,Konecki[Konecki],1,0),IF($D92=Opatowski[[#Headers],[Opatowski]],VLOOKUP($E92,Opatowski[Opatowski],1,0),IF($D92=Ostrowiecki[[#Headers],[Ostrowiecki]],VLOOKUP($E92,Ostrowiecki[Ostrowiecki],1,0),IF($D92=Pińczowski[[#Headers],[Pińczowski]],VLOOKUP($E92,Pińczowski[Pińczowski],1,0),IF($D92=Sandomierski[[#Headers],[Sandomierski]],VLOOKUP($E92,Sandomierski[Sandomierski],1,0),IF($D92=Skarżyski[[#Headers],[Skarżyski]],VLOOKUP($E92,Skarżyski[Skarżyski],1,0),IF($D92=Starachowicki[[#Headers],[Starachowicki]],VLOOKUP($E92,Starachowicki[Starachowicki],1,0),IF($D92=Staszowski[[#Headers],[Staszowski]],VLOOKUP($E92,Staszowski[Staszowski],1,0),IF($D92=Włoszczowski[[#Headers],[Włoszczowski]],VLOOKUP($E92,Włoszczowski[Włoszczowski],1,0),\"\")))))))))))))","v":"Morawica"},"kielecki"]
[null,null,null,"kielecki","Nowa Słupia","gmina Nowa Słupia",{"$f":"VLOOKUP($F93,'DANE - TERC'!$D$6:$P$119,10,0)","v":2604133},{"$f":"VLOOKUP($F93,'DANE - TERC'!$D$6:$P$119,12,0)","v":"GM-W"},{"$f":"VLOOKUP($F93,'DANE - K1 lit.A'!$D$6:$M$119,4,0)","v":"NIE"},{"$f":"VLOOKUP($F93,'DANE - K1 lit.A'!$D$6:$M$119,5,0)","v":"TAK"},{"$f":"VLOOKUP($F93,'DANE - K1 lit.A'!$D$6:$M$119,6,0)","v":"TAK"},{"$f":"IF($E93=\"\",\"\",VLOOKUP($F93,'DANE - K4 lit.B'!$D$6:$E$107,2,0))","v":"NIE"},{"$f":"IF($E93=\"\",\"\",VLOOKUP($F93,'DANE - K2 lit.C'!$B$14:$I$114,8,0))","v":"w przedziale od 30 do 50 minut"},null,0.8,{"$f":"IF($D93=Buski[[#Headers],[Buski]],VLOOKUP($E93,Buski[Buski],1,0),IF($D93=Jędrzejowski[[#Headers],[Jędrzejowski]],VLOOKUP($E93,Jędrzejowski[Jędrzejowski],1,0),IF($D93=Kazimierski[[#Headers],[Kazimierski]],VLOOKUP($E93,Kazimierski[Kazimierski],1,0),IF($D93=Kielecki[[#Headers],[Kielecki]],VLOOKUP($E93,Kielecki[Kielecki],1,0),IF($D93=Konecki[[#Headers],[Konecki]],VLOOKUP($E93,Konecki[Konecki],1,0),IF($D93=Opatowski[[#Headers],[Opatowski]],VLOOKUP($E93,Opatowski[Opatowski],1,0),IF($D93=Ostrowiecki[[#Headers],[Ostrowiecki]],VLOOKUP($E93,Ostrowiecki[Ostrowiecki],1,0),IF($D93=Pińczowski[[#Headers],[Pińczowski]],VLOOKUP($E93,Pińczowski[Pińczowski],1,0),IF($D93=Sandomierski[[#Headers],[Sandomierski]],VLOOKUP($E93,Sandomierski[Sandomierski],1,0),IF($D93=Skarżyski[[#Headers],[Skarżyski]],VLOOKUP($E93,Skarżyski[Skarżyski],1,0),IF($D93=Starachowicki[[#Headers],[Starachowicki]],VLOOKUP($E93,Starachowicki[Starachowicki],1,0),IF($D93=Staszowski[[#Headers],[Staszowski]],VLOOKUP($E93,Staszowski[Staszowski],1,0),IF($D93=Włoszczowski[[#Headers],[Włoszczowski]],VLOOKUP($E93,Włoszczowski[Włoszczowski],1,0),\"\")))))))))))))","v":"Nowa Słupia"},"kielecki"]
[null,null,null,"kielecki","Nowiny","gmina Nowiny",{"$f":"VLOOKUP($F94,'DANE - TERC'!$D$6:$P$119,10,0)","v":2604172},{"$f":"VLOOKUP($F94,'DANE - TERC'!$D$6:$P$119,12,0)","v":"GW"},{"$f":"VLOOKUP($F94,'DANE - K1 lit.A'!$D$6:$M$119,4,0)","v":"TAK"},{"$f":"VLOOKUP($F94,'DANE - K1 lit.A'!$D$6:$M$119,5,0)","v":"TAK"},{"$f":"VLOOKUP($F94,'DANE - K1 lit.A'!$D$6:$M$119,6,0)","v":"NIE"},{"$f":"IF($E94=\"\",\"\",VLOOKUP($F94,'DANE - K4 lit.B'!$D$6:$E$107,2,0))","v":"NIE"},{"$f":"IF($E94=\"\",\"\",VLOOKUP($F94,'DANE - K2 lit.C'!$B$14:$I$114,8,0))","v":"mniejszy niż 30 minut"},null,0.6,{"$f":"IF($D94=Buski[[#Headers],[Buski]],VLOOKUP($E94,Buski[Buski],1,0),IF($D94=Jędrzejowski[[#Headers],[Jędrzejowski]],VLOOKUP($E94,Jędrzejowski[Jędrzejowski],1,0),IF($D94=Kazimierski[[#Headers],[Kazimierski]],VLOOKUP($E94,Kazimierski[Kazimierski],1,0),IF($D94=Kielecki[[#Headers],[Kielecki]],VLOOKUP($E94,Kielecki[Kielecki],1,0),IF($D94=Konecki[[#Headers],[Konecki]],VLOOKUP($E94,Konecki[Konecki],1,0),IF($D94=Opatowski[[#Headers],[Opatowski]],VLOOKUP($E94,Opatowski[Opatowski],1,0),IF($D94=Ostrowiecki[[#Headers],[Ostrowiecki]],VLOOKUP($E94,Ostrowiecki[Ostrowiecki],1,0),IF($D94=Pińczowski[[#Headers],[Pińczowski]],VLOOKUP($E94,Pińczowski[Pińczowski],1,0),IF($D94=Sandomierski[[#Headers],[Sandomierski]],VLOOKUP($E94,Sandomierski[Sandomierski],1,0),IF($D94=Skarżyski[[#Headers],[Skarżyski]],VLOOKUP($E94,Skarżyski[Skarżyski],1,0),IF($D94=Starachowicki[[#Headers],[Starachowicki]],VLOOKUP($E94,Starachowicki[Starachowicki],1,0),IF($D94=Staszowski[[#Headers],[Staszowski]],VLOOKUP($E94,Staszowski[Staszowski],1,0),IF($D94=Włoszczowski[[#Headers],[Włoszczowski]],VLOOKUP($E94,Włoszczowski[Włoszczowski],1,0),\"\")))))))))))))","v":"Nowiny"},"kielecki"]
[null,null,null,"kielecki","Piekoszów","gmina Piekoszów",{"$f":"VLOOKUP($F95,'DANE - TERC'!$D$6:$P$119,10,0)","v":2604143},{"$f":"VLOOKUP($F95,'DANE - TERC'!$D$6:$P$119,12,0)","v":"GM-W"},{"$f":"VLOOKUP($F95,'DANE - K1 lit.A'!$D$6:$M$119,4,0)","v":"NIE"},{"$f":"VLOOKUP($F95,'DANE - K1 lit.A'!$D$6:$M$119,5,0)","v":"NIE"},{"$f":"VLOOKUP($F95,'DANE - K1 lit.A'!$D$6:$M$119,6,0)","v":"NIE"},{"$f":"IF($E95=\"\",\"\",VLOOKUP($F95,'DANE - K4 lit.B'!$D$6:$E$107,2,0))","v":"NIE"},{"$f":"IF($E95=\"\",\"\",VLOOKUP($F95,'DANE - K2 lit.C'!$B$14:$I$114,8,0))","v":"mniejszy niż 30 minut"},null,0.8,{"$f":"IF($D95=Buski[[#Headers],[Buski]],VLOOKUP($E95,Buski[Buski],1,0),IF($D95=Jędrzejowski[[#Headers],[Jędrzejowski]],VLOOKUP($E95,Jędrzejowski[Jędrzejowski],1,0),IF($D95=Kazimierski[[#Headers],[Kazimierski]],VLOOKUP($E95,Kazimierski[Kazimierski],1,0),IF($D95=Kielecki[[#Headers],[Kielecki]],VLOOKUP($E95,Kielecki[Kielecki],1,0),IF($D95=Konecki[[#Headers],[Konecki]],VLOOKUP($E95,Konecki[Konecki],1,0),IF($D95=Opatowski[[#Headers],[Opatowski]],VLOOKUP($E95,Opatowski[Opatowski],1,0),IF($D95=Ostrowiecki[[#Headers],[Ostrowiecki]],VLOOKUP($E95,Ostrowiecki[Ostrowiecki],1,0),IF($D95=Pińczowski[[#Headers],[Pińczowski]],VLOOKUP($E95,Pińczowski[Pińczowski],1,0),IF($D95=Sandomierski[[#Headers],[Sandomierski]],VLOOKUP($E95,Sandomierski[Sandomierski],1,0),IF($D95=Skarżyski[[#Headers],[Skarżyski]],VLOOKUP($E95,Skarżyski[Skarżyski],1,0),IF($D95=Starachowicki[[#Headers],[Starachowicki]],VLOOKUP($E95,Starachowicki[Starachowicki],1,0),IF($D95=Staszowski[[#Headers],[Staszowski]],VLOOKUP($E95,Staszowski[Staszowski],1,0),IF($D95=Włoszczowski[[#Headers],[Włoszczowski]],VLOOKUP($E95,Włoszczowski[Włoszczowski],1,0),\"\")))))))))))))","v":"Piekoszów"},"kielecki"]
[null,null,null,"kielecki","Pierzchnica","gmina Pierzchnica",{"$f":"VLOOKUP($F96,'DANE - TERC'!$D$6:$P$119,10,0)","v":2604153},{"$f":"VLOOKUP($F96,'DANE - TERC'!$D$6:$P$119,12,0)","v":"GM-W"},{"$f":"VLOOKUP($F96,'DANE - K1 lit.A'!$D$6:$M$119,4,0)","v":"NIE"},{"$f":"VLOOKUP($F96,'DANE - K1 lit.A'!$D$6:$M$119,5,0)","v":"TAK"},{"$f":"VLOOKUP($F96,'DANE - K1 lit.A'!$D$6:$M$119,6,0)","v":"TAK"},{"$f":"IF($E96=\"\",\"\",VLOOKUP($F96,'DANE - K4 lit.B'!$D$6:$E$107,2,0))","v":"NIE"},{"$f":"IF($E96=\"\",\"\",VLOOKUP($F96,'DANE - K2 lit.C'!$B$14:$I$114,8,0))","v":"w przedziale od 30 do 50 minut"},null,0.8,{"$f":"IF($D96=Buski[[#Headers],[Buski]],VLOOKUP($E96,Buski[Buski],1,0),IF($D96=Jędrzejowski[[#Headers],[Jędrzejowski]],VLOOKUP($E96,Jędrzejowski[Jędrzejowski],1,0),IF($D96=Kazimierski[[#Headers],[Kazimierski]],VLOOKUP($E96,Kazimierski[Kazimierski],1,0),IF($D96=Kielecki[[#Headers],[Kielecki]],VLOOKUP($E96,Kielecki[Kielecki],1,0),IF($D96=Konecki[[#Headers],[Konecki]],VLOOKUP($E96,Konecki[Konecki],1,0),IF($D96=Opatowski[[#Headers],[Opatowski]],VLOOKUP($E96,Opatowski[Opatowski],1,0),IF($D96=Ostrowiecki[[#Headers],[Ostrowiecki]],VLOOKUP($E96,Ostrowiecki[Ostrowiecki],1,0),IF($D96=Pińczowski[[#Headers],[Pińczowski]],VLOOKUP($E96,Pińczowski[Pińczowski],1,0),IF($D96=Sandomierski[[#Headers],[Sandomierski]],VLOOKUP($E96,Sandomierski[Sandomierski],1,0),IF($D96=Skarżyski[[#Headers],[Skarżyski]],VLOOKUP($E96,Skarżyski[Skarżyski],1,0),IF($D96=Starachowicki[[#Headers],[Starachowicki]],VLOOKUP($E96,Starachowicki[Starachowicki],1,0),IF($D96=Staszowski[[#Headers],[Staszowski]],VLOOKUP($E96,Staszowski[Staszowski],1,0),IF($D96=Włoszczowski[[#Headers],[Włoszczowski]],VLOOKUP($E96,Włoszczowski[Włoszczowski],1,0),\"\")))))))))))))","v":"Pierzchnica"},"kielecki"]
[null,null,null,"kielecki","Raków","gmina Raków",{"$f":"VLOOKUP($F97,'DANE - TERC'!$D$6:$P$119,10,0)","v":2604162},{"$f":"VLOOKUP($F97,'DANE - TERC'!$D$6:$P$119,12,0)","v":"GW"},{"$f":"VLOOKUP($F97,'DANE - K1 lit.A'!$D$6:$M$119,4,0)","v":"NIE"},{"$f":"VLOOKUP($F97,'DANE - K1 lit.A'!$D$6:$M$119,5,0)","v":"NIE"},{"$f":"VLOOKUP($F97,'DANE - K1 lit.A'!$D$6:$M$119,6,0)","v":"NIE"},{"$f":"IF($E97=\"\",\"\",VLOOKUP($F97,'DANE - K4 lit.B'!$D$6:$E$107,2,0))","v":"NIE"},{"$f":"IF($E97=\"\",\"\",VLOOKUP($F97,'DANE - K2 lit.C'!$B$14:$I$114,8,0))","v":"w przedziale od 30 do 50 minut"},null,0.8,{"$f":"IF($D97=Buski[[#Headers],[Buski]],VLOOKUP($E97,Buski[Buski],1,0),IF($D97=Jędrzejowski[[#Headers],[Jędrzejowski]],VLOOKUP($E97,Jędrzejowski[Jędrzejowski],1,0),IF($D97=Kazimierski[[#Headers],[Kazimierski]],VLOOKUP($E97,Kazimierski[Kazimierski],1,0),IF($D97=Kielecki[[#Headers],[Kielecki]],VLOOKUP($E97,Kielecki[Kielecki],1,0),IF($D97=Konecki[[#Headers],[Konecki]],VLOOKUP($E97,Konecki[Konecki],1,0),IF($D97=Opatowski[[#Headers],[Opatowski]],VLOOKUP($E97,Opatowski[Opatowski],1,0),IF($D97=Ostrowiecki[[#Headers],[Ostrowiecki]],VLOOKUP($E97,Ostrowiecki[Ostrowiecki],1,0),IF($D97=Pińczowski[[#Headers],[Pińczowski]],VLOOKUP($E97,Pińczowski[Pińczowski],1,0),IF($D97=Sandomierski[[#Headers],[Sandomierski]],VLOOKUP($E97,Sandomierski[Sandomierski],1,0),IF($D97=Skarżyski[[#Headers],[Skarżyski]],VLOOKUP($E97,Skarżyski[Skarżyski],1,0),IF($D97=Starachowicki[[#Headers],[Starachowicki]],VLOOKUP($E97,Starachowicki[Starachowicki],1,0),IF($D97=Staszowski[[#Headers],[Staszowski]],VLOOKUP($E97,Staszowski[Staszowski],1,0),IF($D97=Włoszczowski[[#Headers],[Włoszczowski]],VLOOKUP($E97,Włoszczowski[Włoszczowski],1,0),\"\")))))))))))))","v":"Raków"},"kielecki"]
[null,null,null,"kielecki","Strawczyn","gmina Strawczyn",{"$f":"VLOOKUP($F98,'DANE - TERC'!$D$6:$P$119,10,0)","v":2604182},{"$f":"VLOOKUP($F98,'DANE - TERC'!$D$6:$P$119,12,0)","v":"GW"},{"$f":"VLOOKUP($F98,'DANE - K1 lit.A'!$D$6:$M$119,4,0)","v":"NIE"},{"$f":"VLOOKUP($F98,'DANE - K1 lit.A'!$D$6:$M$119,5,0)","v":"NIE"},{"$f":"VLOOKUP($F98,'DANE - K1 lit.A'!$D$6:$M$119,6,0)","v":"NIE"},{"$f":"IF($E98=\"\",\"\",VLOOKUP($F98,'DANE - K4 lit.B'!$D$6:$E$107,2,0))","v":"NIE"},{"$f":"IF($E98=\"\",\"\",VLOOKUP($F98,'DANE - K2 lit.C'!$B$14:$I$114,8,0))","v":"w przedziale od 30 do 50 minut"},null,0.8,{"$f":"IF($D98=Buski[[#Headers],[Buski]],VLOOKUP($E98,Buski[Buski],1,0),IF($D98=Jędrzejowski[[#Headers],[Jędrzejowski]],VLOOKUP($E98,Jędrzejowski[Jędrzejowski],1,0),IF($D98=Kazimierski[[#Headers],[Kazimierski]],VLOOKUP($E98,Kazimierski[Kazimierski],1,0),IF($D98=Kielecki[[#Headers],[Kielecki]],VLOOKUP($E98,Kielecki[Kielecki],1,0),IF($D98=Konecki[[#Headers],[Konecki]],VLOOKUP($E98,Konecki[Konecki],1,0),IF($D98=Opatowski[[#Headers],[Opatowski]],VLOOKUP($E98,Opatowski[Opatowski],1,0),IF($D98=Ostrowiecki[[#Headers],[Ostrowiecki]],VLOOKUP($E98,Ostrowiecki[Ostrowiecki],1,0),IF($D98=Pińczowski[[#Headers],[Pińczowski]],VLOOKUP($E98,Pińczowski[Pińczowski],1,0),IF($D98=Sandomierski[[#Headers],[Sandomierski]],VLOOKUP($E98,Sandomierski[Sandomierski],1,0),IF($D98=Skarżyski[[#Headers],[Skarżyski]],VLOOKUP($E98,Skarżyski[Skarżyski],1,0),IF($D98=Starachowicki[[#Headers],[Starachowicki]],VLOOKUP($E98,Starachowicki[Starachowicki],1,0),IF($D98=Staszowski[[#Headers],[Staszowski]],VLOOKUP($E98,Staszowski[Staszowski],1,0),IF($D98=Włoszczowski[[#Headers],[Włoszczowski]],VLOOKUP($E98,Włoszczowski[Włoszczowski],1,0),\"\")))))))))))))","v":"Strawczyn"},"kielecki"]
[null,null,null,"kielecki","Zagnańsk","gmina Zagnańsk",{"$f":"VLOOKUP($F99,'DANE - TERC'!$D$6:$P$119,10,0)","v":2604192},{"$f":"VLOOKUP($F99,'DANE - TERC'!$D$6:$P$119,12,0)","v":"GW"},{"$f":"VLOOKUP($F99,'DANE - K1 lit.A'!$D$6:$M$119,4,0)","v":"NIE"},{"$f":"VLOOKUP($F99,'DANE - K1 lit.A'!$D$6:$M$119,5,0)","v":"TAK"},{"$f":"VLOOKUP($F99,'DANE - K1 lit.A'!$D$6:$M$119,6,0)","v":"NIE"},{"$f":"IF($E99=\"\",\"\",VLOOKUP($F99,'DANE - K4 lit.B'!$D$6:$E$107,2,0))","v":"NIE"},{"$f":"IF($E99=\"\",\"\",VLOOKUP($F99,'DANE - K2 lit.C'!$B$14:$I$114,8,0))","v":"mniejszy niż 30 minut"},null,0.8,{"$f":"IF($D99=Buski[[#Headers],[Buski]],VLOOKUP($E99,Buski[Buski],1,0),IF($D99=Jędrzejowski[[#Headers],[Jędrzejowski]],VLOOKUP($E99,Jędrzejowski[Jędrzejowski],1,0),IF($D99=Kazimierski[[#Headers],[Kazimierski]],VLOOKUP($E99,Kazimierski[Kazimierski],1,0),IF($D99=Kielecki[[#Headers],[Kielecki]],VLOOKUP($E99,Kielecki[Kielecki],1,0),IF($D99=Konecki[[#Headers],[Konecki]],VLOOKUP($E99,Konecki[Konecki],1,0),IF($D99=Opatowski[[#Headers],[Opatowski]],VLOOKUP($E99,Opatowski[Opatowski],1,0),IF($D99=Ostrowiecki[[#Headers],[Ostrowiecki]],VLOOKUP($E99,Ostrowiecki[Ostrowiecki],1,0),IF($D99=Pińczowski[[#Headers],[Pińczowski]],VLOOKUP($E99,Pińczowski[Pińczowski],1,0),IF($D99=Sandomierski[[#Headers],[Sandomierski]],VLOOKUP($E99,Sandomierski[Sandomierski],1,0),IF($D99=Skarżyski[[#Headers],[Skarżyski]],VLOOKUP($E99,Skarżyski[Skarżyski],1,0),IF($D99=Starachowicki[[#Headers],[Starachowicki]],VLOOKUP($E99,Starachowicki[Starachowicki],1,0),IF($D99=Staszowski[[#Headers],[Staszowski]],VLOOKUP($E99,Staszowski[Staszowski],1,0),IF($D99=Włoszczowski[[#Headers],[Włoszczowski]],VLOOKUP($E99,Włoszczowski[Włoszczowski],1,0),\"\")))))))))))))","v":"Zagnańsk"},"kielecki"]
[null,null,null,"konecki","Fałków","gmina Fałków",{"$f":"VLOOKUP($F100,'DANE - TERC'!$D$6:$P$119,10,0)","v":2605012},{"$f":"VLOOKUP($F100,'DANE - TERC'!$D$6:$P$119,12,0)","v":"GW"},{"$f":"VLOOKUP($F100,'DANE - K1 lit.A'!$D$6:$M$119,4,0)","v":"TAK"},{"$f":"VLOOKUP($F100,'DANE - K1 lit.A'!$D$6:$M$119,5,0)","v":"TAK"},{"$f":"VLOOKUP($F100,'DANE - K1 lit.A'!$D$6:$M$119,6,0)","v":"NIE"},{"$f":"IF($E100=\"\",\"\",VLOOKUP($F100,'DANE - K4 lit.B'!$D$6:$E$107,2,0))","v":"NIE"},{"$f":"IF($E100=\"\",\"\",VLOOKUP($F100,'DANE - K2 lit.C'!$B$14:$I$114,8,0))","v":"w przedziale od 30 do 50 minut"},null,0.7,{"$f":"IF($D100=Buski[[#Headers],[Buski]],VLOOKUP($E100,Buski[Buski],1,0),IF($D100=Jędrzejowski[[#Headers],[Jędrzejowski]],VLOOKUP($E100,Jędrzejowski[Jędrzejowski],1,0),IF($D100=Kazimierski[[#Headers],[Kazimierski]],VLOOKUP($E100,Kazimierski[Kazimierski],1,0),IF($D100=Kielecki[[#Headers],[Kielecki]],VLOOKUP($E100,Kielecki[Kielecki],1,0),IF($D100=Konecki[[#Headers],[Konecki]],VLOOKUP($E100,Konecki[Konecki],1,0),IF($D100=Opatowski[[#Headers],[Opatowski]],VLOOKUP($E100,Opatowski[Opatowski],1,0),IF($D100=Ostrowiecki[[#Headers],[Ostrowiecki]],VLOOKUP($E100,Ostrowiecki[Ostrowiecki],1,0),IF($D100=Pińczowski[[#Headers],[Pińczowski]],VLOOKUP($E100,Pińczowski[Pińczowski],1,0),IF($D100=Sandomierski[[#Headers],[Sandomierski]],VLOOKUP($E100,Sandomierski[Sandomierski],1,0),IF($D100=Skarżyski[[#Headers],[Skarżyski]],VLOOKUP($E100,Skarżyski[Skarżyski],1,0),IF($D100=Starachowicki[[#Headers],[Starachowicki]],VLOOKUP($E100,Starachowicki[Starachowicki],1,0),IF($D100=Staszowski[[#Headers],[Staszowski]],VLOOKUP($E100,Staszowski[Staszowski],1,0),IF($D100=Włoszczowski[[#Headers],[Włoszczowski]],VLOOKUP($E100,Włoszczowski[Włoszczowski],1,0),\"\")))))))))))))","v":"Fałków"},"konecki"]
[null,null,null,"konecki","Gowarczów","gmina Gowarczów",{"$f":"VLOOKUP($F101,'DANE - TERC'!$D$6:$P$119,10,0)","v":2605023},{"$f":"VLOOKUP($F101,'DANE - TERC'!$D$6:$P$119,12,0)","v":"GM-W"},{"$f":"VLOOKUP($F101,'DANE - K1 lit.A'!$D$6:$M$119,4,0)","v":"NIE"},{"$f":"VLOOKUP($F101,'DANE - K1 lit.A'!$D$6:$M$119,5,0)","v":"NIE"},{"$f":"VLOOKUP($F101,'DANE - K1 lit.A'!$D$6:$M$119,6,0)","v":"NIE"},{"$f":"IF($E101=\"\",\"\",VLOOKUP($F101,'DANE - K4 lit.B'!$D$6:$E$107,2,0))","v":"NIE"},{"$f":"IF($E101=\"\",\"\",VLOOKUP($F101,'DANE - K2 lit.C'!$B$14:$I$114,8,0))","v":"w przedziale od 30 do 50 minut"},null,0.8,{"$f":"IF($D101=Buski[[#Headers],[Buski]],VLOOKUP($E101,Buski[Buski],1,0),IF($D101=Jędrzejowski[[#Headers],[Jędrzejowski]],VLOOKUP($E101,Jędrzejowski[Jędrzejowski],1,0),IF($D101=Kazimierski[[#Headers],[Kazimierski]],VLOOKUP($E101,Kazimierski[Kazimierski],1,0),IF($D101=Kielecki[[#Headers],[Kielecki]],VLOOKUP($E101,Kielecki[Kielecki],1,0),IF($D101=Konecki[[#Headers],[Konecki]],VLOOKUP($E101,Konecki[Konecki],1,0),IF($D101=Opatowski[[#Headers],[Opatowski]],VLOOKUP($E101,Opatowski[Opatowski],1,0),IF($D101=Ostrowiecki[[#Headers],[Ostrowiecki]],VLOOKUP($E101,Ostrowiecki[Ostrowiecki],1,0),IF($D101=Pińczowski[[#Headers],[Pińczowski]],VLOOKUP($E101,Pińczowski[Pińczowski],1,0),IF($D101=Sandomierski[[#Headers],[Sandomierski]],VLOOKUP($E101,Sandomierski[Sandomierski],1,0),IF($D101=Skarżyski[[#Headers],[Skarżyski]],VLOOKUP($E101,Skarżyski[Skarżyski],1,0),IF($D101=Starachowicki[[#Headers],[Starachowicki]],VLOOKUP($E101,Starachowicki[Starachowicki],1,0),IF($D101=Staszowski[[#Headers],[Staszowski]],VLOOKUP($E101,Staszowski[Staszowski],1,0),IF($D101=Włoszczowski[[#Headers],[Włoszczowski]],VLOOKUP($E101,Włoszczowski[Włoszczowski],1,0),\"\")))))))))))))","v":"Gowarczów"},"konecki"]
[null,null,null,"konecki","Końskie","gmina Końskie",{"$f":"VLOOKUP($F102,'DANE - TERC'!$D$6:$P$119,10,0)","v":2605033},{"$f":"VLOOKUP($F102,'DANE - TERC'!$D$6:$P$119,12,0)","v":"GM-W"},{"$f":"VLOOKUP($F102,'DANE - K1 lit.A'!$D$6:$M$119,4,0)","v":"TAK"},{"$f":"VLOOKUP($F102,'DANE - K1 lit.A'!$D$6:$M$119,5,0)","v":"TAK"},{"$f":"VLOOKUP($F102,'DANE - K1 lit.A'!$D$6:$M$119,6,0)","v":"TAK"},{"$f":"IF($E102=\"\",\"\",VLOOKUP($F102,'DANE - K4 lit.B'!$D$6:$E$107,2,0))","v":"TAK"},{"$f":"IF($E102=\"\",\"\",VLOOKUP($F102,'DANE - K2 lit.C'!$B$14:$I$114,8,0))","v":"w przedziale od 30 do 50 minut"},null,0.8,{"$f":"IF($D102=Buski[[#Headers],[Buski]],VLOOKUP($E102,Buski[Buski],1,0),IF($D102=Jędrzejowski[[#Headers],[Jędrzejowski]],VLOOKUP($E102,Jędrzejowski[Jędrzejowski],1,0),IF($D102=Kazimierski[[#Headers],[Kazimierski]],VLOOKUP($E102,Kazimierski[Kazimierski],1,0),IF($D102=Kielecki[[#Headers],[Kielecki]],VLOOKUP($E102,Kielecki[Kielecki],1,0),IF($D102=Konecki[[#Headers],[Konecki]],VLOOKUP($E102,Konecki[Konecki],1,0),IF($D102=Opatowski[[#Headers],[Opatowski]],VLOOKUP($E102,Opatowski[Opatowski],1,0),IF($D102=Ostrowiecki[[#Headers],[Ostrowiecki]],VLOOKUP($E102,Ostrowiecki[Ostrowiecki],1,0),IF($D102=Pińczowski[[#Headers],[Pińczowski]],VLOOKUP($E102,Pińczowski[Pińczowski],1,0),IF($D102=Sandomierski[[#Headers],[Sandomierski]],VLOOKUP($E102,Sandomierski[Sandomierski],1,0),IF($D102=Skarżyski[[#Headers],[Skarżyski]],VLOOKUP($E102,Skarżyski[Skarżyski],1,0),IF($D102=Starachowicki[[#Headers],[Starachowicki]],VLOOKUP($E102,Starachowicki[Starachowicki],1,0),IF($D102=Staszowski[[#Headers],[Staszowski]],VLOOKUP($E102,Staszowski[Staszowski],1,0),IF($D102=Włoszczowski[[#Headers],[Włoszczowski]],VLOOKUP($E102,Włoszczowski[Włoszczowski],1,0),\"\")))))))))))))","v":"Końskie"},"konecki"]
[null,null,null,"konecki","Radoszyce","gmina Radoszyce",{"$f":"VLOOKUP($F103,'DANE - TERC'!$D$6:$P$119,10,0)","v":2605043},{"$f":"VLOOKUP($F103,'DANE - TERC'!$D$6:$P$119,12,0)","v":"GM-W"},{"$f":"VLOOKUP($F103,'DANE - K1 lit.A'!$D$6:$M$119,4,0)","v":"NIE"},{"$f":"VLOOKUP($F103,'DANE - K1 lit.A'!$D$6:$M$119,5,0)","v":"NIE"},{"$f":"VLOOKUP($F103,'DANE - K1 lit.A'!$D$6:$M$119,6,0)","v":"NIE"},{"$f":"IF($E103=\"\",\"\",VLOOKUP($F103,'DANE - K4 lit.B'!$D$6:$E$107,2,0))","v":"NIE"},{"$f":"IF($E103=\"\",\"\",VLOOKUP($F103,'DANE - K2 lit.C'!$B$14:$I$114,8,0))","v":"w przedziale od 30 do 50 minut"},null,0.8,{"$f":"IF($D103=Buski[[#Headers],[Buski]],VLOOKUP($E103,Buski[Buski],1,0),IF($D103=Jędrzejowski[[#Headers],[Jędrzejowski]],VLOOKUP($E103,Jędrzejowski[Jędrzejowski],1,0),IF($D103=Kazimierski[[#Headers],[Kazimierski]],VLOOKUP($E103,Kazimierski[Kazimierski],1,0),IF($D103=Kielecki[[#Headers],[Kielecki]],VLOOKUP($E103,Kielecki[Kielecki],1,0),IF($D103=Konecki[[#Headers],[Konecki]],VLOOKUP($E103,Konecki[Konecki],1,0),IF($D103=Opatowski[[#Headers],[Opatowski]],VLOOKUP($E103,Opatowski[Opatowski],1,0),IF($D103=Ostrowiecki[[#Headers],[Ostrowiecki]],VLOOKUP($E103,Ostrowiecki[Ostrowiecki],1,0),IF($D103=Pińczowski[[#Headers],[Pińczowski]],VLOOKUP($E103,Pińczowski[Pińczowski],1,0),IF($D103=Sandomierski[[#Headers],[Sandomierski]],VLOOKUP($E103,Sandomierski[Sandomierski],1,0),IF($D103=Skarżyski[[#Headers],[Skarżyski]],VLOOKUP($E103,Skarżyski[Skarżyski],1,0),IF($D103=Starachowicki[[#Headers],[Starachowicki]],VLOOKUP($E103,Starachowicki[Starachowicki],1,0),IF($D103=Staszowski[[#Headers],[Staszowski]],VLOOKUP($E103,Staszowski[Staszowski],1,0),IF($D103=Włoszczowski[[#Headers],[Włoszczowski]],VLOOKUP($E103,Włoszczowski[Włoszczowski],1,0),\"\")))))))))))))","v":"Radoszyce"},"konecki"]
[null,null,null,"konecki","Ruda Maleniecka","gmina Ruda Maleniecka",{"$f":"VLOOKUP($F104,'DANE - TERC'!$D$6:$P$119,10,0)","v":2605052},{"$f":"VLOOKUP($F104,'DANE - TERC'!$D$6:$P$119,12,0)","v":"GW"},{"$f":"VLOOKUP($F104,'DANE - K1 lit.A'!$D$6:$M$119,4,0)","v":"NIE"},{"$f":"VLOOKUP($F104,'DANE - K1 lit.A'!$D$6:$M$119,5,0)","v":"NIE"},{"$f":"VLOOKUP($F104,'DANE - K1 lit.A'!$D$6:$M$119,6,0)","v":"NIE"},{"$f":"IF($E104=\"\",\"\",VLOOKUP($F104,'DANE - K4 lit.B'!$D$6:$E$107,2,0))","v":"NIE"},{"$f":"IF($E104=\"\",\"\",VLOOKUP($F104,'DANE - K2 lit.C'!$B$14:$I$114,8,0))","v":"w przedziale od 30 do 50 minut"},null,0.8,{"$f":"IF($D104=Buski[[#Headers],[Buski]],VLOOKUP($E104,Buski[Buski],1,0),IF($D104=Jędrzejowski[[#Headers],[Jędrzejowski]],VLOOKUP($E104,Jędrzejowski[Jędrzejowski],1,0),IF($D104=Kazimierski[[#Headers],[Kazimierski]],VLOOKUP($E104,Kazimierski[Kazimierski],1,0),IF($D104=Kielecki[[#Headers],[Kielecki]],VLOOKUP($E104,Kielecki[Kielecki],1,0),IF($D104=Konecki[[#Headers],[Konecki]],VLOOKUP($E104,Konecki[Konecki],1,0),IF($D104=Opatowski[[#Headers],[Opatowski]],VLOOKUP($E104,Opatowski[Opatowski],1,0),IF($D104=Ostrowiecki[[#Headers],[Ostrowiecki]],VLOOKUP($E104,Ostrowiecki[Ostrowiecki],1,0),IF($D104=Pińczowski[[#Headers],[Pińczowski]],VLOOKUP($E104,Pińczowski[Pińczowski],1,0),IF($D104=Sandomierski[[#Headers],[Sandomierski]],VLOOKUP($E104,Sandomierski[Sandomierski],1,0),IF($D104=Skarżyski[[#Headers],[Skarżyski]],VLOOKUP($E104,Skarżyski[Skarżyski],1,0),IF($D104=Starachowicki[[#Headers],[Starachowicki]],VLOOKUP($E104,Starachowicki[Starachowicki],1,0),IF($D104=Staszowski[[#Headers],[Staszowski]],VLOOKUP($E104,Staszowski[Staszowski],1,0),IF($D104=Włoszczowski[[#Headers],[Włoszczowski]],VLOOKUP($E104,Włoszczowski[Włoszczowski],1,0),\"\")))))))))))))","v":"Ruda Maleniecka"},"konecki"]
[null,null,null,"konecki","Słupia Konecka","gmina Słupia Konecka",{"$f":"VLOOKUP($F105,'DANE - TERC'!$D$6:$P$119,10,0)","v":2605062},{"$f":"VLOOKUP($F105,'DANE - TERC'!$D$6:$P$119,12,0)","v":"GW"},{"$f":"VLOOKUP($F105,'DANE - K1 lit.A'!$D$6:$M$119,4,0)","v":"NIE"},{"$f":"VLOOKUP($F105,'DANE - K1 lit.A'!$D$6:$M$119,5,0)","v":"NIE"},{"$f":"VLOOKUP($F105,'DANE - K1 lit.A'!$D$6:$M$119,6,0)","v":"NIE"},{"$f":"IF($E105=\"\",\"\",VLOOKUP($F105,'DANE - K4 lit.B'!$D$6:$E$107,2,0))","v":"NIE"},{"$f":"IF($E105=\"\",\"\",VLOOKUP($F105,'DANE - K2 lit.C'!$B$14:$I$114,8,0))","v":"w przedziale od 30 do 50 minut"},null,0.7,{"$f":"IF($D105=Buski[[#Headers],[Buski]],VLOOKUP($E105,Buski[Buski],1,0),IF($D105=Jędrzejowski[[#Headers],[Jędrzejowski]],VLOOKUP($E105,Jędrzejowski[Jędrzejowski],1,0),IF($D105=Kazimierski[[#Headers],[Kazimierski]],VLOOKUP($E105,Kazimierski[Kazimierski],1,0),IF($D105=Kielecki[[#Headers],[Kielecki]],VLOOKUP($E105,Kielecki[Kielecki],1,0),IF($D105=Konecki[[#Headers],[Konecki]],VLOOKUP($E105,Konecki[Konecki],1,0),IF($D105=Opatowski[[#Headers],[Opatowski]],VLOOKUP($E105,Opatowski[Opatowski],1,0),IF($D105=Ostrowiecki[[#Headers],[Ostrowiecki]],VLOOKUP($E105,Ostrowiecki[Ostrowiecki],1,0),IF($D105=Pińczowski[[#Headers],[Pińczowski]],VLOOKUP($E105,Pińczowski[Pińczowski],1,0),IF($D105=Sandomierski[[#Headers],[Sandomierski]],VLOOKUP($E105,Sandomierski[Sandomierski],1,0),IF($D105=Skarżyski[[#Headers],[Skarżyski]],VLOOKUP($E105,Skarżyski[Skarżyski],1,0),IF($D105=Starachowicki[[#Headers],[Starachowicki]],VLOOKUP($E105,Starachowicki[Starachowicki],1,0),IF($D105=Staszowski[[#Headers],[Staszowski]],VLOOKUP($E105,Staszowski[Staszowski],1,0),IF($D105=Włoszczowski[[#Headers],[Włoszczowski]],VLOOKUP($E105,Włoszczowski[Włoszczowski],1,0),\"\")))))))))))))","v":"Słupia Konecka"},"konecki"]
[null,null,null,"konecki","Smyków","gmina Smyków",{"$f":"VLOOKUP($F106,'DANE - TERC'!$D$6:$P$119,10,0)","v":2605072},{"$f":"VLOOKUP($F106,'DANE - TERC'!$D$6:$P$119,12,0)","v":"GW"},{"$f":"VLOOKUP($F106,'DANE - K1 lit.A'!$D$6:$M$119,4,0)","v":"NIE"},{"$f":"VLOOKUP($F106,'DANE - K1 lit.A'!$D$6:$M$119,5,0)","v":"TAK"},{"$f":"VLOOKUP($F106,'DANE - K1 lit.A'!$D$6:$M$119,6,0)","v":"NIE"},{"$f":"IF($E106=\"\",\"\",VLOOKUP($F106,'DANE - K4 lit.B'!$D$6:$E$107,2,0))","v":"NIE"},{"$f":"IF($E106=\"\",\"\",VLOOKUP($F106,'DANE - K2 lit.C'!$B$14:$I$114,8,0))","v":"w przedziale od 30 do 50 minut"},null,0.8,{"$f":"IF($D106=Buski[[#Headers],[Buski]],VLOOKUP($E106,Buski[Buski],1,0),IF($D106=Jędrzejowski[[#Headers],[Jędrzejowski]],VLOOKUP($E106,Jędrzejowski[Jędrzejowski],1,0),IF($D106=Kazimierski[[#Headers],[Kazimierski]],VLOOKUP($E106,Kazimierski[Kazimierski],1,0),IF($D106=Kielecki[[#Headers],[Kielecki]],VLOOKUP($E106,Kielecki[Kielecki],1,0),IF($D106=Konecki[[#Headers],[Konecki]],VLOOKUP($E106,Konecki[Konecki],1,0),IF($D106=Opatowski[[#Headers],[Opatowski]],VLOOKUP($E106,Opatowski[Opatowski],1,0),IF($D106=Ostrowiecki[[#Headers],[Ostrowiecki]],VLOOKUP($E106,Ostrowiecki[Ostrowiecki],1,0),IF($D106=Pińczowski[[#Headers],[Pińczowski]],VLOOKUP($E106,Pińczowski[Pińczowski],1,0),IF($D106=Sandomierski[[#Headers],[Sandomierski]],VLOOKUP($E106,Sandomierski[Sandomierski],1,0),IF($D106=Skarżyski[[#Headers],[Skarżyski]],VLOOKUP($E106,Skarżyski[Skarżyski],1,0),IF($D106=Starachowicki[[#Headers],[Starachowicki]],VLOOKUP($E106,Starachowicki[Starachowicki],1,0),IF($D106=Staszowski[[#Headers],[Staszowski]],VLOOKUP($E106,Staszowski[Staszowski],1,0),IF($D106=Włoszczowski[[#Headers],[Włoszczowski]],VLOOKUP($E106,Włoszczowski[Włoszczowski],1,0),\"\")))))))))))))","v":"Smyków"},"konecki"]
[null,null,null,"konecki","Stąporków","gmina Stąporków",{"$f":"VLOOKUP($F107,'DANE - TERC'!$D$6:$P$119,10,0)","v":2605083},{"$f":"VLOOKUP($F107,'DANE - TERC'!$D$6:$P$119,12,0)","v":"GM-W"},{"$f":"VLOOKUP($F107,'DANE - K1 lit.A'!$D$6:$M$119,4,0)","v":"TAK"},{"$f":"VLOOKUP($F107,'DANE - K1 lit.A'!$D$6:$M$119,5,0)","v":"TAK"},{"$f":"VLOOKUP($F107,'DANE - K1 lit.A'!$D$6:$M$119,6,0)","v":"TAK"},{"$f":"IF($E107=\"\",\"\",VLOOKUP($F107,'DANE - K4 lit.B'!$D$6:$E$107,2,0))","v":"NIE"},{"$f":"IF($E107=\"\",\"\",VLOOKUP($F107,'DANE - K2 lit.C'!$B$14:$I$114,8,0))","v":"w przedziale od 30 do 50 minut"},null,0.8,{"$f":"IF($D107=Buski[[#Headers],[Buski]],VLOOKUP($E107,Buski[Buski],1,0),IF($D107=Jędrzejowski[[#Headers],[Jędrzejowski]],VLOOKUP($E107,Jędrzejowski[Jędrzejowski],1,0),IF($D107=Kazimierski[[#Headers],[Kazimierski]],VLOOKUP($E107,Kazimierski[Kazimierski],1,0),IF($D107=Kielecki[[#Headers],[Kielecki]],VLOOKUP($E107,Kielecki[Kielecki],1,0),IF($D107=Konecki[[#Headers],[Konecki]],VLOOKUP($E107,Konecki[Konecki],1,0),IF($D107=Opatowski[[#Headers],[Opatowski]],VLOOKUP($E107,Opatowski[Opatowski],1,0),IF($D107=Ostrowiecki[[#Headers],[Ostrowiecki]],VLOOKUP($E107,Ostrowiecki[Ostrowiecki],1,0),IF($D107=Pińczowski[[#Headers],[Pińczowski]],VLOOKUP($E107,Pińczowski[Pińczowski],1,0),IF($D107=Sandomierski[[#Headers],[Sandomierski]],VLOOKUP($E107,Sandomierski[Sandomierski],1,0),IF($D107=Skarżyski[[#Headers],[Skarżyski]],VLOOKUP($E107,Skarżyski[Skarżyski],1,0),IF($D107=Starachowicki[[#Headers],[Starachowicki]],VLOOKUP($E107,Starachowicki[Starachowicki],1,0),IF($D107=Staszowski[[#Headers],[Staszowski]],VLOOKUP($E107,Staszowski[Staszowski],1,0),IF($D107=Włoszczowski[[#Headers],[Włoszczowski]],VLOOKUP($E107,Włoszczowski[Włoszczowski],1,0),\"\")))))))))))))","v":"Stąporków"},"konecki"]
[null,null,null,"opatowski","Baćkowice","gmina Baćkowice",{"$f":"VLOOKUP($F108,'DANE - TERC'!$D$6:$P$119,10,0)","v":2606012},{"$f":"VLOOKUP($F108,'DANE - TERC'!$D$6:$P$119,12,0)","v":"GW"},{"$f":"VLOOKUP($F108,'DANE - K1 lit.A'!$D$6:$M$119,4,0)","v":"NIE"},{"$f":"VLOOKUP($F108,'DANE - K1 lit.A'!$D$6:$M$119,5,0)","v":"NIE"},{"$f":"VLOOKUP($F108,'DANE - K1 lit.A'!$D$6:$M$119,6,0)","v":"NIE"},{"$f":"IF($E108=\"\",\"\",VLOOKUP($F108,'DANE - K4 lit.B'!$D$6:$E$107,2,0))","v":"NIE"},{"$f":"IF($E108=\"\",\"\",VLOOKUP($F108,'DANE - K2 lit.C'!$B$14:$I$114,8,0))","v":"w przedziale od 30 do 50 minut"},null,0.7,{"$f":"IF($D108=Buski[[#Headers],[Buski]],VLOOKUP($E108,Buski[Buski],1,0),IF($D108=Jędrzejowski[[#Headers],[Jędrzejowski]],VLOOKUP($E108,Jędrzejowski[Jędrzejowski],1,0),IF($D108=Kazimierski[[#Headers],[Kazimierski]],VLOOKUP($E108,Kazimierski[Kazimierski],1,0),IF($D108=Kielecki[[#Headers],[Kielecki]],VLOOKUP($E108,Kielecki[Kielecki],1,0),IF($D108=Konecki[[#Headers],[Konecki]],VLOOKUP($E108,Konecki[Konecki],1,0),IF($D108=Opatowski[[#Headers],[Opatowski]],VLOOKUP($E108,Opatowski[Opatowski],1,0),IF($D108=Ostrowiecki[[#Headers],[Ostrowiecki]],VLOOKUP($E108,Ostrowiecki[Ostrowiecki],1,0),IF($D108=Pińczowski[[#Headers],[Pińczowski]],VLOOKUP($E108,Pińczowski[Pińczowski],1,0),IF($D108=Sandomierski[[#Headers],[Sandomierski]],VLOOKUP($E108,Sandomierski[Sandomierski],1,0),IF($D108=Skarżyski[[#Headers],[Skarżyski]],VLOOKUP($E108,Skarżyski[Skarżyski],1,0),IF($D108=Starachowicki[[#Headers],[Starachowicki]],VLOOKUP($E108,Starachowicki[Starachowicki],1,0),IF($D108=Staszowski[[#Headers],[Staszowski]],VLOOKUP($E108,Staszowski[Staszowski],1,0),IF($D108=Włoszczowski[[#Headers],[Włoszczowski]],VLOOKUP($E108,Włoszczowski[Włoszczowski],1,0),\"\")))))))))))))","v":"Baćkowice"},"opatowski"]
[null,null,null,"opatowski","Iwaniska","gmina Iwaniska",{"$f":"VLOOKUP($F109,'DANE - TERC'!$D$6:$P$119,10,0)","v":2606023},{"$f":"VLOOKUP($F109,'DANE - TERC'!$D$6:$P$119,12,0)","v":"GM-W"},{"$f":"VLOOKUP($F109,'DANE - K1 lit.A'!$D$6:$M$119,4,0)","v":"TAK"},{"$f":"VLOOKUP($F109,'DANE - K1 lit.A'!$D$6:$M$119,5,0)","v":"NIE"},{"$f":"VLOOKUP($F109,'DANE - K1 lit.A'!$D$6:$M$119,6,0)","v":"NIE"},{"$f":"IF($E109=\"\",\"\",VLOOKUP($F109,'DANE - K4 lit.B'!$D$6:$E$107,2,0))","v":"NIE"},{"$f":"IF($E109=\"\",\"\",VLOOKUP($F109,'DANE - K2 lit.C'!$B$14:$I$114,8,0))","v":"w przedziale od 30 do 50 minut"},null,0.8,{"$f":"IF($D109=Buski[[#Headers],[Buski]],VLOOKUP($E109,Buski[Buski],1,0),IF($D109=Jędrzejowski[[#Headers],[Jędrzejowski]],VLOOKUP($E109,Jędrzejowski[Jędrzejowski],1,0),IF($D109=Kazimierski[[#Headers],[Kazimierski]],VLOOKUP($E109,Kazimierski[Kazimierski],1,0),IF($D109=Kielecki[[#Headers],[Kielecki]],VLOOKUP($E109,Kielecki[Kielecki],1,0),IF($D109=Konecki[[#Headers],[Konecki]],VLOOKUP($E109,Konecki[Konecki],1,0),IF($D109=Opatowski[[#Headers],[Opatowski]],VLOOKUP($E109,Opatowski[Opatowski],1,0),IF($D109=Ostrowiecki[[#Headers],[Ostrowiecki]],VLOOKUP($E109,Ostrowiecki[Ostrowiecki],1,0),IF($D109=Pińczowski[[#Headers],[Pińczowski]],VLOOKUP($E109,Pińczowski[Pińczowski],1,0),IF($D109=Sandomierski[[#Headers],[Sandomierski]],VLOOKUP($E109,Sandomierski[Sandomierski],1,0),IF($D109=Skarżyski[[#Headers],[Skarżyski]],VLOOKUP($E109,Skarżyski[Skarżyski],1,0),IF($D109=Starachowicki[[#Headers],[Starachowicki]],VLOOKUP($E109,Starachowicki[Starachowicki],1,0),IF($D109=Staszowski[[#Headers],[Staszowski]],VLOOKUP($E109,Staszowski[Staszowski],1,0),IF($D109=Włoszczowski[[#Headers],[Włoszczowski]],VLOOKUP($E109,Włoszczowski[Włoszczowski],1,0),\"\")))))))))))))","v":"Iwaniska"},"opatowski"]
[null,null,null,"opatowski","Lipnik","gmina Lipnik",{"$f":"VLOOKUP($F110,'DANE - TERC'!$D$6:$P$119,10,0)","v":2606032},{"$f":"VLOOKUP($F110,'DANE - TERC'!$D$6:$P$119,12,0)","v":"GW"},{"$f":"VLOOKUP($F110,'DANE - K1 lit.A'!$D$6:$M$119,4,0)","v":"NIE"},{"$f":"VLOOKUP($F110,'DANE - K1 lit.A'!$D$6:$M$119,5,0)","v":"NIE"},{"$f":"VLOOKUP($F110,'DANE - K1 lit.A'!$D$6:$M$119,6,0)","v":"NIE"},{"$f":"IF($E110=\"\",\"\",VLOOKUP($F110,'DANE - K4 lit.B'!$D$6:$E$107,2,0))","v":"NIE"},{"$f":"IF($E110=\"\",\"\",VLOOKUP($F110,'DANE - K2 lit.C'!$B$14:$I$114,8,0))","v":"w przedziale od 30 do 50 minut"},null,0.8,{"$f":"IF($D110=Buski[[#Headers],[Buski]],VLOOKUP($E110,Buski[Buski],1,0),IF($D110=Jędrzejowski[[#Headers],[Jędrzejowski]],VLOOKUP($E110,Jędrzejowski[Jędrzejowski],1,0),IF($D110=Kazimierski[[#Headers],[Kazimierski]],VLOOKUP($E110,Kazimierski[Kazimierski],1,0),IF($D110=Kielecki[[#Headers],[Kielecki]],VLOOKUP($E110,Kielecki[Kielecki],1,0),IF($D110=Konecki[[#Headers],[Konecki]],VLOOKUP($E110,Konecki[Konecki],1,0),IF($D110=Opatowski[[#Headers],[Opatowski]],VLOOKUP($E110,Opatowski[Opatowski],1,0),IF($D110=Ostrowiecki[[#Headers],[Ostrowiecki]],VLOOKUP($E110,Ostrowiecki[Ostrowiecki],1,0),IF($D110=Pińczowski[[#Headers],[Pińczowski]],VLOOKUP($E110,Pińczowski[Pińczowski],1,0),IF($D110=Sandomierski[[#Headers],[Sandomierski]],VLOOKUP($E110,Sandomierski[Sandomierski],1,0),IF($D110=Skarżyski[[#Headers],[Skarżyski]],VLOOKUP($E110,Skarżyski[Skarżyski],1,0),IF($D110=Starachowicki[[#Headers],[Starachowicki]],VLOOKUP($E110,Starachowicki[Starachowicki],1,0),IF($D110=Staszowski[[#Headers],[Staszowski]],VLOOKUP($E110,Staszowski[Staszowski],1,0),IF($D110=Włoszczowski[[#Headers],[Włoszczowski]],VLOOKUP($E110,Włoszczowski[Włoszczowski],1,0),\"\")))))))))))))","v":"Lipnik"},"opatowski"]
[null,null,null,"opatowski","Opatów","gmina Opatów",{"$f":"VLOOKUP($F111,'DANE - TERC'!$D$6:$P$119,10,0)","v":2606043},{"$f":"VLOOKUP($F111,'DANE - TERC'!$D$6:$P$119,12,0)","v":"GM-W"},{"$f":"VLOOKUP($F111,'DANE - K1 lit.A'!$D$6:$M$119,4,0)","v":"TAK"},{"$f":"VLOOKUP($F111,'DANE - K1 lit.A'!$D$6:$M$119,5,0)","v":"NIE"},{"$f":"VLOOKUP($F111,'DANE - K1 lit.A'!$D$6:$M$119,6,0)","v":"NIE"},{"$f":"IF($E111=\"\",\"\",VLOOKUP($F111,'DANE - K4 lit.B'!$D$6:$E$107,2,0))","v":"NIE"},{"$f":"IF($E111=\"\",\"\",VLOOKUP($F111,'DANE - K2 lit.C'!$B$14:$I$114,8,0))","v":"w przedziale od 30 do 50 minut"},null,0.8,{"$f":"IF($D111=Buski[[#Headers],[Buski]],VLOOKUP($E111,Buski[Buski],1,0),IF($D111=Jędrzejowski[[#Headers],[Jędrzejowski]],VLOOKUP($E111,Jędrzejowski[Jędrzejowski],1,0),IF($D111=Kazimierski[[#Headers],[Kazimierski]],VLOOKUP($E111,Kazimierski[Kazimierski],1,0),IF($D111=Kielecki[[#Headers],[Kielecki]],VLOOKUP($E111,Kielecki[Kielecki],1,0),IF($D111=Konecki[[#Headers],[Konecki]],VLOOKUP($E111,Konecki[Konecki],1,0),IF($D111=Opatowski[[#Headers],[Opatowski]],VLOOKUP($E111,Opatowski[Opatowski],1,0),IF($D111=Ostrowiecki[[#Headers],[Ostrowiecki]],VLOOKUP($E111,Ostrowiecki[Ostrowiecki],1,0),IF($D111=Pińczowski[[#Headers],[Pińczowski]],VLOOKUP($E111,Pińczowski[Pińczowski],1,0),IF($D111=Sandomierski[[#Headers],[Sandomierski]],VLOOKUP($E111,Sandomierski[Sandomierski],1,0),IF($D111=Skarżyski[[#Headers],[Skarżyski]],VLOOKUP($E111,Skarżyski[Skarżyski],1,0),IF($D111=Starachowicki[[#Headers],[Starachowicki]],VLOOKUP($E111,Starachowicki[Starachowicki],1,0),IF($D111=Staszowski[[#Headers],[Staszowski]],VLOOKUP($E111,Staszowski[Staszowski],1,0),IF($D111=Włoszczowski[[#Headers],[Włoszczowski]],VLOOKUP($E111,Włoszczowski[Włoszczowski],1,0),\"\")))))))))))))","v":"Opatów"},{"$f":"D111","v":"opatowski"}]
[null,null,null,"opatowski","Ożarów","gmina Ożarów",{"$f":"VLOOKUP($F112,'DANE - TERC'!$D$6:$P$119,10,0)","v":2606053},{"$f":"VLOOKUP($F112,'DANE - TERC'!$D$6:$P$119,12,0)","v":"GM-W"},{"$f":"VLOOKUP($F112,'DANE - K1 lit.A'!$D$6:$M$119,4,0)","v":"TAK"},{"$f":"VLOOKUP($F112,'DANE - K1 lit.A'!$D$6:$M$119,5,0)","v":"TAK"},{"$f":"VLOOKUP($F112,'DANE - K1 lit.A'!$D$6:$M$119,6,0)","v":"NIE"},{"$f":"IF($E112=\"\",\"\",VLOOKUP($F112,'DANE - K4 lit.B'!$D$6:$E$107,2,0))","v":"NIE"},{"$f":"IF($E112=\"\",\"\",VLOOKUP($F112,'DANE - K2 lit.C'!$B$14:$I$114,8,0))","v":"większy niż 50 minut"},null,0.6,{"$f":"IF($D112=Buski[[#Headers],[Buski]],VLOOKUP($E112,Buski[Buski],1,0),IF($D112=Jędrzejowski[[#Headers],[Jędrzejowski]],VLOOKUP($E112,Jędrzejowski[Jędrzejowski],1,0),IF($D112=Kazimierski[[#Headers],[Kazimierski]],VLOOKUP($E112,Kazimierski[Kazimierski],1,0),IF($D112=Kielecki[[#Headers],[Kielecki]],VLOOKUP($E112,Kielecki[Kielecki],1,0),IF($D112=Konecki[[#Headers],[Konecki]],VLOOKUP($E112,Konecki[Konecki],1,0),IF($D112=Opatowski[[#Headers],[Opatowski]],VLOOKUP($E112,Opatowski[Opatowski],1,0),IF($D112=Ostrowiecki[[#Headers],[Ostrowiecki]],VLOOKUP($E112,Ostrowiecki[Ostrowiecki],1,0),IF($D112=Pińczowski[[#Headers],[Pińczowski]],VLOOKUP($E112,Pińczowski[Pińczowski],1,0),IF($D112=Sandomierski[[#Headers],[Sandomierski]],VLOOKUP($E112,Sandomierski[Sandomierski],1,0),IF($D112=Skarżyski[[#Headers],[Skarżyski]],VLOOKUP($E112,Skarżyski[Skarżyski],1,0),IF($D112=Starachowicki[[#Headers],[Starachowicki]],VLOOKUP($E112,Starachowicki[Starachowicki],1,0),IF($D112=Staszowski[[#Headers],[Staszowski]],VLOOKUP($E112,Staszowski[Staszowski],1,0),IF($D112=Włoszczowski[[#Headers],[Włoszczowski]],VLOOKUP($E112,Włoszczowski[Włoszczowski],1,0),\"\")))))))))))))","v":"Ożarów"},"opatowski"]
[null,null,null,"opatowski","Sadowie","gmina Sadowie",{"$f":"VLOOKUP($F113,'DANE - TERC'!$D$6:$P$119,10,0)","v":2606062},{"$f":"VLOOKUP($F113,'DANE - TERC'!$D$6:$P$119,12,0)","v":"GW"},{"$f":"VLOOKUP($F113,'DANE - K1 lit.A'!$D$6:$M$119,4,0)","v":"NIE"},{"$f":"VLOOKUP($F113,'DANE - K1 lit.A'!$D$6:$M$119,5,0)","v":"NIE"},{"$f":"VLOOKUP($F113,'DANE - K1 lit.A'!$D$6:$M$119,6,0)","v":"NIE"},{"$f":"IF($E113=\"\",\"\",VLOOKUP($F113,'DANE - K4 lit.B'!$D$6:$E$107,2,0))","v":"NIE"},{"$f":"IF($E113=\"\",\"\",VLOOKUP($F113,'DANE - K2 lit.C'!$B$14:$I$114,8,0))","v":"w przedziale od 30 do 50 minut"},null,0.8,{"$f":"IF($D113=Buski[[#Headers],[Buski]],VLOOKUP($E113,Buski[Buski],1,0),IF($D113=Jędrzejowski[[#Headers],[Jędrzejowski]],VLOOKUP($E113,Jędrzejowski[Jędrzejowski],1,0),IF($D113=Kazimierski[[#Headers],[Kazimierski]],VLOOKUP($E113,Kazimierski[Kazimierski],1,0),IF($D113=Kielecki[[#Headers],[Kielecki]],VLOOKUP($E113,Kielecki[Kielecki],1,0),IF($D113=Konecki[[#Headers],[Konecki]],VLOOKUP($E113,Konecki[Konecki],1,0),IF($D113=Opatowski[[#Headers],[Opatowski]],VLOOKUP($E113,Opatowski[Opatowski],1,0),IF($D113=Ostrowiecki[[#Headers],[Ostrowiecki]],VLOOKUP($E113,Ostrowiecki[Ostrowiecki],1,0),IF($D113=Pińczowski[[#Headers],[Pińczowski]],VLOOKUP($E113,Pińczowski[Pińczowski],1,0),IF($D113=Sandomierski[[#Headers],[Sandomierski]],VLOOKUP($E113,Sandomierski[Sandomierski],1,0),IF($D113=Skarżyski[[#Headers],[Skarżyski]],VLOOKUP($E113,Skarżyski[Skarżyski],1,0),IF($D113=Starachowicki[[#Headers],[Starachowicki]],VLOOKUP($E113,Starachowicki[Starachowicki],1,0),IF($D113=Staszowski[[#Headers],[Staszowski]],VLOOKUP($E113,Staszowski[Staszowski],1,0),IF($D113=Włoszczowski[[#Headers],[Włoszczowski]],VLOOKUP($E113,Włoszczowski[Włoszczowski],1,0),\"\")))))))))))))","v":"Sadowie"},"opatowski"]
[null,null,null,"opatowski","Tarłów","gmina Tarłów",{"$f":"VLOOKUP($F114,'DANE - TERC'!$D$6:$P$119,10,0)","v":2606072},{"$f":"VLOOKUP($F114,'DANE - TERC'!$D$6:$P$119,12,0)","v":"GW"},{"$f":"VLOOKUP($F114,'DANE - K1 lit.A'!$D$6:$M$119,4,0)","v":"NIE"},{"$f":"VLOOKUP($F114,'DANE - K1 lit.A'!$D$6:$M$119,5,0)","v":"TAK"},{"$f":"VLOOKUP($F114,'DANE - K1 lit.A'!$D$6:$M$119,6,0)","v":"NIE"},{"$f":"IF($E114=\"\",\"\",VLOOKUP($F114,'DANE - K4 lit.B'!$D$6:$E$107,2,0))","v":"NIE"},{"$f":"IF($E114=\"\",\"\",VLOOKUP($F114,'DANE - K2 lit.C'!$B$14:$I$114,8,0))","v":"większy niż 50 minut"},null,0.8,{"$f":"IF($D114=Buski[[#Headers],[Buski]],VLOOKUP($E114,Buski[Buski],1,0),IF($D114=Jędrzejowski[[#Headers],[Jędrzejowski]],VLOOKUP($E114,Jędrzejowski[Jędrzejowski],1,0),IF($D114=Kazimierski[[#Headers],[Kazimierski]],VLOOKUP($E114,Kazimierski[Kazimierski],1,0),IF($D114=Kielecki[[#Headers],[Kielecki]],VLOOKUP($E114,Kielecki[Kielecki],1,0),IF($D114=Konecki[[#Headers],[Konecki]],VLOOKUP($E114,Konecki[Konecki],1,0),IF($D114=Opatowski[[#Headers],[Opatowski]],VLOOKUP($E114,Opatowski[Opatowski],1,0),IF($D114=Ostrowiecki[[#Headers],[Ostrowiecki]],VLOOKUP($E114,Ostrowiecki[Ostrowiecki],1,0),IF($D114=Pińczowski[[#Headers],[Pińczowski]],VLOOKUP($E114,Pińczowski[Pińczowski],1,0),IF($D114=Sandomierski[[#Headers],[Sandomierski]],VLOOKUP($E114,Sandomierski[Sandomierski],1,0),IF($D114=Skarżyski[[#Headers],[Skarżyski]],VLOOKUP($E114,Skarżyski[Skarżyski],1,0),IF($D114=Starachowicki[[#Headers],[Starachowicki]],VLOOKUP($E114,Starachowicki[Starachowicki],1,0),IF($D114=Staszowski[[#Headers],[Staszowski]],VLOOKUP($E114,Staszowski[Staszowski],1,0),IF($D114=Włoszczowski[[#Headers],[Włoszczowski]],VLOOKUP($E114,Włoszczowski[Włoszczowski],1,0),\"\")))))))))))))","v":"Tarłów"},"opatowski"]
[null,null,null,"opatowski","Wojciechowice","gmina Wojciechowice",{"$f":"VLOOKUP($F115,'DANE - TERC'!$D$6:$P$119,10,0)","v":2606082},{"$f":"VLOOKUP($F115,'DANE - TERC'!$D$6:$P$119,12,0)","v":"GW"},{"$f":"VLOOKUP($F115,'DANE - K1 lit.A'!$D$6:$M$119,4,0)","v":"TAK"},{"$f":"VLOOKUP($F115,'DANE - K1 lit.A'!$D$6:$M$119,5,0)","v":"TAK"},{"$f":"VLOOKUP($F115,'DANE - K1 lit.A'!$D$6:$M$119,6,0)","v":"TAK"},{"$f":"IF($E115=\"\",\"\",VLOOKUP($F115,'DANE - K4 lit.B'!$D$6:$E$107,2,0))","v":"NIE"},{"$f":"IF($E115=\"\",\"\",VLOOKUP($F115,'DANE - K2 lit.C'!$B$14:$I$114,8,0))","v":"w przedziale od 30 do 50 minut"},null,0.8,{"$f":"IF($D115=Buski[[#Headers],[Buski]],VLOOKUP($E115,Buski[Buski],1,0),IF($D115=Jędrzejowski[[#Headers],[Jędrzejowski]],VLOOKUP($E115,Jędrzejowski[Jędrzejowski],1,0),IF($D115=Kazimierski[[#Headers],[Kazimierski]],VLOOKUP($E115,Kazimierski[Kazimierski],1,0),IF($D115=Kielecki[[#Headers],[Kielecki]],VLOOKUP($E115,Kielecki[Kielecki],1,0),IF($D115=Konecki[[#Headers],[Konecki]],VLOOKUP($E115,Konecki[Konecki],1,0),IF($D115=Opatowski[[#Headers],[Opatowski]],VLOOKUP($E115,Opatowski[Opatowski],1,0),IF($D115=Ostrowiecki[[#Headers],[Ostrowiecki]],VLOOKUP($E115,Ostrowiecki[Ostrowiecki],1,0),IF($D115=Pińczowski[[#Headers],[Pińczowski]],VLOOKUP($E115,Pińczowski[Pińczowski],1,0),IF($D115=Sandomierski[[#Headers],[Sandomierski]],VLOOKUP($E115,Sandomierski[Sandomierski],1,0),IF($D115=Skarżyski[[#Headers],[Skarżyski]],VLOOKUP($E115,Skarżyski[Skarżyski],1,0),IF($D115=Starachowicki[[#Headers],[Starachowicki]],VLOOKUP($E115,Starachowicki[Starachowicki],1,0),IF($D115=Staszowski[[#Headers],[Staszowski]],VLOOKUP($E115,Staszowski[Staszowski],1,0),IF($D115=Włoszczowski[[#Headers],[Włoszczowski]],VLOOKUP($E115,Włoszczowski[Włoszczowski],1,0),\"\")))))))))))))","v":"Wojciechowice"},"opatowski"]
[null,null,null,"ostrowiecki","Bałtów","gmina Bałtów",{"$f":"VLOOKUP($F116,'DANE - TERC'!$D$6:$P$119,10,0)","v":2607022},{"$f":"VLOOKUP($F116,'DANE - TERC'!$D$6:$P$119,12,0)","v":"GW"},{"$f":"VLOOKUP($F116,'DANE - K1 lit.A'!$D$6:$M$119,4,0)","v":"NIE"},{"$f":"VLOOKUP($F116,'DANE - K1 lit.A'!$D$6:$M$119,5,0)","v":"TAK"},{"$f":"VLOOKUP($F116,'DANE - K1 lit.A'!$D$6:$M$119,6,0)","v":"NIE"},{"$f":"IF($E116=\"\",\"\",VLOOKUP($F116,'DANE - K4 lit.B'!$D$6:$E$107,2,0))","v":"NIE"},{"$f":"IF($E116=\"\",\"\",VLOOKUP($F116,'DANE - K2 lit.C'!$B$14:$I$114,8,0))","v":"większy niż 50 minut"},null,0.8,{"$f":"IF($D116=Buski[[#Headers],[Buski]],VLOOKUP($E116,Buski[Buski],1,0),IF($D116=Jędrzejowski[[#Headers],[Jędrzejowski]],VLOOKUP($E116,Jędrzejowski[Jędrzejowski],1,0),IF($D116=Kazimierski[[#Headers],[Kazimierski]],VLOOKUP($E116,Kazimierski[Kazimierski],1,0),IF($D116=Kielecki[[#Headers],[Kielecki]],VLOOKUP($E116,Kielecki[Kielecki],1,0),IF($D116=Konecki[[#Headers],[Konecki]],VLOOKUP($E116,Konecki[Konecki],1,0),IF($D116=Opatowski[[#Headers],[Opatowski]],VLOOKUP($E116,Opatowski[Opatowski],1,0),IF($D116=Ostrowiecki[[#Headers],[Ostrowiecki]],VLOOKUP($E116,Ostrowiecki[Ostrowiecki],1,0),IF($D116=Pińczowski[[#Headers],[Pińczowski]],VLOOKUP($E116,Pińczowski[Pińczowski],1,0),IF($D116=Sandomierski[[#Headers],[Sandomierski]],VLOOKUP($E116,Sandomierski[Sandomierski],1,0),IF($D116=Skarżyski[[#Headers],[Skarżyski]],VLOOKUP($E116,Skarżyski[Skarżyski],1,0),IF($D116=Starachowicki[[#Headers],[Starachowicki]],VLOOKUP($E116,Starachowicki[Starachowicki],1,0),IF($D116=Staszowski[[#Headers],[Staszowski]],VLOOKUP($E116,Staszowski[Staszowski],1,0),IF($D116=Włoszczowski[[#Headers],[Włoszczowski]],VLOOKUP($E116,Włoszczowski[Włoszczowski],1,0),\"\")))))))))))))","v":"Bałtów"},"ostrowiecki"]
[null,null,null,"ostrowiecki","Bodzechów","gmina Bodzechów",{"$f":"VLOOKUP($F117,'DANE - TERC'!$D$6:$P$119,10,0)","v":2607032},{"$f":"VLOOKUP($F117,'DANE - TERC'!$D$6:$P$119,12,0)","v":"GW"},{"$f":"VLOOKUP($F117,'DANE - K1 lit.A'!$D$6:$M$119,4,0)","v":"TAK"},{"$f":"VLOOKUP($F117,'DANE - K1 lit.A'!$D$6:$M$119,5,0)","v":"TAK"},{"$f":"VLOOKUP($F117,'DANE - K1 lit.A'!$D$6:$M$119,6,0)","v":"TAK"},{"$f":"IF($E117=\"\",\"\",VLOOKUP($F117,'DANE - K4 lit.B'!$D$6:$E$107,2,0))","v":"NIE"},{"$f":"IF($E117=\"\",\"\",VLOOKUP($F117,'DANE - K2 lit.C'!$B$14:$I$114,8,0))","v":"większy niż 50 minut"},null,0.8,{"$f":"IF($D117=Buski[[#Headers],[Buski]],VLOOKUP($E117,Buski[Buski],1,0),IF($D117=Jędrzejowski[[#Headers],[Jędrzejowski]],VLOOKUP($E117,Jędrzejowski[Jędrzejowski],1,0),IF($D117=Kazimierski[[#Headers],[Kazimierski]],VLOOKUP($E117,Kazimierski[Kazimierski],1,0),IF($D117=Kielecki[[#Headers],[Kielecki]],VLOOKUP($E117,Kielecki[Kielecki],1,0),IF($D117=Konecki[[#Headers],[Konecki]],VLOOKUP($E117,Konecki[Konecki],1,0),IF($D117=Opatowski[[#Headers],[Opatowski]],VLOOKUP($E117,Opatowski[Opatowski],1,0),IF($D117=Ostrowiecki[[#Headers],[Ostrowiecki]],VLOOKUP($E117,Ostrowiecki[Ostrowiecki],1,0),IF($D117=Pińczowski[[#Headers],[Pińczowski]],VLOOKUP($E117,Pińczowski[Pińczowski],1,0),IF($D117=Sandomierski[[#Headers],[Sandomierski]],VLOOKUP($E117,Sandomierski[Sandomierski],1,0),IF($D117=Skarżyski[[#Headers],[Skarżyski]],VLOOKUP($E117,Skarżyski[Skarżyski],1,0),IF($D117=Starachowicki[[#Headers],[Starachowicki]],VLOOKUP($E117,Starachowicki[Starachowicki],1,0),IF($D117=Staszowski[[#Headers],[Staszowski]],VLOOKUP($E117,Staszowski[Staszowski],1,0),IF($D117=Włoszczowski[[#Headers],[Włoszczowski]],VLOOKUP($E117,Włoszczowski[Włoszczowski],1,0),\"\")))))))))))))","v":"Bodzechów"},"ostrowiecki"]
[null,null,null,"ostrowiecki","Ćmielów","gmina Ćmielów",{"$f":"VLOOKUP($F118,'DANE - TERC'!$D$6:$P$119,10,0)","v":2607043},{"$f":"VLOOKUP($F118,'DANE - TERC'!$D$6:$P$119,12,0)","v":"GM-W"},{"$f":"VLOOKUP($F118,'DANE - K1 lit.A'!$D$6:$M$119,4,0)","v":"TAK"},{"$f":"VLOOKUP($F118,'DANE - K1 lit.A'!$D$6:$M$119,5,0)","v":"TAK"},{"$f":"VLOOKUP($F118,'DANE - K1 lit.A'!$D$6:$M$119,6,0)","v":"NIE"},{"$f":"IF($E118=\"\",\"\",VLOOKUP($F118,'DANE - K4 lit.B'!$D$6:$E$107,2,0))","v":"NIE"},{"$f":"IF($E118=\"\",\"\",VLOOKUP($F118,'DANE - K2 lit.C'!$B$14:$I$114,8,0))","v":"większy niż 50 minut"},null,0.8,{"$f":"IF($D118=Buski[[#Headers],[Buski]],VLOOKUP($E118,Buski[Buski],1,0),IF($D118=Jędrzejowski[[#Headers],[Jędrzejowski]],VLOOKUP($E118,Jędrzejowski[Jędrzejowski],1,0),IF($D118=Kazimierski[[#Headers],[Kazimierski]],VLOOKUP($E118,Kazimierski[Kazimierski],1,0),IF($D118=Kielecki[[#Headers],[Kielecki]],VLOOKUP($E118,Kielecki[Kielecki],1,0),IF($D118=Konecki[[#Headers],[Konecki]],VLOOKUP($E118,Konecki[Konecki],1,0),IF($D118=Opatowski[[#Headers],[Opatowski]],VLOOKUP($E118,Opatowski[Opatowski],1,0),IF($D118=Ostrowiecki[[#Headers],[Ostrowiecki]],VLOOKUP($E118,Ostrowiecki[Ostrowiecki],1,0),IF($D118=Pińczowski[[#Headers],[Pińczowski]],VLOOKUP($E118,Pińczowski[Pińczowski],1,0),IF($D118=Sandomierski[[#Headers],[Sandomierski]],VLOOKUP($E118,Sandomierski[Sandomierski],1,0),IF($D118=Skarżyski[[#Headers],[Skarżyski]],VLOOKUP($E118,Skarżyski[Skarżyski],1,0),IF($D118=Starachowicki[[#Headers],[Starachowicki]],VLOOKUP($E118,Starachowicki[Starachowicki],1,0),IF($D118=Staszowski[[#Headers],[Staszowski]],VLOOKUP($E118,Staszowski[Staszowski],1,0),IF($D118=Włoszczowski[[#Headers],[Włoszczowski]],VLOOKUP($E118,Włoszczowski[Włoszczowski],1,0),\"\")))))))))))))","v":"Ćmielów"},"ostrowiecki"]
[null,null,null,"ostrowiecki","Kunów","gmina Kunów",{"$f":"VLOOKUP($F119,'DANE - TERC'!$D$6:$P$119,10,0)","v":2607053},{"$f":"VLOOKUP($F119,'DANE - TERC'!$D$6:$P$119,12,0)","v":"GM-W"},{"$f":"VLOOKUP($F119,'DANE - K1 lit.A'!$D$6:$M$119,4,0)","v":"NIE"},{"$f":"VLOOKUP($F119,'DANE - K1 lit.A'!$D$6:$M$119,5,0)","v":"NIE"},{"$f":"VLOOKUP($F119,'DANE - K1 lit.A'!$D$6:$M$119,6,0)","v":"NIE"},{"$f":"IF($E119=\"\",\"\",VLOOKUP($F119,'DANE - K4 lit.B'!$D$6:$E$107,2,0))","v":"NIE"},{"$f":"IF($E119=\"\",\"\",VLOOKUP($F119,'DANE - K2 lit.C'!$B$14:$I$114,8,0))","v":"większy niż 50 minut"},null,0.7,{"$f":"IF($D119=Buski[[#Headers],[Buski]],VLOOKUP($E119,Buski[Buski],1,0),IF($D119=Jędrzejowski[[#Headers],[Jędrzejowski]],VLOOKUP($E119,Jędrzejowski[Jędrzejowski],1,0),IF($D119=Kazimierski[[#Headers],[Kazimierski]],VLOOKUP($E119,Kazimierski[Kazimierski],1,0),IF($D119=Kielecki[[#Headers],[Kielecki]],VLOOKUP($E119,Kielecki[Kielecki],1,0),IF($D119=Konecki[[#Headers],[Konecki]],VLOOKUP($E119,Konecki[Konecki],1,0),IF($D119=Opatowski[[#Headers],[Opatowski]],VLOOKUP($E119,Opatowski[Opatowski],1,0),IF($D119=Ostrowiecki[[#Headers],[Ostrowiecki]],VLOOKUP($E119,Ostrowiecki[Ostrowiecki],1,0),IF($D119=Pińczowski[[#Headers],[Pińczowski]],VLOOKUP($E119,Pińczowski[Pińczowski],1,0),IF($D119=Sandomierski[[#Headers],[Sandomierski]],VLOOKUP($E119,Sandomierski[Sandomierski],1,0),IF($D119=Skarżyski[[#Headers],[Skarżyski]],VLOOKUP($E119,Skarżyski[Skarżyski],1,0),IF($D119=Starachowicki[[#Headers],[Starachowicki]],VLOOKUP($E119,Starachowicki[Starachowicki],1,0),IF($D119=Staszowski[[#Headers],[Staszowski]],VLOOKUP($E119,Staszowski[Staszowski],1,0),IF($D119=Włoszczowski[[#Headers],[Włoszczowski]],VLOOKUP($E119,Włoszczowski[Włoszczowski],1,0),\"\")))))))))))))","v":"Kunów"},"ostrowiecki"]
[null,null,null,"ostrowiecki","Ostrowiec Świętokrzyski","gmina Ostrowiec Świętokrzyski",{"$f":"VLOOKUP($F120,'DANE - TERC'!$D$6:$P$119,10,0)","v":2607011},{"$f":"VLOOKUP($F120,'DANE - TERC'!$D$6:$P$119,12,0)","v":"GM"},{"$f":"VLOOKUP($F120,'DANE - K1 lit.A'!$D$6:$M$119,4,0)","v":"TAK"},{"$f":"VLOOKUP($F120,'DANE - K1 lit.A'!$D$6:$M$119,5,0)","v":"NIE"},{"$f":"VLOOKUP($F120,'DANE - K1 lit.A'!$D$6:$M$119,6,0)","v":"TAK"},{"$f":"IF($E120=\"\",\"\",VLOOKUP($F120,'DANE - K4 lit.B'!$D$6:$E$107,2,0))","v":"TAK"},{"$f":"IF($E120=\"\",\"\",VLOOKUP($F120,'DANE - K2 lit.C'!$B$14:$I$114,8,0))","v":"w przedziale od 30 do 50 minut"},null,0.8,{"$f":"IF($D120=Buski[[#Headers],[Buski]],VLOOKUP($E120,Buski[Buski],1,0),IF($D120=Jędrzejowski[[#Headers],[Jędrzejowski]],VLOOKUP($E120,Jędrzejowski[Jędrzejowski],1,0),IF($D120=Kazimierski[[#Headers],[Kazimierski]],VLOOKUP($E120,Kazimierski[Kazimierski],1,0),IF($D120=Kielecki[[#Headers],[Kielecki]],VLOOKUP($E120,Kielecki[Kielecki],1,0),IF($D120=Konecki[[#Headers],[Konecki]],VLOOKUP($E120,Konecki[Konecki],1,0),IF($D120=Opatowski[[#Headers],[Opatowski]],VLOOKUP($E120,Opatowski[Opatowski],1,0),IF($D120=Ostrowiecki[[#Headers],[Ostrowiecki]],VLOOKUP($E120,Ostrowiecki[Ostrowiecki],1,0),IF($D120=Pińczowski[[#Headers],[Pińczowski]],VLOOKUP($E120,Pińczowski[Pińczowski],1,0),IF($D120=Sandomierski[[#Headers],[Sandomierski]],VLOOKUP($E120,Sandomierski[Sandomierski],1,0),IF($D120=Skarżyski[[#Headers],[Skarżyski]],VLOOKUP($E120,Skarżyski[Skarżyski],1,0),IF($D120=Starachowicki[[#Headers],[Starachowicki]],VLOOKUP($E120,Starachowicki[Starachowicki],1,0),IF($D120=Staszowski[[#Headers],[Staszowski]],VLOOKUP($E120,Staszowski[Staszowski],1,0),IF($D120=Włoszczowski[[#Headers],[Włoszczowski]],VLOOKUP($E120,Włoszczowski[Włoszczowski],1,0),\"\")))))))))))))","v":"Ostrowiec Świętokrzyski"},"ostrowiecki"]
[null,null,null,"ostrowiecki","Waśniów","gmina Waśniów",{"$f":"VLOOKUP($F121,'DANE - TERC'!$D$6:$P$119,10,0)","v":2607062},{"$f":"VLOOKUP($F121,'DANE - TERC'!$D$6:$P$119,12,0)","v":"GW"},{"$f":"VLOOKUP($F121,'DANE - K1 lit.A'!$D$6:$M$119,4,0)","v":"TAK"},{"$f":"VLOOKUP($F121,'DANE - K1 lit.A'!$D$6:$M$119,5,0)","v":"TAK"},{"$f":"VLOOKUP($F121,'DANE - K1 lit.A'!$D$6:$M$119,6,0)","v":"TAK"},{"$f":"IF($E121=\"\",\"\",VLOOKUP($F121,'DANE - K4 lit.B'!$D$6:$E$107,2,0))","v":"NIE"},{"$f":"IF($E121=\"\",\"\",VLOOKUP($F121,'DANE - K2 lit.C'!$B$14:$I$114,8,0))","v":"w przedziale od 30 do 50 minut"},null,0.8,{"$f":"IF($D121=Buski[[#Headers],[Buski]],VLOOKUP($E121,Buski[Buski],1,0),IF($D121=Jędrzejowski[[#Headers],[Jędrzejowski]],VLOOKUP($E121,Jędrzejowski[Jędrzejowski],1,0),IF($D121=Kazimierski[[#Headers],[Kazimierski]],VLOOKUP($E121,Kazimierski[Kazimierski],1,0),IF($D121=Kielecki[[#Headers],[Kielecki]],VLOOKUP($E121,Kielecki[Kielecki],1,0),IF($D121=Konecki[[#Headers],[Konecki]],VLOOKUP($E121,Konecki[Konecki],1,0),IF($D121=Opatowski[[#Headers],[Opatowski]],VLOOKUP($E121,Opatowski[Opatowski],1,0),IF($D121=Ostrowiecki[[#Headers],[Ostrowiecki]],VLOOKUP($E121,Ostrowiecki[Ostrowiecki],1,0),IF($D121=Pińczowski[[#Headers],[Pińczowski]],VLOOKUP($E121,Pińczowski[Pińczowski],1,0),IF($D121=Sandomierski[[#Headers],[Sandomierski]],VLOOKUP($E121,Sandomierski[Sandomierski],1,0),IF($D121=Skarżyski[[#Headers],[Skarżyski]],VLOOKUP($E121,Skarżyski[Skarżyski],1,0),IF($D121=Starachowicki[[#Headers],[Starachowicki]],VLOOKUP($E121,Starachowicki[Starachowicki],1,0),IF($D121=Staszowski[[#Headers],[Staszowski]],VLOOKUP($E121,Staszowski[Staszowski],1,0),IF($D121=Włoszczowski[[#Headers],[Włoszczowski]],VLOOKUP($E121,Włoszczowski[Włoszczowski],1,0),\"\")))))))))))))","v":"Waśniów"},"ostrowiecki"]
[null,null,null,"pińczowski","Działoszyce","gmina Działoszyce",{"$f":"VLOOKUP($F122,'DANE - TERC'!$D$6:$P$119,10,0)","v":2608013},{"$f":"VLOOKUP($F122,'DANE - TERC'!$D$6:$P$119,12,0)","v":"GM-W"},{"$f":"VLOOKUP($F122,'DANE - K1 lit.A'!$D$6:$M$119,4,0)","v":"NIE"},{"$f":"VLOOKUP($F122,'DANE - K1 lit.A'!$D$6:$M$119,5,0)","v":"NIE"},{"$f":"VLOOKUP($F122,'DANE - K1 lit.A'!$D$6:$M$119,6,0)","v":"NIE"},{"$f":"IF($E122=\"\",\"\",VLOOKUP($F122,'DANE - K4 lit.B'!$D$6:$E$107,2,0))","v":"NIE"},{"$f":"IF($E122=\"\",\"\",VLOOKUP($F122,'DANE - K2 lit.C'!$B$14:$I$114,8,0))","v":"w przedziale od 30 do 50 minut"},null,0.8,{"$f":"IF($D122=Buski[[#Headers],[Buski]],VLOOKUP($E122,Buski[Buski],1,0),IF($D122=Jędrzejowski[[#Headers],[Jędrzejowski]],VLOOKUP($E122,Jędrzejowski[Jędrzejowski],1,0),IF($D122=Kazimierski[[#Headers],[Kazimierski]],VLOOKUP($E122,Kazimierski[Kazimierski],1,0),IF($D122=Kielecki[[#Headers],[Kielecki]],VLOOKUP($E122,Kielecki[Kielecki],1,0),IF($D122=Konecki[[#Headers],[Konecki]],VLOOKUP($E122,Konecki[Konecki],1,0),IF($D122=Opatowski[[#Headers],[Opatowski]],VLOOKUP($E122,Opatowski[Opatowski],1,0),IF($D122=Ostrowiecki[[#Headers],[Ostrowiecki]],VLOOKUP($E122,Ostrowiecki[Ostrowiecki],1,0),IF($D122=Pińczowski[[#Headers],[Pińczowski]],VLOOKUP($E122,Pińczowski[Pińczowski],1,0),IF($D122=Sandomierski[[#Headers],[Sandomierski]],VLOOKUP($E122,Sandomierski[Sandomierski],1,0),IF($D122=Skarżyski[[#Headers],[Skarżyski]],VLOOKUP($E122,Skarżyski[Skarżyski],1,0),IF($D122=Starachowicki[[#Headers],[Starachowicki]],VLOOKUP($E122,Starachowicki[Starachowicki],1,0),IF($D122=Staszowski[[#Headers],[Staszowski]],VLOOKUP($E122,Staszowski[Staszowski],1,0),IF($D122=Włoszczowski[[#Headers],[Włoszczowski]],VLOOKUP($E122,Włoszczowski[Włoszczowski],1,0),\"\")))))))))))))","v":"Działoszyce"},"pińczowski"]
[null,null,null,"pińczowski","Kije","gmina Kije",{"$f":"VLOOKUP($F123,'DANE - TERC'!$D$6:$P$119,10,0)","v":2608022},{"$f":"VLOOKUP($F123,'DANE - TERC'!$D$6:$P$119,12,0)","v":"GW"},{"$f":"VLOOKUP($F123,'DANE - K1 lit.A'!$D$6:$M$119,4,0)","v":"NIE"},{"$f":"VLOOKUP($F123,'DANE - K1 lit.A'!$D$6:$M$119,5,0)","v":"NIE"},{"$f":"VLOOKUP($F123,'DANE - K1 lit.A'!$D$6:$M$119,6,0)","v":"NIE"},{"$f":"IF($E123=\"\",\"\",VLOOKUP($F123,'DANE - K4 lit.B'!$D$6:$E$107,2,0))","v":"NIE"},{"$f":"IF($E123=\"\",\"\",VLOOKUP($F123,'DANE - K2 lit.C'!$B$14:$I$114,8,0))","v":"w przedziale od 30 do 50 minut"},null,0.8,{"$f":"IF($D123=Buski[[#Headers],[Buski]],VLOOKUP($E123,Buski[Buski],1,0),IF($D123=Jędrzejowski[[#Headers],[Jędrzejowski]],VLOOKUP($E123,Jędrzejowski[Jędrzejowski],1,0),IF($D123=Kazimierski[[#Headers],[Kazimierski]],VLOOKUP($E123,Kazimierski[Kazimierski],1,0),IF($D123=Kielecki[[#Headers],[Kielecki]],VLOOKUP($E123,Kielecki[Kielecki],1,0),IF($D123=Konecki[[#Headers],[Konecki]],VLOOKUP($E123,Konecki[Konecki],1,0),IF($D123=Opatowski[[#Headers],[Opatowski]],VLOOKUP($E123,Opatowski[Opatowski],1,0),IF($D123=Ostrowiecki[[#Headers],[Ostrowiecki]],VLOOKUP($E123,Ostrowiecki[Ostrowiecki],1,0),IF($D123=Pińczowski[[#Headers],[Pińczowski]],VLOOKUP($E123,Pińczowski[Pińczowski],1,0),IF($D123=Sandomierski[[#Headers],[Sandomierski]],VLOOKUP($E123,Sandomierski[Sandomierski],1,0),IF($D123=Skarżyski[[#Headers],[Skarżyski]],VLOOKUP($E123,Skarżyski[Skarżyski],1,0),IF($D123=Starachowicki[[#Headers],[Starachowicki]],VLOOKUP($E123,Starachowicki[Starachowicki],1,0),IF($D123=Staszowski[[#Headers],[Staszowski]],VLOOKUP($E123,Staszowski[Staszowski],1,0),IF($D123=Włoszczowski[[#Headers],[Włoszczowski]],VLOOKUP($E123,Włoszczowski[Włoszczowski],1,0),\"\")))))))))))))","v":"Kije"},"pińczowski"]
[null,null,null,"pińczowski","Michałów","gmina Michałów",{"$f":"VLOOKUP($F124,'DANE - TERC'!$D$6:$P$119,10,0)","v":2608032},{"$f":"VLOOKUP($F124,'DANE - TERC'!$D$6:$P$119,12,0)","v":"GW"},{"$f":"VLOOKUP($F124,'DANE - K1 lit.A'!$D$6:$M$119,4,0)","v":"NIE"},{"$f":"VLOOKUP($F124,'DANE - K1 lit.A'!$D$6:$M$119,5,0)","v":"TAK"},{"$f":"VLOOKUP($F124,'DANE - K1 lit.A'!$D$6:$M$119,6,0)","v":"TAK"},{"$f":"IF($E124=\"\",\"\",VLOOKUP($F124,'DANE - K4 lit.B'!$D$6:$E$107,2,0))","v":"NIE"},{"$f":"IF($E124=\"\",\"\",VLOOKUP($F124,'DANE - K2 lit.C'!$B$14:$I$114,8,0))","v":"w przedziale od 30 do 50 minut"},null,0.8,{"$f":"IF($D124=Buski[[#Headers],[Buski]],VLOOKUP($E124,Buski[Buski],1,0),IF($D124=Jędrzejowski[[#Headers],[Jędrzejowski]],VLOOKUP($E124,Jędrzejowski[Jędrzejowski],1,0),IF($D124=Kazimierski[[#Headers],[Kazimierski]],VLOOKUP($E124,Kazimierski[Kazimierski],1,0),IF($D124=Kielecki[[#Headers],[Kielecki]],VLOOKUP($E124,Kielecki[Kielecki],1,0),IF($D124=Konecki[[#Headers],[Konecki]],VLOOKUP($E124,Konecki[Konecki],1,0),IF($D124=Opatowski[[#Headers],[Opatowski]],VLOOKUP($E124,Opatowski[Opatowski],1,0),IF($D124=Ostrowiecki[[#Headers],[Ostrowiecki]],VLOOKUP($E124,Ostrowiecki[Ostrowiecki],1,0),IF($D124=Pińczowski[[#Headers],[Pińczowski]],VLOOKUP($E124,Pińczowski[Pińczowski],1,0),IF($D124=Sandomierski[[#Headers],[Sandomierski]],VLOOKUP($E124,Sandomierski[Sandomierski],1,0),IF($D124=Skarżyski[[#Headers],[Skarżyski]],VLOOKUP($E124,Skarżyski[Skarżyski],1,0),IF($D124=Starachowicki[[#Headers],[Starachowicki]],VLOOKUP($E124,Starachowicki[Starachowicki],1,0),IF($D124=Staszowski[[#Headers],[Staszowski]],VLOOKUP($E124,Staszowski[Staszowski],1,0),IF($D124=Włoszczowski[[#Headers],[Włoszczowski]],VLOOKUP($E124,Włoszczowski[Włoszczowski],1,0),\"\")))))))))))))","v":"Michałów"},"pińczowski"]
[null,null,null,"pińczowski","Pińczów","gmina Pińczów",{"$f":"VLOOKUP($F125,'DANE - TERC'!$D$6:$P$119,10,0)","v":2608043},{"$f":"VLOOKUP($F125,'DANE - TERC'!$D$6:$P$119,12,0)","v":"GM-W"},{"$f":"VLOOKUP($F125,'DANE - K1 lit.A'!$D$6:$M$119,4,0)","v":"TAK"},{"$f":"VLOOKUP($F125,'DANE - K1 lit.A'!$D$6:$M$119,5,0)","v":"TAK"},{"$f":"VLOOKUP($F125,'DANE - K1 lit.A'!$D$6:$M$119,6,0)","v":"TAK"},{"$f":"IF($E125=\"\",\"\",VLOOKUP($F125,'DANE - K4 lit.B'!$D$6:$E$107,2,0))","v":"NIE"},{"$f":"IF($E125=\"\",\"\",VLOOKUP($F125,'DANE - K2 lit.C'!$B$14:$I$114,8,0))","v":"w przedziale od 30 do 50 minut"},null,0.7,{"$f":"IF($D125=Buski[[#Headers],[Buski]],VLOOKUP($E125,Buski[Buski],1,0),IF($D125=Jędrzejowski[[#Headers],[Jędrzejowski]],VLOOKUP($E125,Jędrzejowski[Jędrzejowski],1,0),IF($D125=Kazimierski[[#Headers],[Kazimierski]],VLOOKUP($E125,Kazimierski[Kazimierski],1,0),IF($D125=Kielecki[[#Headers],[Kielecki]],VLOOKUP($E125,Kielecki[Kielecki],1,0),IF($D125=Konecki[[#Headers],[Konecki]],VLOOKUP($E125,Konecki[Konecki],1,0),IF($D125=Opatowski[[#Headers],[Opatowski]],VLOOKUP($E125,Opatowski[Opatowski],1,0),IF($D125=Ostrowiecki[[#Headers],[Ostrowiecki]],VLOOKUP($E125,Ostrowiecki[Ostrowiecki],1,0),IF($D125=Pińczowski[[#Headers],[Pińczowski]],VLOOKUP($E125,Pińczowski[Pińczowski],1,0),IF($D125=Sandomierski[[#Headers],[Sandomierski]],VLOOKUP($E125,Sandomierski[Sandomierski],1,0),IF($D125=Skarżyski[[#Headers],[Skarżyski]],VLOOKUP($E125,Skarżyski[Skarżyski],1,0),IF($D125=Starachowicki[[#Headers],[Starachowicki]],VLOOKUP($E125,Starachowicki[Starachowicki],1,0),IF($D125=Staszowski[[#Headers],[Staszowski]],VLOOKUP($E125,Staszowski[Staszowski],1,0),IF($D125=Włoszczowski[[#Headers],[Włoszczowski]],VLOOKUP($E125,Włoszczowski[Włoszczowski],1,0),\"\")))))))))))))","v":"Pińczów"},"pińczowski"]
[null,null,null,"pińczowski","Złota","gmina Złota",{"$f":"VLOOKUP($F126,'DANE - TERC'!$D$6:$P$119,10,0)","v":2608052},{"$f":"VLOOKUP($F126,'DANE - TERC'!$D$6:$P$119,12,0)","v":"GW"},{"$f":"VLOOKUP($F126,'DANE - K1 lit.A'!$D$6:$M$119,4,0)","v":"NIE"},{"$f":"VLOOKUP($F126,'DANE - K1 lit.A'!$D$6:$M$119,5,0)","v":"NIE"},{"$f":"VLOOKUP($F126,'DANE - K1 lit.A'!$D$6:$M$119,6,0)","v":"NIE"},{"$f":"IF($E126=\"\",\"\",VLOOKUP($F126,'DANE - K4 lit.B'!$D$6:$E$107,2,0))","v":"NIE"},{"$f":"IF($E126=\"\",\"\",VLOOKUP($F126,'DANE - K2 lit.C'!$B$14:$I$114,8,0))","v":"większy niż 50 minut"},null,0.8,{"$f":"IF($D126=Buski[[#Headers],[Buski]],VLOOKUP($E126,Buski[Buski],1,0),IF($D126=Jędrzejowski[[#Headers],[Jędrzejowski]],VLOOKUP($E126,Jędrzejowski[Jędrzejowski],1,0),IF($D126=Kazimierski[[#Headers],[Kazimierski]],VLOOKUP($E126,Kazimierski[Kazimierski],1,0),IF($D126=Kielecki[[#Headers],[Kielecki]],VLOOKUP($E126,Kielecki[Kielecki],1,0),IF($D126=Konecki[[#Headers],[Konecki]],VLOOKUP($E126,Konecki[Konecki],1,0),IF($D126=Opatowski[[#Headers],[Opatowski]],VLOOKUP($E126,Opatowski[Opatowski],1,0),IF($D126=Ostrowiecki[[#Headers],[Ostrowiecki]],VLOOKUP($E126,Ostrowiecki[Ostrowiecki],1,0),IF($D126=Pińczowski[[#Headers],[Pińczowski]],VLOOKUP($E126,Pińczowski[Pińczowski],1,0),IF($D126=Sandomierski[[#Headers],[Sandomierski]],VLOOKUP($E126,Sandomierski[Sandomierski],1,0),IF($D126=Skarżyski[[#Headers],[Skarżyski]],VLOOKUP($E126,Skarżyski[Skarżyski],1,0),IF($D126=Starachowicki[[#Headers],[Starachowicki]],VLOOKUP($E126,Starachowicki[Starachowicki],1,0),IF($D126=Staszowski[[#Headers],[Staszowski]],VLOOKUP($E126,Staszowski[Staszowski],1,0),IF($D126=Włoszczowski[[#Headers],[Włoszczowski]],VLOOKUP($E126,Włoszczowski[Włoszczowski],1,0),\"\")))))))))))))","v":"Złota"},"pińczowski"]
[null,null,null,"sandomierski","Dwikozy","gmina Dwikozy",{"$f":"VLOOKUP($F127,'DANE - TERC'!$D$6:$P$119,10,0)","v":2609022},{"$f":"VLOOKUP($F127,'DANE - TERC'!$D$6:$P$119,12,0)","v":"GW"},{"$f":"VLOOKUP($F127,'DANE - K1 lit.A'!$D$6:$M$119,4,0)","v":"TAK"},{"$f":"VLOOKUP($F127,'DANE - K1 lit.A'!$D$6:$M$119,5,0)","v":"TAK"},{"$f":"VLOOKUP($F127,'DANE - K1 lit.A'!$D$6:$M$119,6,0)","v":"NIE"},{"$f":"IF($E127=\"\",\"\",VLOOKUP($F127,'DANE - K4 lit.B'!$D$6:$E$107,2,0))","v":"NIE"},{"$f":"IF($E127=\"\",\"\",VLOOKUP($F127,'DANE - K2 lit.C'!$B$14:$I$114,8,0))","v":"w przedziale od 30 do 50 minut"},null,0.8,{"$f":"IF($D127=Buski[[#Headers],[Buski]],VLOOKUP($E127,Buski[Buski],1,0),IF($D127=Jędrzejowski[[#Headers],[Jędrzejowski]],VLOOKUP($E127,Jędrzejowski[Jędrzejowski],1,0),IF($D127=Kazimierski[[#Headers],[Kazimierski]],VLOOKUP($E127,Kazimierski[Kazimierski],1,0),IF($D127=Kielecki[[#Headers],[Kielecki]],VLOOKUP($E127,Kielecki[Kielecki],1,0),IF($D127=Konecki[[#Headers],[Konecki]],VLOOKUP($E127,Konecki[Konecki],1,0),IF($D127=Opatowski[[#Headers],[Opatowski]],VLOOKUP($E127,Opatowski[Opatowski],1,0),IF($D127=Ostrowiecki[[#Headers],[Ostrowiecki]],VLOOKUP($E127,Ostrowiecki[Ostrowiecki],1,0),IF($D127=Pińczowski[[#Headers],[Pińczowski]],VLOOKUP($E127,Pińczowski[Pińczowski],1,0),IF($D127=Sandomierski[[#Headers],[Sandomierski]],VLOOKUP($E127,Sandomierski[Sandomierski],1,0),IF($D127=Skarżyski[[#Headers],[Skarżyski]],VLOOKUP($E127,Skarżyski[Skarżyski],1,0),IF($D127=Starachowicki[[#Headers],[Starachowicki]],VLOOKUP($E127,Starachowicki[Starachowicki],1,0),IF($D127=Staszowski[[#Headers],[Staszowski]],VLOOKUP($E127,Staszowski[Staszowski],1,0),IF($D127=Włoszczowski[[#Headers],[Włoszczowski]],VLOOKUP($E127,Włoszczowski[Włoszczowski],1,0),\"\")))))))))))))","v":"Dwikozy"},"sandomierski"]
[null,null,null,"sandomierski","Klimontów","gmina Klimontów",{"$f":"VLOOKUP($F128,'DANE - TERC'!$D$6:$P$119,10,0)","v":2609033},{"$f":"VLOOKUP($F128,'DANE - TERC'!$D$6:$P$119,12,0)","v":"GM-W"},{"$f":"VLOOKUP($F128,'DANE - K1 lit.A'!$D$6:$M$119,4,0)","v":"TAK"},{"$f":"VLOOKUP($F128,'DANE - K1 lit.A'!$D$6:$M$119,5,0)","v":"TAK"},{"$f":"VLOOKUP($F128,'DANE - K1 lit.A'!$D$6:$M$119,6,0)","v":"NIE"},{"$f":"IF($E128=\"\",\"\",VLOOKUP($F128,'DANE - K4 lit.B'!$D$6:$E$107,2,0))","v":"NIE"},{"$f":"IF($E128=\"\",\"\",VLOOKUP($F128,'DANE - K2 lit.C'!$B$14:$I$114,8,0))","v":"w przedziale od 30 do 50 minut"},null,0.8,{"$f":"IF($D128=Buski[[#Headers],[Buski]],VLOOKUP($E128,Buski[Buski],1,0),IF($D128=Jędrzejowski[[#Headers],[Jędrzejowski]],VLOOKUP($E128,Jędrzejowski[Jędrzejowski],1,0),IF($D128=Kazimierski[[#Headers],[Kazimierski]],VLOOKUP($E128,Kazimierski[Kazimierski],1,0),IF($D128=Kielecki[[#Headers],[Kielecki]],VLOOKUP($E128,Kielecki[Kielecki],1,0),IF($D128=Konecki[[#Headers],[Konecki]],VLOOKUP($E128,Konecki[Konecki],1,0),IF($D128=Opatowski[[#Headers],[Opatowski]],VLOOKUP($E128,Opatowski[Opatowski],1,0),IF($D128=Ostrowiecki[[#Headers],[Ostrowiecki]],VLOOKUP($E128,Ostrowiecki[Ostrowiecki],1,0),IF($D128=Pińczowski[[#Headers],[Pińczowski]],VLOOKUP($E128,Pińczowski[Pińczowski],1,0),IF($D128=Sandomierski[[#Headers],[Sandomierski]],VLOOKUP($E128,Sandomierski[Sandomierski],1,0),IF($D128=Skarżyski[[#Headers],[Skarżyski]],VLOOKUP($E128,Skarżyski[Skarżyski],1,0),IF($D128=Starachowicki[[#Headers],[Starachowicki]],VLOOKUP($E128,Starachowicki[Starachowicki],1,0),IF($D128=Staszowski[[#Headers],[Staszowski]],VLOOKUP($E128,Staszowski[Staszowski],1,0),IF($D128=Włoszczowski[[#Headers],[Włoszczowski]],VLOOKUP($E128,Włoszczowski[Włoszczowski],1,0),\"\")))))))))))))","v":"Klimontów"},"sandomierski"]
[null,null,null,"sandomierski","Koprzywnica","gmina Koprzywnica",{"$f":"VLOOKUP($F129,'DANE - TERC'!$D$6:$P$119,10,0)","v":2609043},{"$f":"VLOOKUP($F129,'DANE - TERC'!$D$6:$P$119,12,0)","v":"GM-W"},{"$f":"VLOOKUP($F129,'DANE - K1 lit.A'!$D$6:$M$119,4,0)","v":"NIE"},{"$f":"VLOOKUP($F129,'DANE - K1 lit.A'!$D$6:$M$119,5,0)","v":"NIE"},{"$f":"VLOOKUP($F129,'DANE - K1 lit.A'!$D$6:$M$119,6,0)","v":"TAK"},{"$f":"IF($E129=\"\",\"\",VLOOKUP($F129,'DANE - K4 lit.B'!$D$6:$E$107,2,0))","v":"NIE"},{"$f":"IF($E129=\"\",\"\",VLOOKUP($F129,'DANE - K2 lit.C'!$B$14:$I$114,8,0))","v":"w przedziale od 30 do 50 minut"},null,0.8,{"$f":"IF($D129=Buski[[#Headers],[Buski]],VLOOKUP($E129,Buski[Buski],1,0),IF($D129=Jędrzejowski[[#Headers],[Jędrzejowski]],VLOOKUP($E129,Jędrzejowski[Jędrzejowski],1,0),IF($D129=Kazimierski[[#Headers],[Kazimierski]],VLOOKUP($E129,Kazimierski[Kazimierski],1,0),IF($D129=Kielecki[[#Headers],[Kielecki]],VLOOKUP($E129,Kielecki[Kielecki],1,0),IF($D129=Konecki[[#Headers],[Konecki]],VLOOKUP($E129,Konecki[Konecki],1,0),IF($D129=Opatowski[[#Headers],[Opatowski]],VLOOKUP($E129,Opatowski[Opatowski],1,0),IF($D129=Ostrowiecki[[#Headers],[Ostrowiecki]],VLOOKUP($E129,Ostrowiecki[Ostrowiecki],1,0),IF($D129=Pińczowski[[#Headers],[Pińczowski]],VLOOKUP($E129,Pińczowski[Pińczowski],1,0),IF($D129=Sandomierski[[#Headers],[Sandomierski]],VLOOKUP($E129,Sandomierski[Sandomierski],1,0),IF($D129=Skarżyski[[#Headers],[Skarżyski]],VLOOKUP($E129,Skarżyski[Skarżyski],1,0),IF($D129=Starachowicki[[#Headers],[Starachowicki]],VLOOKUP($E129,Starachowicki[Starachowicki],1,0),IF($D129=Staszowski[[#Headers],[Staszowski]],VLOOKUP($E129,Staszowski[Staszowski],1,0),IF($D129=Włoszczowski[[#Headers],[Włoszczowski]],VLOOKUP($E129,Włoszczowski[Włoszczowski],1,0),\"\")))))))))))))","v":"Koprzywnica"},"sandomierski"]
[null,null,null,"sandomierski","Łoniów","gmina Łoniów",{"$f":"VLOOKUP($F130,'DANE - TERC'!$D$6:$P$119,10,0)","v":2609052},{"$f":"VLOOKUP($F130,'DANE - TERC'!$D$6:$P$119,12,0)","v":"GW"},{"$f":"VLOOKUP($F130,'DANE - K1 lit.A'!$D$6:$M$119,4,0)","v":"NIE"},{"$f":"VLOOKUP($F130,'DANE - K1 lit.A'!$D$6:$M$119,5,0)","v":"TAK"},{"$f":"VLOOKUP($F130,'DANE - K1 lit.A'!$D$6:$M$119,6,0)","v":"NIE"},{"$f":"IF($E130=\"\",\"\",VLOOKUP($F130,'DANE - K4 lit.B'!$D$6:$E$107,2,0))","v":"NIE"},{"$f":"IF($E130=\"\",\"\",VLOOKUP($F130,'DANE - K2 lit.C'!$B$14:$I$114,8,0))","v":"w przedziale od 30 do 50 minut"},null,0.8,{"$f":"IF($D130=Buski[[#Headers],[Buski]],VLOOKUP($E130,Buski[Buski],1,0),IF($D130=Jędrzejowski[[#Headers],[Jędrzejowski]],VLOOKUP($E130,Jędrzejowski[Jędrzejowski],1,0),IF($D130=Kazimierski[[#Headers],[Kazimierski]],VLOOKUP($E130,Kazimierski[Kazimierski],1,0),IF($D130=Kielecki[[#Headers],[Kielecki]],VLOOKUP($E130,Kielecki[Kielecki],1,0),IF($D130=Konecki[[#Headers],[Konecki]],VLOOKUP($E130,Konecki[Konecki],1,0),IF($D130=Opatowski[[#Headers],[Opatowski]],VLOOKUP($E130,Opatowski[Opatowski],1,0),IF($D130=Ostrowiecki[[#Headers],[Ostrowiecki]],VLOOKUP($E130,Ostrowiecki[Ostrowiecki],1,0),IF($D130=Pińczowski[[#Headers],[Pińczowski]],VLOOKUP($E130,Pińczowski[Pińczowski],1,0),IF($D130=Sandomierski[[#Headers],[Sandomierski]],VLOOKUP($E130,Sandomierski[Sandomierski],1,0),IF($D130=Skarżyski[[#Headers],[Skarżyski]],VLOOKUP($E130,Skarżyski[Skarżyski],1,0),IF($D130=Starachowicki[[#Headers],[Starachowicki]],VLOOKUP($E130,Starachowicki[Starachowicki],1,0),IF($D130=Staszowski[[#Headers],[Staszowski]],VLOOKUP($E130,Staszowski[Staszowski],1,0),IF($D130=Włoszczowski[[#Headers],[Włoszczowski]],VLOOKUP($E130,Włoszczowski[Włoszczowski],1,0),\"\")))))))))))))","v":"Łoniów"},"sandomierski"]
[null,null,null,"sandomierski","Obrazów","gmina Obrazów",{"$f":"VLOOKUP($F131,'DANE - TERC'!$D$6:$P$119,10,0)","v":2609062},{"$f":"VLOOKUP($F131,'DANE - TERC'!$D$6:$P$119,12,0)","v":"GW"},{"$f":"VLOOKUP($F131,'DANE - K1 lit.A'!$D$6:$M$119,4,0)","v":"NIE"},{"$f":"VLOOKUP($F131,'DANE - K1 lit.A'!$D$6:$M$119,5,0)","v":"NIE"},{"$f":"VLOOKUP($F131,'DANE - K1 lit.A'!$D$6:$M$119,6,0)","v":"NIE"},{"$f":"IF($E131=\"\",\"\",VLOOKUP($F131,'DANE - K4 lit.B'!$D$6:$E$107,2,0))","v":"NIE"},{"$f":"IF($E131=\"\",\"\",VLOOKUP($F131,'DANE - K2 lit.C'!$B$14:$I$114,8,0))","v":"w przedziale od 30 do 50 minut"},null,0.8,{"$f":"IF($D131=Buski[[#Headers],[Buski]],VLOOKUP($E131,Buski[Buski],1,0),IF($D131=Jędrzejowski[[#Headers],[Jędrzejowski]],VLOOKUP($E131,Jędrzejowski[Jędrzejowski],1,0),IF($D131=Kazimierski[[#Headers],[Kazimierski]],VLOOKUP($E131,Kazimierski[Kazimierski],1,0),IF($D131=Kielecki[[#Headers],[Kielecki]],VLOOKUP($E131,Kielecki[Kielecki],1,0),IF($D131=Konecki[[#Headers],[Konecki]],VLOOKUP($E131,Konecki[Konecki],1,0),IF($D131=Opatowski[[#Headers],[Opatowski]],VLOOKUP($E131,Opatowski[Opatowski],1,0),IF($D131=Ostrowiecki[[#Headers],[Ostrowiecki]],VLOOKUP($E131,Ostrowiecki[Ostrowiecki],1,0),IF($D131=Pińczowski[[#Headers],[Pińczowski]],VLOOKUP($E131,Pińczowski[Pińczowski],1,0),IF($D131=Sandomierski[[#Headers],[Sandomierski]],VLOOKUP($E131,Sandomierski[Sandomierski],1,0),IF($D131=Skarżyski[[#Headers],[Skarżyski]],VLOOKUP($E131,Skarżyski[Skarżyski],1,0),IF($D131=Starachowicki[[#Headers],[Starachowicki]],VLOOKUP($E131,Starachowicki[Starachowicki],1,0),IF($D131=Staszowski[[#Headers],[Staszowski]],VLOOKUP($E131,Staszowski[Staszowski],1,0),IF($D131=Włoszczowski[[#Headers],[Włoszczowski]],VLOOKUP($E131,Włoszczowski[Włoszczowski],1,0),\"\")))))))))))))","v":"Obrazów"},"sandomierski"]
[null,null,null,"sandomierski","Samborzec","gmina Samborzec",{"$f":"VLOOKUP($F132,'DANE - TERC'!$D$6:$P$119,10,0)","v":2609072},{"$f":"VLOOKUP($F132,'DANE - TERC'!$D$6:$P$119,12,0)","v":"GW"},{"$f":"VLOOKUP($F132,'DANE - K1 lit.A'!$D$6:$M$119,4,0)","v":"NIE"},{"$f":"VLOOKUP($F132,'DANE - K1 lit.A'!$D$6:$M$119,5,0)","v":"TAK"},{"$f":"VLOOKUP($F132,'DANE - K1 lit.A'!$D$6:$M$119,6,0)","v":"NIE"},{"$f":"IF($E132=\"\",\"\",VLOOKUP($F132,'DANE - K4 lit.B'!$D$6:$E$107,2,0))","v":"NIE"},{"$f":"IF($E132=\"\",\"\",VLOOKUP($F132,'DANE - K2 lit.C'!$B$14:$I$114,8,0))","v":"w przedziale od 30 do 50 minut"},null,0.8,{"$f":"IF($D132=Buski[[#Headers],[Buski]],VLOOKUP($E132,Buski[Buski],1,0),IF($D132=Jędrzejowski[[#Headers],[Jędrzejowski]],VLOOKUP($E132,Jędrzejowski[Jędrzejowski],1,0),IF($D132=Kazimierski[[#Headers],[Kazimierski]],VLOOKUP($E132,Kazimierski[Kazimierski],1,0),IF($D132=Kielecki[[#Headers],[Kielecki]],VLOOKUP($E132,Kielecki[Kielecki],1,0),IF($D132=Konecki[[#Headers],[Konecki]],VLOOKUP($E132,Konecki[Konecki],1,0),IF($D132=Opatowski[[#Headers],[Opatowski]],VLOOKUP($E132,Opatowski[Opatowski],1,0),IF($D132=Ostrowiecki[[#Headers],[Ostrowiecki]],VLOOKUP($E132,Ostrowiecki[Ostrowiecki],1,0),IF($D132=Pińczowski[[#Headers],[Pińczowski]],VLOOKUP($E132,Pińczowski[Pińczowski],1,0),IF($D132=Sandomierski[[#Headers],[Sandomierski]],VLOOKUP($E132,Sandomierski[Sandomierski],1,0),IF($D132=Skarżyski[[#Headers],[Skarżyski]],VLOOKUP($E132,Skarżyski[Skarżyski],1,0),IF($D132=Starachowicki[[#Headers],[Starachowicki]],VLOOKUP($E132,Starachowicki[Starachowicki],1,0),IF($D132=Staszowski[[#Headers],[Staszowski]],VLOOKUP($E132,Staszowski[Staszowski],1,0),IF($D132=Włoszczowski[[#Headers],[Włoszczowski]],VLOOKUP($E132,Włoszczowski[Włoszczowski],1,0),\"\")))))))))))))","v":"Samborzec"},"sandomierski"]
[null,null,null,"sandomierski","Sandomierz","gmina Sandomierz",{"$f":"VLOOKUP($F133,'DANE - TERC'!$D$6:$P$119,10,0)","v":2609011},{"$f":"VLOOKUP($F133,'DANE - TERC'!$D$6:$P$119,12,0)","v":"GM"},{"$f":"VLOOKUP($F133,'DANE - K1 lit.A'!$D$6:$M$119,4,0)","v":"TAK"},{"$f":"VLOOKUP($F133,'DANE - K1 lit.A'!$D$6:$M$119,5,0)","v":"TAK"},{"$f":"VLOOKUP($F133,'DANE - K1 lit.A'!$D$6:$M$119,6,0)","v":"NIE"},{"$f":"IF($E133=\"\",\"\",VLOOKUP($F133,'DANE - K4 lit.B'!$D$6:$E$107,2,0))","v":"TAK"},{"$f":"IF($E133=\"\",\"\",VLOOKUP($F133,'DANE - K2 lit.C'!$B$14:$I$114,8,0))","v":"w przedziale od 30 do 50 minut"},null,0.6,{"$f":"IF($D133=Buski[[#Headers],[Buski]],VLOOKUP($E133,Buski[Buski],1,0),IF($D133=Jędrzejowski[[#Headers],[Jędrzejowski]],VLOOKUP($E133,Jędrzejowski[Jędrzejowski],1,0),IF($D133=Kazimierski[[#Headers],[Kazimierski]],VLOOKUP($E133,Kazimierski[Kazimierski],1,0),IF($D133=Kielecki[[#Headers],[Kielecki]],VLOOKUP($E133,Kielecki[Kielecki],1,0),IF($D133=Konecki[[#Headers],[Konecki]],VLOOKUP($E133,Konecki[Konecki],1,0),IF($D133=Opatowski[[#Headers],[Opatowski]],VLOOKUP($E133,Opatowski[Opatowski],1,0),IF($D133=Ostrowiecki[[#Headers],[Ostrowiecki]],VLOOKUP($E133,Ostrowiecki[Ostrowiecki],1,0),IF($D133=Pińczowski[[#Headers],[Pińczowski]],VLOOKUP($E133,Pińczowski[Pińczowski],1,0),IF($D133=Sandomierski[[#Headers],[Sandomierski]],VLOOKUP($E133,Sandomierski[Sandomierski],1,0),IF($D133=Skarżyski[[#Headers],[Skarżyski]],VLOOKUP($E133,Skarżyski[Skarżyski],1,0),IF($D133=Starachowicki[[#Headers],[Starachowicki]],VLOOKUP($E133,Starachowicki[Starachowicki],1,0),IF($D133=Staszowski[[#Headers],[Staszowski]],VLOOKUP($E133,Staszowski[Staszowski],1,0),IF($D133=Włoszczowski[[#Headers],[Włoszczowski]],VLOOKUP($E133,Włoszczowski[Włoszczowski],1,0),\"\")))))))))))))","v":"Sandomierz"},"sandomierski"]
[null,null,null,"sandomierski","Wilczyce","gmina Wilczyce",{"$f":"VLOOKUP($F134,'DANE - TERC'!$D$6:$P$119,10,0)","v":2609082},{"$f":"VLOOKUP($F134,'DANE - TERC'!$D$6:$P$119,12,0)","v":"GW"},{"$f":"VLOOKUP($F134,'DANE - K1 lit.A'!$D$6:$M$119,4,0)","v":"NIE"},{"$f":"VLOOKUP($F134,'DANE - K1 lit.A'!$D$6:$M$119,5,0)","v":"NIE"},{"$f":"VLOOKUP($F134,'DANE - K1 lit.A'!$D$6:$M$119,6,0)","v":"NIE"},{"$f":"IF($E134=\"\",\"\",VLOOKUP($F134,'DANE - K4 lit.B'!$D$6:$E$107,2,0))","v":"NIE"},{"$f":"IF($E134=\"\",\"\",VLOOKUP($F134,'DANE - K2 lit.C'!$B$14:$I$114,8,0))","v":"w przedziale od 30 do 50 minut"},null,0.8,{"$f":"IF($D134=Buski[[#Headers],[Buski]],VLOOKUP($E134,Buski[Buski],1,0),IF($D134=Jędrzejowski[[#Headers],[Jędrzejowski]],VLOOKUP($E134,Jędrzejowski[Jędrzejowski],1,0),IF($D134=Kazimierski[[#Headers],[Kazimierski]],VLOOKUP($E134,Kazimierski[Kazimierski],1,0),IF($D134=Kielecki[[#Headers],[Kielecki]],VLOOKUP($E134,Kielecki[Kielecki],1,0),IF($D134=Konecki[[#Headers],[Konecki]],VLOOKUP($E134,Konecki[Konecki],1,0),IF($D134=Opatowski[[#Headers],[Opatowski]],VLOOKUP($E134,Opatowski[Opatowski],1,0),IF($D134=Ostrowiecki[[#Headers],[Ostrowiecki]],VLOOKUP($E134,Ostrowiecki[Ostrowiecki],1,0),IF($D134=Pińczowski[[#Headers],[Pińczowski]],VLOOKUP($E134,Pińczowski[Pińczowski],1,0),IF($D134=Sandomierski[[#Headers],[Sandomierski]],VLOOKUP($E134,Sandomierski[Sandomierski],1,0),IF($D134=Skarżyski[[#Headers],[Skarżyski]],VLOOKUP($E134,Skarżyski[Skarżyski],1,0),IF($D134=Starachowicki[[#Headers],[Starachowicki]],VLOOKUP($E134,Starachowicki[Starachowicki],1,0),IF($D134=Staszowski[[#Headers],[Staszowski]],VLOOKUP($E134,Staszowski[Staszowski],1,0),IF($D134=Włoszczowski[[#Headers],[Włoszczowski]],VLOOKUP($E134,Włoszczowski[Włoszczowski],1,0),\"\")))))))))))))","v":"Wilczyce"},"sandomierski"]
[null,null,null,"sandomierski","Zawichost","gmina Zawichost",{"$f":"VLOOKUP($F135,'DANE - TERC'!$D$6:$P$119,10,0)","v":2609093},{"$f":"VLOOKUP($F135,'DANE - TERC'!$D$6:$P$119,12,0)","v":"GM-W"},{"$f":"VLOOKUP($F135,'DANE - K1 lit.A'!$D$6:$M$119,4,0)","v":"NIE"},{"$f":"VLOOKUP($F135,'DANE - K1 lit.A'!$D$6:$M$119,5,0)","v":"NIE"},{"$f":"VLOOKUP($F135,'DANE - K1 lit.A'!$D$6:$M$119,6,0)","v":"NIE"},{"$f":"IF($E135=\"\",\"\",VLOOKUP($F135,'DANE - K4 lit.B'!$D$6:$E$107,2,0))","v":"NIE"},{"$f":"IF($E135=\"\",\"\",VLOOKUP($F135,'DANE - K2 lit.C'!$B$14:$I$114,8,0))","v":"większy niż 50 minut"},null,0.8,{"$f":"IF($D135=Buski[[#Headers],[Buski]],VLOOKUP($E135,Buski[Buski],1,0),IF($D135=Jędrzejowski[[#Headers],[Jędrzejowski]],VLOOKUP($E135,Jędrzejowski[Jędrzejowski],1,0),IF($D135=Kazimierski[[#Headers],[Kazimierski]],VLOOKUP($E135,Kazimierski[Kazimierski],1,0),IF($D135=Kielecki[[#Headers],[Kielecki]],VLOOKUP($E135,Kielecki[Kielecki],1,0),IF($D135=Konecki[[#Headers],[Konecki]],VLOOKUP($E135,Konecki[Konecki],1,0),IF($D135=Opatowski[[#Headers],[Opatowski]],VLOOKUP($E135,Opatowski[Opatowski],1,0),IF($D135=Ostrowiecki[[#Headers],[Ostrowiecki]],VLOOKUP($E135,Ostrowiecki[Ostrowiecki],1,0),IF($D135=Pińczowski[[#Headers],[Pińczowski]],VLOOKUP($E135,Pińczowski[Pińczowski],1,0),IF($D135=Sandomierski[[#Headers],[Sandomierski]],VLOOKUP($E135,Sandomierski[Sandomierski],1,0),IF($D135=Skarżyski[[#Headers],[Skarżyski]],VLOOKUP($E135,Skarżyski[Skarżyski],1,0),IF($D135=Starachowicki[[#Headers],[Starachowicki]],VLOOKUP($E135,Starachowicki[Starachowicki],1,0),IF($D135=Staszowski[[#Headers],[Staszowski]],VLOOKUP($E135,Staszowski[Staszowski],1,0),IF($D135=Włoszczowski[[#Headers],[Włoszczowski]],VLOOKUP($E135,Włoszczowski[Włoszczowski],1,0),\"\")))))))))))))","v":"Zawichost"},"sandomierski"]
[null,null,null,"skarżyski","Bliżyn","gmina Bliżyn",{"$f":"VLOOKUP($F136,'DANE - TERC'!$D$6:$P$119,10,0)","v":2610022},{"$f":"VLOOKUP($F136,'DANE - TERC'!$D$6:$P$119,12,0)","v":"GW"},{"$f":"VLOOKUP($F136,'DANE - K1 lit.A'!$D$6:$M$119,4,0)","v":"NIE"},{"$f":"VLOOKUP($F136,'DANE - K1 lit.A'!$D$6:$M$119,5,0)","v":"NIE"},{"$f":"VLOOKUP($F136,'DANE - K1 lit.A'!$D$6:$M$119,6,0)","v":"NIE"},{"$f":"IF($E136=\"\",\"\",VLOOKUP($F136,'DANE - K4 lit.B'!$D$6:$E$107,2,0))","v":"NIE"},{"$f":"IF($E136=\"\",\"\",VLOOKUP($F136,'DANE - K2 lit.C'!$B$14:$I$114,8,0))","v":"w przedziale od 30 do 50 minut"},null,0.8,{"$f":"IF($D136=Buski[[#Headers],[Buski]],VLOOKUP($E136,Buski[Buski],1,0),IF($D136=Jędrzejowski[[#Headers],[Jędrzejowski]],VLOOKUP($E136,Jędrzejowski[Jędrzejowski],1,0),IF($D136=Kazimierski[[#Headers],[Kazimierski]],VLOOKUP($E136,Kazimierski[Kazimierski],1,0),IF($D136=Kielecki[[#Headers],[Kielecki]],VLOOKUP($E136,Kielecki[Kielecki],1,0),IF($D136=Konecki[[#Headers],[Konecki]],VLOOKUP($E136,Konecki[Konecki],1,0),IF($D136=Opatowski[[#Headers],[Opatowski]],VLOOKUP($E136,Opatowski[Opatowski],1,0),IF($D136=Ostrowiecki[[#Headers],[Ostrowiecki]],VLOOKUP($E136,Ostrowiecki[Ostrowiecki],1,0),IF($D136=Pińczowski[[#Headers],[Pińczowski]],VLOOKUP($E136,Pińczowski[Pińczowski],1,0),IF($D136=Sandomierski[[#Headers],[Sandomierski]],VLOOKUP($E136,Sandomierski[Sandomierski],1,0),IF($D136=Skarżyski[[#Headers],[Skarżyski]],VLOOKUP($E136,Skarżyski[Skarżyski],1,0),IF($D136=Starachowicki[[#Headers],[Starachowicki]],VLOOKUP($E136,Starachowicki[Starachowicki],1,0),IF($D136=Staszowski[[#Headers],[Staszowski]],VLOOKUP($E136,Staszowski[Staszowski],1,0),IF($D136=Włoszczowski[[#Headers],[Włoszczowski]],VLOOKUP($E136,Włoszczowski[Włoszczowski],1,0),\"\")))))))))))))","v":"Bliżyn"},"skarżyski"]
[null,null,null,"skarżyski","Łączna","gmina Łączna",{"$f":"VLOOKUP($F137,'DANE - TERC'!$D$6:$P$119,10,0)","v":2610032},{"$f":"VLOOKUP($F137,'DANE - TERC'!$D$6:$P$119,12,0)","v":"GW"},{"$f":"VLOOKUP($F137,'DANE - K1 lit.A'!$D$6:$M$119,4,0)","v":"NIE"},{"$f":"VLOOKUP($F137,'DANE - K1 lit.A'!$D$6:$M$119,5,0)","v":"NIE"},{"$f":"VLOOKUP($F137,'DANE - K1 lit.A'!$D$6:$M$119,6,0)","v":"NIE"},{"$f":"IF($E137=\"\",\"\",VLOOKUP($F137,'DANE - K4 lit.B'!$D$6:$E$107,2,0))","v":"NIE"},{"$f":"IF($E137=\"\",\"\",VLOOKUP($F137,'DANE - K2 lit.C'!$B$14:$I$114,8,0))","v":"mniejszy niż 30 minut"},null,0.8,{"$f":"IF($D137=Buski[[#Headers],[Buski]],VLOOKUP($E137,Buski[Buski],1,0),IF($D137=Jędrzejowski[[#Headers],[Jędrzejowski]],VLOOKUP($E137,Jędrzejowski[Jędrzejowski],1,0),IF($D137=Kazimierski[[#Headers],[Kazimierski]],VLOOKUP($E137,Kazimierski[Kazimierski],1,0),IF($D137=Kielecki[[#Headers],[Kielecki]],VLOOKUP($E137,Kielecki[Kielecki],1,0),IF($D137=Konecki[[#Headers],[Konecki]],VLOOKUP($E137,Konecki[Konecki],1,0),IF($D137=Opatowski[[#Headers],[Opatowski]],VLOOKUP($E137,Opatowski[Opatowski],1,0),IF($D137=Ostrowiecki[[#Headers],[Ostrowiecki]],VLOOKUP($E137,Ostrowiecki[Ostrowiecki],1,0),IF($D137=Pińczowski[[#Headers],[Pińczowski]],VLOOKUP($E137,Pińczowski[Pińczowski],1,0),IF($D137=Sandomierski[[#Headers],[Sandomierski]],VLOOKUP($E137,Sandomierski[Sandomierski],1,0),IF($D137=Skarżyski[[#Headers],[Skarżyski]],VLOOKUP($E137,Skarżyski[Skarżyski],1,0),IF($D137=Starachowicki[[#Headers],[Starachowicki]],VLOOKUP($E137,Starachowicki[Starachowicki],1,0),IF($D137=Staszowski[[#Headers],[Staszowski]],VLOOKUP($E137,Staszowski[Staszowski],1,0),IF($D137=Włoszczowski[[#Headers],[Włoszczowski]],VLOOKUP($E137,Włoszczowski[Włoszczowski],1,0),\"\")))))))))))))","v":"Łączna"},"skarżyski"]
[null,null,null,"skarżyski","Skarżysko-Kamienna","gmina Skarżysko-Kamienna",{"$f":"VLOOKUP($F138,'DANE - TERC'!$D$6:$P$119,10,0)","v":2610011},{"$f":"VLOOKUP($F138,'DANE - TERC'!$D$6:$P$119,12,0)","v":"GM"},{"$f":"VLOOKUP($F138,'DANE - K1 lit.A'!$D$6:$M$119,4,0)","v":"TAK"},{"$f":"VLOOKUP($F138,'DANE - K1 lit.A'!$D$6:$M$119,5,0)","v":"NIE"},{"$f":"VLOOKUP($F138,'DANE - K1 lit.A'!$D$6:$M$119,6,0)","v":"TAK"},{"$f":"IF($E138=\"\",\"\",VLOOKUP($F138,'DANE - K4 lit.B'!$D$6:$E$107,2,0))","v":"TAK"},{"$f":"IF($E138=\"\",\"\",VLOOKUP($F138,'DANE - K2 lit.C'!$B$14:$I$114,8,0))","v":"w przedziale od 30 do 50 minut"},null,0.8,{"$f":"IF($D138=Buski[[#Headers],[Buski]],VLOOKUP($E138,Buski[Buski],1,0),IF($D138=Jędrzejowski[[#Headers],[Jędrzejowski]],VLOOKUP($E138,Jędrzejowski[Jędrzejowski],1,0),IF($D138=Kazimierski[[#Headers],[Kazimierski]],VLOOKUP($E138,Kazimierski[Kazimierski],1,0),IF($D138=Kielecki[[#Headers],[Kielecki]],VLOOKUP($E138,Kielecki[Kielecki],1,0),IF($D138=Konecki[[#Headers],[Konecki]],VLOOKUP($E138,Konecki[Konecki],1,0),IF($D138=Opatowski[[#Headers],[Opatowski]],VLOOKUP($E138,Opatowski[Opatowski],1,0),IF($D138=Ostrowiecki[[#Headers],[Ostrowiecki]],VLOOKUP($E138,Ostrowiecki[Ostrowiecki],1,0),IF($D138=Pińczowski[[#Headers],[Pińczowski]],VLOOKUP($E138,Pińczowski[Pińczowski],1,0),IF($D138=Sandomierski[[#Headers],[Sandomierski]],VLOOKUP($E138,Sandomierski[Sandomierski],1,0),IF($D138=Skarżyski[[#Headers],[Skarżyski]],VLOOKUP($E138,Skarżyski[Skarżyski],1,0),IF($D138=Starachowicki[[#Headers],[Starachowicki]],VLOOKUP($E138,Starachowicki[Starachowicki],1,0),IF($D138=Staszowski[[#Headers],[Staszowski]],VLOOKUP($E138,Staszowski[Staszowski],1,0),IF($D138=Włoszczowski[[#Headers],[Włoszczowski]],VLOOKUP($E138,Włoszczowski[Włoszczowski],1,0),\"\")))))))))))))","v":"Skarżysko-Kamienna"},"skarżyski"]
[null,null,null,"skarżyski","Skarżysko Kościelne","gmina Skarżysko Kościelne",{"$f":"VLOOKUP($F139,'DANE - TERC'!$D$6:$P$119,10,0)","v":2610042},{"$f":"VLOOKUP($F139,'DANE - TERC'!$D$6:$P$119,12,0)","v":"GW"},{"$f":"VLOOKUP($F139,'DANE - K1 lit.A'!$D$6:$M$119,4,0)","v":"NIE"},{"$f":"VLOOKUP($F139,'DANE - K1 lit.A'!$D$6:$M$119,5,0)","v":"NIE"},{"$f":"VLOOKUP($F139,'DANE - K1 lit.A'!$D$6:$M$119,6,0)","v":"NIE"},{"$f":"IF($E139=\"\",\"\",VLOOKUP($F139,'DANE - K4 lit.B'!$D$6:$E$107,2,0))","v":"NIE"},{"$f":"IF($E139=\"\",\"\",VLOOKUP($F139,'DANE - K2 lit.C'!$B$14:$I$114,8,0))","v":"w przedziale od 30 do 50 minut"},null,0.8,{"$f":"IF($D139=Buski[[#Headers],[Buski]],VLOOKUP($E139,Buski[Buski],1,0),IF($D139=Jędrzejowski[[#Headers],[Jędrzejowski]],VLOOKUP($E139,Jędrzejowski[Jędrzejowski],1,0),IF($D139=Kazimierski[[#Headers],[Kazimierski]],VLOOKUP($E139,Kazimierski[Kazimierski],1,0),IF($D139=Kielecki[[#Headers],[Kielecki]],VLOOKUP($E139,Kielecki[Kielecki],1,0),IF($D139=Konecki[[#Headers],[Konecki]],VLOOKUP($E139,Konecki[Konecki],1,0),IF($D139=Opatowski[[#Headers],[Opatowski]],VLOOKUP($E139,Opatowski[Opatowski],1,0),IF($D139=Ostrowiecki[[#Headers],[Ostrowiecki]],VLOOKUP($E139,Ostrowiecki[Ostrowiecki],1,0),IF($D139=Pińczowski[[#Headers],[Pińczowski]],VLOOKUP($E139,Pińczowski[Pińczowski],1,0),IF($D139=Sandomierski[[#Headers],[Sandomierski]],VLOOKUP($E139,Sandomierski[Sandomierski],1,0),IF($D139=Skarżyski[[#Headers],[Skarżyski]],VLOOKUP($E139,Skarżyski[Skarżyski],1,0),IF($D139=Starachowicki[[#Headers],[Starachowicki]],VLOOKUP($E139,Starachowicki[Starachowicki],1,0),IF($D139=Staszowski[[#Headers],[Staszowski]],VLOOKUP($E139,Staszowski[Staszowski],1,0),IF($D139=Włoszczowski[[#Headers],[Włoszczowski]],VLOOKUP($E139,Włoszczowski[Włoszczowski],1,0),\"\")))))))))))))","v":"Skarżysko Kościelne"},"skarżyski"]
[null,null,null,"skarżyski","Suchedniów","gmina Suchedniów",{"$f":"VLOOKUP($F140,'DANE - TERC'!$D$6:$P$119,10,0)","v":2610053},{"$f":"VLOOKUP($F140,'DANE - TERC'!$D$6:$P$119,12,0)","v":"GM-W"},{"$f":"VLOOKUP($F140,'DANE - K1 lit.A'!$D$6:$M$119,4,0)","v":"TAK"},{"$f":"VLOOKUP($F140,'DANE - K1 lit.A'!$D$6:$M$119,5,0)","v":"TAK"},{"$f":"VLOOKUP($F140,'DANE - K1 lit.A'!$D$6:$M$119,6,0)","v":"NIE"},{"$f":"IF($E140=\"\",\"\",VLOOKUP($F140,'DANE - K4 lit.B'!$D$6:$E$107,2,0))","v":"NIE"},{"$f":"IF($E140=\"\",\"\",VLOOKUP($F140,'DANE - K2 lit.C'!$B$14:$I$114,8,0))","v":"w przedziale od 30 do 50 minut"},null,0.8,{"$f":"IF($D140=Buski[[#Headers],[Buski]],VLOOKUP($E140,Buski[Buski],1,0),IF($D140=Jędrzejowski[[#Headers],[Jędrzejowski]],VLOOKUP($E140,Jędrzejowski[Jędrzejowski],1,0),IF($D140=Kazimierski[[#Headers],[Kazimierski]],VLOOKUP($E140,Kazimierski[Kazimierski],1,0),IF($D140=Kielecki[[#Headers],[Kielecki]],VLOOKUP($E140,Kielecki[Kielecki],1,0),IF($D140=Konecki[[#Headers],[Konecki]],VLOOKUP($E140,Konecki[Konecki],1,0),IF($D140=Opatowski[[#Headers],[Opatowski]],VLOOKUP($E140,Opatowski[Opatowski],1,0),IF($D140=Ostrowiecki[[#Headers],[Ostrowiecki]],VLOOKUP($E140,Ostrowiecki[Ostrowiecki],1,0),IF($D140=Pińczowski[[#Headers],[Pińczowski]],VLOOKUP($E140,Pińczowski[Pińczowski],1,0),IF($D140=Sandomierski[[#Headers],[Sandomierski]],VLOOKUP($E140,Sandomierski[Sandomierski],1,0),IF($D140=Skarżyski[[#Headers],[Skarżyski]],VLOOKUP($E140,Skarżyski[Skarżyski],1,0),IF($D140=Starachowicki[[#Headers],[Starachowicki]],VLOOKUP($E140,Starachowicki[Starachowicki],1,0),IF($D140=Staszowski[[#Headers],[Staszowski]],VLOOKUP($E140,Staszowski[Staszowski],1,0),IF($D140=Włoszczowski[[#Headers],[Włoszczowski]],VLOOKUP($E140,Włoszczowski[Włoszczowski],1,0),\"\")))))))))))))","v":"Suchedniów"},"skarżyski"]
[null,null,null,"starachowicki","Brody","gmina Brody",{"$f":"VLOOKUP($F141,'DANE - TERC'!$D$6:$P$119,10,0)","v":2611022},{"$f":"VLOOKUP($F141,'DANE - TERC'!$D$6:$P$119,12,0)","v":"GW"},{"$f":"VLOOKUP($F141,'DANE - K1 lit.A'!$D$6:$M$119,4,0)","v":"TAK"},{"$f":"VLOOKUP($F141,'DANE - K1 lit.A'!$D$6:$M$119,5,0)","v":"TAK"},{"$f":"VLOOKUP($F141,'DANE - K1 lit.A'!$D$6:$M$119,6,0)","v":"TAK"},{"$f":"IF($E141=\"\",\"\",VLOOKUP($F141,'DANE - K4 lit.B'!$D$6:$E$107,2,0))","v":"NIE"},{"$f":"IF($E141=\"\",\"\",VLOOKUP($F141,'DANE - K2 lit.C'!$B$14:$I$114,8,0))","v":"w przedziale od 30 do 50 minut"},null,0.8,{"$f":"IF($D141=Buski[[#Headers],[Buski]],VLOOKUP($E141,Buski[Buski],1,0),IF($D141=Jędrzejowski[[#Headers],[Jędrzejowski]],VLOOKUP($E141,Jędrzejowski[Jędrzejowski],1,0),IF($D141=Kazimierski[[#Headers],[Kazimierski]],VLOOKUP($E141,Kazimierski[Kazimierski],1,0),IF($D141=Kielecki[[#Headers],[Kielecki]],VLOOKUP($E141,Kielecki[Kielecki],1,0),IF($D141=Konecki[[#Headers],[Konecki]],VLOOKUP($E141,Konecki[Konecki],1,0),IF($D141=Opatowski[[#Headers],[Opatowski]],VLOOKUP($E141,Opatowski[Opatowski],1,0),IF($D141=Ostrowiecki[[#Headers],[Ostrowiecki]],VLOOKUP($E141,Ostrowiecki[Ostrowiecki],1,0),IF($D141=Pińczowski[[#Headers],[Pińczowski]],VLOOKUP($E141,Pińczowski[Pińczowski],1,0),IF($D141=Sandomierski[[#Headers],[Sandomierski]],VLOOKUP($E141,Sandomierski[Sandomierski],1,0),IF($D141=Skarżyski[[#Headers],[Skarżyski]],VLOOKUP($E141,Skarżyski[Skarżyski],1,0),IF($D141=Starachowicki[[#Headers],[Starachowicki]],VLOOKUP($E141,Starachowicki[Starachowicki],1,0),IF($D141=Staszowski[[#Headers],[Staszowski]],VLOOKUP($E141,Staszowski[Staszowski],1,0),IF($D141=Włoszczowski[[#Headers],[Włoszczowski]],VLOOKUP($E141,Włoszczowski[Włoszczowski],1,0),\"\")))))))))))))","v":"Brody"},"starachowicki"]
[null,null,null,"starachowicki","Mirzec","gmina Mirzec",{"$f":"VLOOKUP($F142,'DANE - TERC'!$D$6:$P$119,10,0)","v":2611032},{"$f":"VLOOKUP($F142,'DANE - TERC'!$D$6:$P$119,12,0)","v":"GW"},{"$f":"VLOOKUP($F142,'DANE - K1 lit.A'!$D$6:$M$119,4,0)","v":"NIE"},{"$f":"VLOOKUP($F142,'DANE - K1 lit.A'!$D$6:$M$119,5,0)","v":"NIE"},{"$f":"VLOOKUP($F142,'DANE - K1 lit.A'!$D$6:$M$119,6,0)","v":"NIE"},{"$f":"IF($E142=\"\",\"\",VLOOKUP($F142,'DANE - K4 lit.B'!$D$6:$E$107,2,0))","v":"NIE"},{"$f":"IF($E142=\"\",\"\",VLOOKUP($F142,'DANE - K2 lit.C'!$B$14:$I$114,8,0))","v":"w przedziale od 30 do 50 minut"},null,0.8,{"$f":"IF($D142=Buski[[#Headers],[Buski]],VLOOKUP($E142,Buski[Buski],1,0),IF($D142=Jędrzejowski[[#Headers],[Jędrzejowski]],VLOOKUP($E142,Jędrzejowski[Jędrzejowski],1,0),IF($D142=Kazimierski[[#Headers],[Kazimierski]],VLOOKUP($E142,Kazimierski[Kazimierski],1,0),IF($D142=Kielecki[[#Headers],[Kielecki]],VLOOKUP($E142,Kielecki[Kielecki],1,0),IF($D142=Konecki[[#Headers],[Konecki]],VLOOKUP($E142,Konecki[Konecki],1,0),IF($D142=Opatowski[[#Headers],[Opatowski]],VLOOKUP($E142,Opatowski[Opatowski],1,0),IF($D142=Ostrowiecki[[#Headers],[Ostrowiecki]],VLOOKUP($E142,Ostrowiecki[Ostrowiecki],1,0),IF($D142=Pińczowski[[#Headers],[Pińczowski]],VLOOKUP($E142,Pińczowski[Pińczowski],1,0),IF($D142=Sandomierski[[#Headers],[Sandomierski]],VLOOKUP($E142,Sandomierski[Sandomierski],1,0),IF($D142=Skarżyski[[#Headers],[Skarżyski]],VLOOKUP($E142,Skarżyski[Skarżyski],1,0),IF($D142=Starachowicki[[#Headers],[Starachowicki]],VLOOKUP($E142,Starachowicki[Starachowicki],1,0),IF($D142=Staszowski[[#Headers],[Staszowski]],VLOOKUP($E142,Staszowski[Staszowski],1,0),IF($D142=Włoszczowski[[#Headers],[Włoszczowski]],VLOOKUP($E142,Włoszczowski[Włoszczowski],1,0),\"\")))))))))))))","v":"Mirzec"},"starachowicki"]
[null,null,null,"starachowicki","Pawłów","gmina Pawłów",{"$f":"VLOOKUP($F143,'DANE - TERC'!$D$6:$P$119,10,0)","v":2611042},{"$f":"VLOOKUP($F143,'DANE - TERC'!$D$6:$P$119,12,0)","v":"GW"},{"$f":"VLOOKUP($F143,'DANE - K1 lit.A'!$D$6:$M$119,4,0)","v":"TAK"},{"$f":"VLOOKUP($F143,'DANE - K1 lit.A'!$D$6:$M$119,5,0)","v":"TAK"},{"$f":"VLOOKUP($F143,'DANE - K1 lit.A'!$D$6:$M$119,6,0)","v":"NIE"},{"$f":"IF($E143=\"\",\"\",VLOOKUP($F143,'DANE - K4 lit.B'!$D$6:$E$107,2,0))","v":"NIE"},{"$f":"IF($E143=\"\",\"\",VLOOKUP($F143,'DANE - K2 lit.C'!$B$14:$I$114,8,0))","v":"w przedziale od 30 do 50 minut"},null,0.8,{"$f":"IF($D143=Buski[[#Headers],[Buski]],VLOOKUP($E143,Buski[Buski],1,0),IF($D143=Jędrzejowski[[#Headers],[Jędrzejowski]],VLOOKUP($E143,Jędrzejowski[Jędrzejowski],1,0),IF($D143=Kazimierski[[#Headers],[Kazimierski]],VLOOKUP($E143,Kazimierski[Kazimierski],1,0),IF($D143=Kielecki[[#Headers],[Kielecki]],VLOOKUP($E143,Kielecki[Kielecki],1,0),IF($D143=Konecki[[#Headers],[Konecki]],VLOOKUP($E143,Konecki[Konecki],1,0),IF($D143=Opatowski[[#Headers],[Opatowski]],VLOOKUP($E143,Opatowski[Opatowski],1,0),IF($D143=Ostrowiecki[[#Headers],[Ostrowiecki]],VLOOKUP($E143,Ostrowiecki[Ostrowiecki],1,0),IF($D143=Pińczowski[[#Headers],[Pińczowski]],VLOOKUP($E143,Pińczowski[Pińczowski],1,0),IF($D143=Sandomierski[[#Headers],[Sandomierski]],VLOOKUP($E143,Sandomierski[Sandomierski],1,0),IF($D143=Skarżyski[[#Headers],[Skarżyski]],VLOOKUP($E143,Skarżyski[Skarżyski],1,0),IF($D143=Starachowicki[[#Headers],[Starachowicki]],VLOOKUP($E143,Starachowicki[Starachowicki],1,0),IF($D143=Staszowski[[#Headers],[Staszowski]],VLOOKUP($E143,Staszowski[Staszowski],1,0),IF($D143=Włoszczowski[[#Headers],[Włoszczowski]],VLOOKUP($E143,Włoszczowski[Włoszczowski],1,0),\"\")))))))))))))","v":"Pawłów"},"starachowicki"]
[null,null,null,"starachowicki","Starachowice","gmina Starachowice",{"$f":"VLOOKUP($F144,'DANE - TERC'!$D$6:$P$119,10,0)","v":2611011},{"$f":"VLOOKUP($F144,'DANE - TERC'!$D$6:$P$119,12,0)","v":"GM"},{"$f":"VLOOKUP($F144,'DANE - K1 lit.A'!$D$6:$M$119,4,0)","v":"TAK"},{"$f":"VLOOKUP($F144,'DANE - K1 lit.A'!$D$6:$M$119,5,0)","v":"TAK"},{"$f":"VLOOKUP($F144,'DANE - K1 lit.A'!$D$6:$M$119,6,0)","v":"TAK"},{"$f":"IF($E144=\"\",\"\",VLOOKUP($F144,'DANE - K4 lit.B'!$D$6:$E$107,2,0))","v":"TAK"},{"$f":"IF($E144=\"\",\"\",VLOOKUP($F144,'DANE - K2 lit.C'!$B$14:$I$114,8,0))","v":"w przedziale od 30 do 50 minut"},null,0.8,{"$f":"IF($D144=Buski[[#Headers],[Buski]],VLOOKUP($E144,Buski[Buski],1,0),IF($D144=Jędrzejowski[[#Headers],[Jędrzejowski]],VLOOKUP($E144,Jędrzejowski[Jędrzejowski],1,0),IF($D144=Kazimierski[[#Headers],[Kazimierski]],VLOOKUP($E144,Kazimierski[Kazimierski],1,0),IF($D144=Kielecki[[#Headers],[Kielecki]],VLOOKUP($E144,Kielecki[Kielecki],1,0),IF($D144=Konecki[[#Headers],[Konecki]],VLOOKUP($E144,Konecki[Konecki],1,0),IF($D144=Opatowski[[#Headers],[Opatowski]],VLOOKUP($E144,Opatowski[Opatowski],1,0),IF($D144=Ostrowiecki[[#Headers],[Ostrowiecki]],VLOOKUP($E144,Ostrowiecki[Ostrowiecki],1,0),IF($D144=Pińczowski[[#Headers],[Pińczowski]],VLOOKUP($E144,Pińczowski[Pińczowski],1,0),IF($D144=Sandomierski[[#Headers],[Sandomierski]],VLOOKUP($E144,Sandomierski[Sandomierski],1,0),IF($D144=Skarżyski[[#Headers],[Skarżyski]],VLOOKUP($E144,Skarżyski[Skarżyski],1,0),IF($D144=Starachowicki[[#Headers],[Starachowicki]],VLOOKUP($E144,Starachowicki[Starachowicki],1,0),IF($D144=Staszowski[[#Headers],[Staszowski]],VLOOKUP($E144,Staszowski[Staszowski],1,0),IF($D144=Włoszczowski[[#Headers],[Włoszczowski]],VLOOKUP($E144,Włoszczowski[Włoszczowski],1,0),\"\")))))))))))))","v":"Starachowice"},"starachowicki"]
[null,null,null,"starachowicki","Wąchock","gmina Wąchock",{"$f":"VLOOKUP($F145,'DANE - TERC'!$D$6:$P$119,10,0)","v":2611053},{"$f":"VLOOKUP($F145,'DANE - TERC'!$D$6:$P$119,12,0)","v":"GM-W"},{"$f":"VLOOKUP($F145,'DANE - K1 lit.A'!$D$6:$M$119,4,0)","v":"NIE"},{"$f":"VLOOKUP($F145,'DANE - K1 lit.A'!$D$6:$M$119,5,0)","v":"NIE"},{"$f":"VLOOKUP($F145,'DANE - K1 lit.A'!$D$6:$M$119,6,0)","v":"NIE"},{"$f":"IF($E145=\"\",\"\",VLOOKUP($F145,'DANE - K4 lit.B'!$D$6:$E$107,2,0))","v":"NIE"},{"$f":"IF($E145=\"\",\"\",VLOOKUP($F145,'DANE - K2 lit.C'!$B$14:$I$114,8,0))","v":"w przedziale od 30 do 50 minut"},null,0.8,{"$f":"IF($D145=Buski[[#Headers],[Buski]],VLOOKUP($E145,Buski[Buski],1,0),IF($D145=Jędrzejowski[[#Headers],[Jędrzejowski]],VLOOKUP($E145,Jędrzejowski[Jędrzejowski],1,0),IF($D145=Kazimierski[[#Headers],[Kazimierski]],VLOOKUP($E145,Kazimierski[Kazimierski],1,0),IF($D145=Kielecki[[#Headers],[Kielecki]],VLOOKUP($E145,Kielecki[Kielecki],1,0),IF($D145=Konecki[[#Headers],[Konecki]],VLOOKUP($E145,Konecki[Konecki],1,0),IF($D145=Opatowski[[#Headers],[Opatowski]],VLOOKUP($E145,Opatowski[Opatowski],1,0),IF($D145=Ostrowiecki[[#Headers],[Ostrowiecki]],VLOOKUP($E145,Ostrowiecki[Ostrowiecki],1,0),IF($D145=Pińczowski[[#Headers],[Pińczowski]],VLOOKUP($E145,Pińczowski[Pińczowski],1,0),IF($D145=Sandomierski[[#Headers],[Sandomierski]],VLOOKUP($E145,Sandomierski[Sandomierski],1,0),IF($D145=Skarżyski[[#Headers],[Skarżyski]],VLOOKUP($E145,Skarżyski[Skarżyski],1,0),IF($D145=Starachowicki[[#Headers],[Starachowicki]],VLOOKUP($E145,Starachowicki[Starachowicki],1,0),IF($D145=Staszowski[[#Headers],[Staszowski]],VLOOKUP($E145,Staszowski[Staszowski],1,0),IF($D145=Włoszczowski[[#Headers],[Włoszczowski]],VLOOKUP($E145,Włoszczowski[Włoszczowski],1,0),\"\")))))))))))))","v":"Wąchock"},"starachowicki"]
[null,null,null,"staszowski","Bogoria","gmina Bogoria",{"$f":"VLOOKUP($F146,'DANE - TERC'!$D$6:$P$119,10,0)","v":2612013},{"$f":"VLOOKUP($F146,'DANE - TERC'!$D$6:$P$119,12,0)","v":"GM-W"},{"$f":"VLOOKUP($F146,'DANE - K1 lit.A'!$D$6:$M$119,4,0)","v":"NIE"},{"$f":"VLOOKUP($F146,'DANE - K1 lit.A'!$D$6:$M$119,5,0)","v":"TAK"},{"$f":"VLOOKUP($F146,'DANE - K1 lit.A'!$D$6:$M$119,6,0)","v":"NIE"},{"$f":"IF($E146=\"\",\"\",VLOOKUP($F146,'DANE - K4 lit.B'!$D$6:$E$107,2,0))","v":"NIE"},{"$f":"IF($E146=\"\",\"\",VLOOKUP($F146,'DANE - K2 lit.C'!$B$14:$I$114,8,0))","v":"w przedziale od 30 do 50 minut"},null,0.7,{"$f":"IF($D146=Buski[[#Headers],[Buski]],VLOOKUP($E146,Buski[Buski],1,0),IF($D146=Jędrzejowski[[#Headers],[Jędrzejowski]],VLOOKUP($E146,Jędrzejowski[Jędrzejowski],1,0),IF($D146=Kazimierski[[#Headers],[Kazimierski]],VLOOKUP($E146,Kazimierski[Kazimierski],1,0),IF($D146=Kielecki[[#Headers],[Kielecki]],VLOOKUP($E146,Kielecki[Kielecki],1,0),IF($D146=Konecki[[#Headers],[Konecki]],VLOOKUP($E146,Konecki[Konecki],1,0),IF($D146=Opatowski[[#Headers],[Opatowski]],VLOOKUP($E146,Opatowski[Opatowski],1,0),IF($D146=Ostrowiecki[[#Headers],[Ostrowiecki]],VLOOKUP($E146,Ostrowiecki[Ostrowiecki],1,0),IF($D146=Pińczowski[[#Headers],[Pińczowski]],VLOOKUP($E146,Pińczowski[Pińczowski],1,0),IF($D146=Sandomierski[[#Headers],[Sandomierski]],VLOOKUP($E146,Sandomierski[Sandomierski],1,0),IF($D146=Skarżyski[[#Headers],[Skarżyski]],VLOOKUP($E146,Skarżyski[Skarżyski],1,0),IF($D146=Starachowicki[[#Headers],[Starachowicki]],VLOOKUP($E146,Starachowicki[Starachowicki],1,0),IF($D146=Staszowski[[#Headers],[Staszowski]],VLOOKUP($E146,Staszowski[Staszowski],1,0),IF($D146=Włoszczowski[[#Headers],[Włoszczowski]],VLOOKUP($E146,Włoszczowski[Włoszczowski],1,0),\"\")))))))))))))","v":"Bogoria"},"staszowski"]
[null,null,null,"staszowski","Łubnice","gmina Łubnice",{"$f":"VLOOKUP($F147,'DANE - TERC'!$D$6:$P$119,10,0)","v":2612022},{"$f":"VLOOKUP($F147,'DANE - TERC'!$D$6:$P$119,12,0)","v":"GW"},{"$f":"VLOOKUP($F147,'DANE - K1 lit.A'!$D$6:$M$119,4,0)","v":"NIE"},{"$f":"VLOOKUP($F147,'DANE - K1 lit.A'!$D$6:$M$119,5,0)","v":"NIE"},{"$f":"VLOOKUP($F147,'DANE - K1 lit.A'!$D$6:$M$119,6,0)","v":"NIE"},{"$f":"IF($E147=\"\",\"\",VLOOKUP($F147,'DANE - K4 lit.B'!$D$6:$E$107,2,0))","v":"NIE"},{"$f":"IF($E147=\"\",\"\",VLOOKUP($F147,'DANE - K2 lit.C'!$B$14:$I$114,8,0))","v":"większy niż 50 minut"},null,0.8,{"$f":"IF($D147=Buski[[#Headers],[Buski]],VLOOKUP($E147,Buski[Buski],1,0),IF($D147=Jędrzejowski[[#Headers],[Jędrzejowski]],VLOOKUP($E147,Jędrzejowski[Jędrzejowski],1,0),IF($D147=Kazimierski[[#Headers],[Kazimierski]],VLOOKUP($E147,Kazimierski[Kazimierski],1,0),IF($D147=Kielecki[[#Headers],[Kielecki]],VLOOKUP($E147,Kielecki[Kielecki],1,0),IF($D147=Konecki[[#Headers],[Konecki]],VLOOKUP($E147,Konecki[Konecki],1,0),IF($D147=Opatowski[[#Headers],[Opatowski]],VLOOKUP($E147,Opatowski[Opatowski],1,0),IF($D147=Ostrowiecki[[#Headers],[Ostrowiecki]],VLOOKUP($E147,Ostrowiecki[Ostrowiecki],1,0),IF($D147=Pińczowski[[#Headers],[Pińczowski]],VLOOKUP($E147,Pińczowski[Pińczowski],1,0),IF($D147=Sandomierski[[#Headers],[Sandomierski]],VLOOKUP($E147,Sandomierski[Sandomierski],1,0),IF($D147=Skarżyski[[#Headers],[Skarżyski]],VLOOKUP($E147,Skarżyski[Skarżyski],1,0),IF($D147=Starachowicki[[#Headers],[Starachowicki]],VLOOKUP($E147,Starachowicki[Starachowicki],1,0),IF($D147=Staszowski[[#Headers],[Staszowski]],VLOOKUP($E147,Staszowski[Staszowski],1,0),IF($D147=Włoszczowski[[#Headers],[Włoszczowski]],VLOOKUP($E147,Włoszczowski[Włoszczowski],1,0),\"\")))))))))))))","v":"Łubnice"},"staszowski"]
[null,null,null,"staszowski","Oleśnica","gmina Oleśnica",{"$f":"VLOOKUP($F148,'DANE - TERC'!$D$6:$P$119,10,0)","v":2612033},{"$f":"VLOOKUP($F148,'DANE - TERC'!$D$6:$P$119,12,0)","v":"GM-W"},{"$f":"VLOOKUP($F148,'DANE - K1 lit.A'!$D$6:$M$119,4,0)","v":"NIE"},{"$f":"VLOOKUP($F148,'DANE - K1 lit.A'!$D$6:$M$119,5,0)","v":"TAK"},{"$f":"VLOOKUP($F148,'DANE - K1 lit.A'!$D$6:$M$119,6,0)","v":"NIE"},{"$f":"IF($E148=\"\",\"\",VLOOKUP($F148,'DANE - K4 lit.B'!$D$6:$E$107,2,0))","v":"NIE"},{"$f":"IF($E148=\"\",\"\",VLOOKUP($F148,'DANE - K2 lit.C'!$B$14:$I$114,8,0))","v":"większy niż 50 minut"},null,0.8,{"$f":"IF($D148=Buski[[#Headers],[Buski]],VLOOKUP($E148,Buski[Buski],1,0),IF($D148=Jędrzejowski[[#Headers],[Jędrzejowski]],VLOOKUP($E148,Jędrzejowski[Jędrzejowski],1,0),IF($D148=Kazimierski[[#Headers],[Kazimierski]],VLOOKUP($E148,Kazimierski[Kazimierski],1,0),IF($D148=Kielecki[[#Headers],[Kielecki]],VLOOKUP($E148,Kielecki[Kielecki],1,0),IF($D148=Konecki[[#Headers],[Konecki]],VLOOKUP($E148,Konecki[Konecki],1,0),IF($D148=Opatowski[[#Headers],[Opatowski]],VLOOKUP($E148,Opatowski[Opatowski],1,0),IF($D148=Ostrowiecki[[#Headers],[Ostrowiecki]],VLOOKUP($E148,Ostrowiecki[Ostrowiecki],1,0),IF($D148=Pińczowski[[#Headers],[Pińczowski]],VLOOKUP($E148,Pińczowski[Pińczowski],1,0),IF($D148=Sandomierski[[#Headers],[Sandomierski]],VLOOKUP($E148,Sandomierski[Sandomierski],1,0),IF($D148=Skarżyski[[#Headers],[Skarżyski]],VLOOKUP($E148,Skarżyski[Skarżyski],1,0),IF($D148=Starachowicki[[#Headers],[Starachowicki]],VLOOKUP($E148,Starachowicki[Starachowicki],1,0),IF($D148=Staszowski[[#Headers],[Staszowski]],VLOOKUP($E148,Staszowski[Staszowski],1,0),IF($D148=Włoszczowski[[#Headers],[Włoszczowski]],VLOOKUP($E148,Włoszczowski[Włoszczowski],1,0),\"\")))))))))))))","v":"Oleśnica"},"staszowski"]
[null,null,null,"staszowski","Osiek","gmina Osiek",{"$f":"VLOOKUP($F149,'DANE - TERC'!$D$6:$P$119,10,0)","v":2612043},{"$f":"VLOOKUP($F149,'DANE - TERC'!$D$6:$P$119,12,0)","v":"GM-W"},{"$f":"VLOOKUP($F149,'DANE - K1 lit.A'!$D$6:$M$119,4,0)","v":"TAK"},{"$f":"VLOOKUP($F149,'DANE - K1 lit.A'!$D$6:$M$119,5,0)","v":"TAK"},{"$f":"VLOOKUP($F149,'DANE - K1 lit.A'!$D$6:$M$119,6,0)","v":"TAK"},{"$f":"IF($E149=\"\",\"\",VLOOKUP($F149,'DANE - K4 lit.B'!$D$6:$E$107,2,0))","v":"NIE"},{"$f":"IF($E149=\"\",\"\",VLOOKUP($F149,'DANE - K2 lit.C'!$B$14:$I$114,8,0))","v":"w przedziale od 30 do 50 minut"},null,0.8,{"$f":"IF($D149=Buski[[#Headers],[Buski]],VLOOKUP($E149,Buski[Buski],1,0),IF($D149=Jędrzejowski[[#Headers],[Jędrzejowski]],VLOOKUP($E149,Jędrzejowski[Jędrzejowski],1,0),IF($D149=Kazimierski[[#Headers],[Kazimierski]],VLOOKUP($E149,Kazimierski[Kazimierski],1,0),IF($D149=Kielecki[[#Headers],[Kielecki]],VLOOKUP($E149,Kielecki[Kielecki],1,0),IF($D149=Konecki[[#Headers],[Konecki]],VLOOKUP($E149,Konecki[Konecki],1,0),IF($D149=Opatowski[[#Headers],[Opatowski]],VLOOKUP($E149,Opatowski[Opatowski],1,0),IF($D149=Ostrowiecki[[#Headers],[Ostrowiecki]],VLOOKUP($E149,Ostrowiecki[Ostrowiecki],1,0),IF($D149=Pińczowski[[#Headers],[Pińczowski]],VLOOKUP($E149,Pińczowski[Pińczowski],1,0),IF($D149=Sandomierski[[#Headers],[Sandomierski]],VLOOKUP($E149,Sandomierski[Sandomierski],1,0),IF($D149=Skarżyski[[#Headers],[Skarżyski]],VLOOKUP($E149,Skarżyski[Skarżyski],1,0),IF($D149=Starachowicki[[#Headers],[Starachowicki]],VLOOKUP($E149,Starachowicki[Starachowicki],1,0),IF($D149=Staszowski[[#Headers],[Staszowski]],VLOOKUP($E149,Staszowski[Staszowski],1,0),IF($D149=Włoszczowski[[#Headers],[Włoszczowski]],VLOOKUP($E149,Włoszczowski[Włoszczowski],1,0),\"\")))))))))))))","v":"Osiek"},"staszowski"]
[null,null,null,"staszowski","Połaniec","gmina Połaniec",{"$f":"VLOOKUP($F150,'DANE - TERC'!$D$6:$P$119,10,0)","v":2612053},{"$f":"VLOOKUP($F150,'DANE - TERC'!$D$6:$P$119,12,0)","v":"GM-W"},{"$f":"VLOOKUP($F150,'DANE - K1 lit.A'!$D$6:$M$119,4,0)","v":"NIE"},{"$f":"VLOOKUP($F150,'DANE - K1 lit.A'!$D$6:$M$119,5,0)","v":"NIE"},{"$f":"VLOOKUP($F150,'DANE - K1 lit.A'!$D$6:$M$119,6,0)","v":"NIE"},{"$f":"IF($E150=\"\",\"\",VLOOKUP($F150,'DANE - K4 lit.B'!$D$6:$E$107,2,0))","v":"NIE"},{"$f":"IF($E150=\"\",\"\",VLOOKUP($F150,'DANE - K2 lit.C'!$B$14:$I$114,8,0))","v":"większy niż 50 minut"},null,0.6,{"$f":"IF($D150=Buski[[#Headers],[Buski]],VLOOKUP($E150,Buski[Buski],1,0),IF($D150=Jędrzejowski[[#Headers],[Jędrzejowski]],VLOOKUP($E150,Jędrzejowski[Jędrzejowski],1,0),IF($D150=Kazimierski[[#Headers],[Kazimierski]],VLOOKUP($E150,Kazimierski[Kazimierski],1,0),IF($D150=Kielecki[[#Headers],[Kielecki]],VLOOKUP($E150,Kielecki[Kielecki],1,0),IF($D150=Konecki[[#Headers],[Konecki]],VLOOKUP($E150,Konecki[Konecki],1,0),IF($D150=Opatowski[[#Headers],[Opatowski]],VLOOKUP($E150,Opatowski[Opatowski],1,0),IF($D150=Ostrowiecki[[#Headers],[Ostrowiecki]],VLOOKUP($E150,Ostrowiecki[Ostrowiecki],1,0),IF($D150=Pińczowski[[#Headers],[Pińczowski]],VLOOKUP($E150,Pińczowski[Pińczowski],1,0),IF($D150=Sandomierski[[#Headers],[Sandomierski]],VLOOKUP($E150,Sandomierski[Sandomierski],1,0),IF($D150=Skarżyski[[#Headers],[Skarżyski]],VLOOKUP($E150,Skarżyski[Skarżyski],1,0),IF($D150=Starachowicki[[#Headers],[Starachowicki]],VLOOKUP($E150,Starachowicki[Starachowicki],1,0),IF($D150=Staszowski[[#Headers],[Staszowski]],VLOOKUP($E150,Staszowski[Staszowski],1,0),IF($D150=Włoszczowski[[#Headers],[Włoszczowski]],VLOOKUP($E150,Włoszczowski[Włoszczowski],1,0),\"\")))))))))))))","v":"Połaniec"},"staszowski"]
[null,null,null,"staszowski","Rytwiany","gmina Rytwiany",{"$f":"VLOOKUP($F151,'DANE - TERC'!$D$6:$P$119,10,0)","v":2612062},{"$f":"VLOOKUP($F151,'DANE - TERC'!$D$6:$P$119,12,0)","v":"GW"},{"$f":"VLOOKUP($F151,'DANE - K1 lit.A'!$D$6:$M$119,4,0)","v":"NIE"},{"$f":"VLOOKUP($F151,'DANE - K1 lit.A'!$D$6:$M$119,5,0)","v":"NIE"},{"$f":"VLOOKUP($F151,'DANE - K1 lit.A'!$D$6:$M$119,6,0)","v":"NIE"},{"$f":"IF($E151=\"\",\"\",VLOOKUP($F151,'DANE - K4 lit.B'!$D$6:$E$107,2,0))","v":"NIE"},{"$f":"IF($E151=\"\",\"\",VLOOKUP($F151,'DANE - K2 lit.C'!$B$14:$I$114,8,0))","v":"w przedziale od 30 do 50 minut"},null,0.8,{"$f":"IF($D151=Buski[[#Headers],[Buski]],VLOOKUP($E151,Buski[Buski],1,0),IF($D151=Jędrzejowski[[#Headers],[Jędrzejowski]],VLOOKUP($E151,Jędrzejowski[Jędrzejowski],1,0),IF($D151=Kazimierski[[#Headers],[Kazimierski]],VLOOKUP($E151,Kazimierski[Kazimierski],1,0),IF($D151=Kielecki[[#Headers],[Kielecki]],VLOOKUP($E151,Kielecki[Kielecki],1,0),IF($D151=Konecki[[#Headers],[Konecki]],VLOOKUP($E151,Konecki[Konecki],1,0),IF($D151=Opatowski[[#Headers],[Opatowski]],VLOOKUP($E151,Opatowski[Opatowski],1,0),IF($D151=Ostrowiecki[[#Headers],[Ostrowiecki]],VLOOKUP($E151,Ostrowiecki[Ostrowiecki],1,0),IF($D151=Pińczowski[[#Headers],[Pińczowski]],VLOOKUP($E151,Pińczowski[Pińczowski],1,0),IF($D151=Sandomierski[[#Headers],[Sandomierski]],VLOOKUP($E151,Sandomierski[Sandomierski],1,0),IF($D151=Skarżyski[[#Headers],[Skarżyski]],VLOOKUP($E151,Skarżyski[Skarżyski],1,0),IF($D151=Starachowicki[[#Headers],[Starachowicki]],VLOOKUP($E151,Starachowicki[Starachowicki],1,0),IF($D151=Staszowski[[#Headers],[Staszowski]],VLOOKUP($E151,Staszowski[Staszowski],1,0),IF($D151=Włoszczowski[[#Headers],[Włoszczowski]],VLOOKUP($E151,Włoszczowski[Włoszczowski],1,0),\"\")))))))))))))","v":"Rytwiany"},"staszowski"]
[null,null,null,"staszowski","Staszów","gmina Staszów",{"$f":"VLOOKUP($F152,'DANE - TERC'!$D$6:$P$119,10,0)","v":2612073},{"$f":"VLOOKUP($F152,'DANE - TERC'!$D$6:$P$119,12,0)","v":"GM-W"},{"$f":"VLOOKUP($F152,'DANE - K1 lit.A'!$D$6:$M$119,4,0)","v":"TAK"},{"$f":"VLOOKUP($F152,'DANE - K1 lit.A'!$D$6:$M$119,5,0)","v":"TAK"},{"$f":"VLOOKUP($F152,'DANE - K1 lit.A'!$D$6:$M$119,6,0)","v":"TAK"},{"$f":"IF($E152=\"\",\"\",VLOOKUP($F152,'DANE - K4 lit.B'!$D$6:$E$107,2,0))","v":"TAK"},{"$f":"IF($E152=\"\",\"\",VLOOKUP($F152,'DANE - K2 lit.C'!$B$14:$I$114,8,0))","v":"w przedziale od 30 do 50 minut"},null,0.8,{"$f":"IF($D152=Buski[[#Headers],[Buski]],VLOOKUP($E152,Buski[Buski],1,0),IF($D152=Jędrzejowski[[#Headers],[Jędrzejowski]],VLOOKUP($E152,Jędrzejowski[Jędrzejowski],1,0),IF($D152=Kazimierski[[#Headers],[Kazimierski]],VLOOKUP($E152,Kazimierski[Kazimierski],1,0),IF($D152=Kielecki[[#Headers],[Kielecki]],VLOOKUP($E152,Kielecki[Kielecki],1,0),IF($D152=Konecki[[#Headers],[Konecki]],VLOOKUP($E152,Konecki[Konecki],1,0),IF($D152=Opatowski[[#Headers],[Opatowski]],VLOOKUP($E152,Opatowski[Opatowski],1,0),IF($D152=Ostrowiecki[[#Headers],[Ostrowiecki]],VLOOKUP($E152,Ostrowiecki[Ostrowiecki],1,0),IF($D152=Pińczowski[[#Headers],[Pińczowski]],VLOOKUP($E152,Pińczowski[Pińczowski],1,0),IF($D152=Sandomierski[[#Headers],[Sandomierski]],VLOOKUP($E152,Sandomierski[Sandomierski],1,0),IF($D152=Skarżyski[[#Headers],[Skarżyski]],VLOOKUP($E152,Skarżyski[Skarżyski],1,0),IF($D152=Starachowicki[[#Headers],[Starachowicki]],VLOOKUP($E152,Starachowicki[Starachowicki],1,0),IF($D152=Staszowski[[#Headers],[Staszowski]],VLOOKUP($E152,Staszowski[Staszowski],1,0),IF($D152=Włoszczowski[[#Headers],[Włoszczowski]],VLOOKUP($E152,Włoszczowski[Włoszczowski],1,0),\"\")))))))))))))","v":"Staszów"},"staszowski"]
[null,null,null,"staszowski","Szydłów","gmina Szydłów",{"$f":"VLOOKUP($F153,'DANE - TERC'!$D$6:$P$119,10,0)","v":2612083},{"$f":"VLOOKUP($F153,'DANE - TERC'!$D$6:$P$119,12,0)","v":"GM-W"},{"$f":"VLOOKUP($F153,'DANE - K1 lit.A'!$D$6:$M$119,4,0)","v":"NIE"},{"$f":"VLOOKUP($F153,'DANE - K1 lit.A'!$D$6:$M$119,5,0)","v":"TAK"},{"$f":"VLOOKUP($F153,'DANE - K1 lit.A'!$D$6:$M$119,6,0)","v":"NIE"},{"$f":"IF($E153=\"\",\"\",VLOOKUP($F153,'DANE - K4 lit.B'!$D$6:$E$107,2,0))","v":"NIE"},{"$f":"IF($E153=\"\",\"\",VLOOKUP($F153,'DANE - K2 lit.C'!$B$14:$I$114,8,0))","v":"w przedziale od 30 do 50 minut"},null,0.8,{"$f":"IF($D153=Buski[[#Headers],[Buski]],VLOOKUP($E153,Buski[Buski],1,0),IF($D153=Jędrzejowski[[#Headers],[Jędrzejowski]],VLOOKUP($E153,Jędrzejowski[Jędrzejowski],1,0),IF($D153=Kazimierski[[#Headers],[Kazimierski]],VLOOKUP($E153,Kazimierski[Kazimierski],1,0),IF($D153=Kielecki[[#Headers],[Kielecki]],VLOOKUP($E153,Kielecki[Kielecki],1,0),IF($D153=Konecki[[#Headers],[Konecki]],VLOOKUP($E153,Konecki[Konecki],1,0),IF($D153=Opatowski[[#Headers],[Opatowski]],VLOOKUP($E153,Opatowski[Opatowski],1,0),IF($D153=Ostrowiecki[[#Headers],[Ostrowiecki]],VLOOKUP($E153,Ostrowiecki[Ostrowiecki],1,0),IF($D153=Pińczowski[[#Headers],[Pińczowski]],VLOOKUP($E153,Pińczowski[Pińczowski],1,0),IF($D153=Sandomierski[[#Headers],[Sandomierski]],VLOOKUP($E153,Sandomierski[Sandomierski],1,0),IF($D153=Skarżyski[[#Headers],[Skarżyski]],VLOOKUP($E153,Skarżyski[Skarżyski],1,0),IF($D153=Starachowicki[[#Headers],[Starachowicki]],VLOOKUP($E153,Starachowicki[Starachowicki],1,0),IF($D153=Staszowski[[#Headers],[Staszowski]],VLOOKUP($E153,Staszowski[Staszowski],1,0),IF($D153=Włoszczowski[[#Headers],[Włoszczowski]],VLOOKUP($E153,Włoszczowski[Włoszczowski],1,0),\"\")))))))))))))","v":"Szydłów"},"staszowski"]
[null,null,null,"włoszczowski","Kluczewsko","gmina Kluczewsko",{"$f":"VLOOKUP($F154,'DANE - TERC'!$D$6:$P$119,10,0)","v":2613012},{"$f":"VLOOKUP($F154,'DANE - TERC'!$D$6:$P$119,12,0)","v":"GW"},{"$f":"VLOOKUP($F154,'DANE - K1 lit.A'!$D$6:$M$119,4,0)","v":"NIE"},{"$f":"VLOOKUP($F154,'DANE - K1 lit.A'!$D$6:$M$119,5,0)","v":"NIE"},{"$f":"VLOOKUP($F154,'DANE - K1 lit.A'!$D$6:$M$119,6,0)","v":"NIE"},{"$f":"IF($E154=\"\",\"\",VLOOKUP($F154,'DANE - K4 lit.B'!$D$6:$E$107,2,0))","v":"NIE"},{"$f":"IF($E154=\"\",\"\",VLOOKUP($F154,'DANE - K2 lit.C'!$B$14:$I$114,8,0))","v":"w przedziale od 30 do 50 minut"},null,0.8,{"$f":"IF($D154=Buski[[#Headers],[Buski]],VLOOKUP($E154,Buski[Buski],1,0),IF($D154=Jędrzejowski[[#Headers],[Jędrzejowski]],VLOOKUP($E154,Jędrzejowski[Jędrzejowski],1,0),IF($D154=Kazimierski[[#Headers],[Kazimierski]],VLOOKUP($E154,Kazimierski[Kazimierski],1,0),IF($D154=Kielecki[[#Headers],[Kielecki]],VLOOKUP($E154,Kielecki[Kielecki],1,0),IF($D154=Konecki[[#Headers],[Konecki]],VLOOKUP($E154,Konecki[Konecki],1,0),IF($D154=Opatowski[[#Headers],[Opatowski]],VLOOKUP($E154,Opatowski[Opatowski],1,0),IF($D154=Ostrowiecki[[#Headers],[Ostrowiecki]],VLOOKUP($E154,Ostrowiecki[Ostrowiecki],1,0),IF($D154=Pińczowski[[#Headers],[Pińczowski]],VLOOKUP($E154,Pińczowski[Pińczowski],1,0),IF($D154=Sandomierski[[#Headers],[Sandomierski]],VLOOKUP($E154,Sandomierski[Sandomierski],1,0),IF($D154=Skarżyski[[#Headers],[Skarżyski]],VLOOKUP($E154,Skarżyski[Skarżyski],1,0),IF($D154=Starachowicki[[#Headers],[Starachowicki]],VLOOKUP($E154,Starachowicki[Starachowicki],1,0),IF($D154=Staszowski[[#Headers],[Staszowski]],VLOOKUP($E154,Staszowski[Staszowski],1,0),IF($D154=Włoszczowski[[#Headers],[Włoszczowski]],VLOOKUP($E154,Włoszczowski[Włoszczowski],1,0),\"\")))))))))))))","v":"Kluczewsko"},"włoszczowski"]
[null,null,null,"włoszczowski","Krasocin","gmina Krasocin",{"$f":"VLOOKUP($F155,'DANE - TERC'!$D$6:$P$119,10,0)","v":2613022},{"$f":"VLOOKUP($F155,'DANE - TERC'!$D$6:$P$119,12,0)","v":"GW"},{"$f":"VLOOKUP($F155,'DANE - K1 lit.A'!$D$6:$M$119,4,0)","v":"NIE"},{"$f":"VLOOKUP($F155,'DANE - K1 lit.A'!$D$6:$M$119,5,0)","v":"NIE"},{"$f":"VLOOKUP($F155,'DANE - K1 lit.A'!$D$6:$M$119,6,0)","v":"NIE"},{"$f":"IF($E155=\"\",\"\",VLOOKUP($F155,'DANE - K4 lit.B'!$D$6:$E$107,2,0))","v":"NIE"},{"$f":"IF($E155=\"\",\"\",VLOOKUP($F155,'DANE - K2 lit.C'!$B$14:$I$114,8,0))","v":"w przedziale od 30 do 50 minut"},null,0.7,{"$f":"IF($D155=Buski[[#Headers],[Buski]],VLOOKUP($E155,Buski[Buski],1,0),IF($D155=Jędrzejowski[[#Headers],[Jędrzejowski]],VLOOKUP($E155,Jędrzejowski[Jędrzejowski],1,0),IF($D155=Kazimierski[[#Headers],[Kazimierski]],VLOOKUP($E155,Kazimierski[Kazimierski],1,0),IF($D155=Kielecki[[#Headers],[Kielecki]],VLOOKUP($E155,Kielecki[Kielecki],1,0),IF($D155=Konecki[[#Headers],[Konecki]],VLOOKUP($E155,Konecki[Konecki],1,0),IF($D155=Opatowski[[#Headers],[Opatowski]],VLOOKUP($E155,Opatowski[Opatowski],1,0),IF($D155=Ostrowiecki[[#Headers],[Ostrowiecki]],VLOOKUP($E155,Ostrowiecki[Ostrowiecki],1,0),IF($D155=Pińczowski[[#Headers],[Pińczowski]],VLOOKUP($E155,Pińczowski[Pińczowski],1,0),IF($D155=Sandomierski[[#Headers],[Sandomierski]],VLOOKUP($E155,Sandomierski[Sandomierski],1,0),IF($D155=Skarżyski[[#Headers],[Skarżyski]],VLOOKUP($E155,Skarżyski[Skarżyski],1,0),IF($D155=Starachowicki[[#Headers],[Starachowicki]],VLOOKUP($E155,Starachowicki[Starachowicki],1,0),IF($D155=Staszowski[[#Headers],[Staszowski]],VLOOKUP($E155,Staszowski[Staszowski],1,0),IF($D155=Włoszczowski[[#Headers],[Włoszczowski]],VLOOKUP($E155,Włoszczowski[Włoszczowski],1,0),\"\")))))))))))))","v":"Krasocin"},"włoszczowski"]
[null,null,null,"włoszczowski","Moskorzew","gmina Moskorzew",{"$f":"VLOOKUP($F156,'DANE - TERC'!$D$6:$P$119,10,0)","v":2613032},{"$f":"VLOOKUP($F156,'DANE - TERC'!$D$6:$P$119,12,0)","v":"GW"},{"$f":"VLOOKUP($F156,'DANE - K1 lit.A'!$D$6:$M$119,4,0)","v":"TAK"},{"$f":"VLOOKUP($F156,'DANE - K1 lit.A'!$D$6:$M$119,5,0)","v":"TAK"},{"$f":"VLOOKUP($F156,'DANE - K1 lit.A'!$D$6:$M$119,6,0)","v":"TAK"},{"$f":"IF($E156=\"\",\"\",VLOOKUP($F156,'DANE - K4 lit.B'!$D$6:$E$107,2,0))","v":"NIE"},{"$f":"IF($E156=\"\",\"\",VLOOKUP($F156,'DANE - K2 lit.C'!$B$14:$I$114,8,0))","v":"większy niż 50 minut"},null,0.8,{"$f":"IF($D156=Buski[[#Headers],[Buski]],VLOOKUP($E156,Buski[Buski],1,0),IF($D156=Jędrzejowski[[#Headers],[Jędrzejowski]],VLOOKUP($E156,Jędrzejowski[Jędrzejowski],1,0),IF($D156=Kazimierski[[#Headers],[Kazimierski]],VLOOKUP($E156,Kazimierski[Kazimierski],1,0),IF($D156=Kielecki[[#Headers],[Kielecki]],VLOOKUP($E156,Kielecki[Kielecki],1,0),IF($D156=Konecki[[#Headers],[Konecki]],VLOOKUP($E156,Konecki[Konecki],1,0),IF($D156=Opatowski[[#Headers],[Opatowski]],VLOOKUP($E156,Opatowski[Opatowski],1,0),IF($D156=Ostrowiecki[[#Headers],[Ostrowiecki]],VLOOKUP($E156,Ostrowiecki[Ostrowiecki],1,0),IF($D156=Pińczowski[[#Headers],[Pińczowski]],VLOOKUP($E156,Pińczowski[Pińczowski],1,0),IF($D156=Sandomierski[[#Headers],[Sandomierski]],VLOOKUP($E156,Sandomierski[Sandomierski],1,0),IF($D156=Skarżyski[[#Headers],[Skarżyski]],VLOOKUP($E156,Skarżyski[Skarżyski],1,0),IF($D156=Starachowicki[[#Headers],[Starachowicki]],VLOOKUP($E156,Starachowicki[Starachowicki],1,0),IF($D156=Staszowski[[#Headers],[Staszowski]],VLOOKUP($E156,Staszowski[Staszowski],1,0),IF($D156=Włoszczowski[[#Headers],[Włoszczowski]],VLOOKUP($E156,Włoszczowski[Włoszczowski],1,0),\"\")))))))))))))","v":"Moskorzew"},"włoszczowski"]
[null,null,null,"włoszczowski","Radków","gmina Radków",{"$f":"VLOOKUP($F157,'DANE - TERC'!$D$6:$P$119,10,0)","v":2613042},{"$f":"VLOOKUP($F157,'DANE - TERC'!$D$6:$P$119,12,0)","v":"GW"},{"$f":"VLOOKUP($F157,'DANE - K1 lit.A'!$D$6:$M$119,4,0)","v":"NIE"},{"$f":"VLOOKUP($F157,'DANE - K1 lit.A'!$D$6:$M$119,5,0)","v":"NIE"},{"$f":"VLOOKUP($F157,'DANE - K1 lit.A'!$D$6:$M$119,6,0)","v":"NIE"},{"$f":"IF($E157=\"\",\"\",VLOOKUP($F157,'DANE - K4 lit.B'!$D$6:$E$107,2,0))","v":"NIE"},{"$f":"IF($E157=\"\",\"\",VLOOKUP($F157,'DANE - K2 lit.C'!$B$14:$I$114,8,0))","v":"w przedziale od 30 do 50 minut"},null,0.7,{"$f":"IF($D157=Buski[[#Headers],[Buski]],VLOOKUP($E157,Buski[Buski],1,0),IF($D157=Jędrzejowski[[#Headers],[Jędrzejowski]],VLOOKUP($E157,Jędrzejowski[Jędrzejowski],1,0),IF($D157=Kazimierski[[#Headers],[Kazimierski]],VLOOKUP($E157,Kazimierski[Kazimierski],1,0),IF($D157=Kielecki[[#Headers],[Kielecki]],VLOOKUP($E157,Kielecki[Kielecki],1,0),IF($D157=Konecki[[#Headers],[Konecki]],VLOOKUP($E157,Konecki[Konecki],1,0),IF($D157=Opatowski[[#Headers],[Opatowski]],VLOOKUP($E157,Opatowski[Opatowski],1,0),IF($D157=Ostrowiecki[[#Headers],[Ostrowiecki]],VLOOKUP($E157,Ostrowiecki[Ostrowiecki],1,0),IF($D157=Pińczowski[[#Headers],[Pińczowski]],VLOOKUP($E157,Pińczowski[Pińczowski],1,0),IF($D157=Sandomierski[[#Headers],[Sandomierski]],VLOOKUP($E157,Sandomierski[Sandomierski],1,0),IF($D157=Skarżyski[[#Headers],[Skarżyski]],VLOOKUP($E157,Skarżyski[Skarżyski],1,0),IF($D157=Starachowicki[[#Headers],[Starachowicki]],VLOOKUP($E157,Starachowicki[Starachowicki],1,0),IF($D157=Staszowski[[#Headers],[Staszowski]],VLOOKUP($E157,Staszowski[Staszowski],1,0),IF($D157=Włoszczowski[[#Headers],[Włoszczowski]],VLOOKUP($E157,Włoszczowski[Włoszczowski],1,0),\"\")))))))))))))","v":"Radków"},"włoszczowski"]
[null,null,null,"włoszczowski","Secemin","gmina Secemin",{"$f":"VLOOKUP($F158,'DANE - TERC'!$D$6:$P$119,10,0)","v":2613052},{"$f":"VLOOKUP($F158,'DANE - TERC'!$D$6:$P$119,12,0)","v":"GW"},{"$f":"VLOOKUP($F158,'DANE - K1 lit.A'!$D$6:$M$119,4,0)","v":"NIE"},{"$f":"VLOOKUP($F158,'DANE - K1 lit.A'!$D$6:$M$119,5,0)","v":"NIE"},{"$f":"VLOOKUP($F158,'DANE - K1 lit.A'!$D$6:$M$119,6,0)","v":"NIE"},{"$f":"IF($E158=\"\",\"\",VLOOKUP($F158,'DANE - K4 lit.B'!$D$6:$E$107,2,0))","v":"NIE"},{"$f":"IF($E158=\"\",\"\",VLOOKUP($F158,'DANE - K2 lit.C'!$B$14:$I$114,8,0))","v":"większy niż 50 minut"},null,0.8,{"$f":"IF($D158=Buski[[#Headers],[Buski]],VLOOKUP($E158,Buski[Buski],1,0),IF($D158=Jędrzejowski[[#Headers],[Jędrzejowski]],VLOOKUP($E158,Jędrzejowski[Jędrzejowski],1,0),IF($D158=Kazimierski[[#Headers],[Kazimierski]],VLOOKUP($E158,Kazimierski[Kazimierski],1,0),IF($D158=Kielecki[[#Headers],[Kielecki]],VLOOKUP($E158,Kielecki[Kielecki],1,0),IF($D158=Konecki[[#Headers],[Konecki]],VLOOKUP($E158,Konecki[Konecki],1,0),IF($D158=Opatowski[[#Headers],[Opatowski]],VLOOKUP($E158,Opatowski[Opatowski],1,0),IF($D158=Ostrowiecki[[#Headers],[Ostrowiecki]],VLOOKUP($E158,Ostrowiecki[Ostrowiecki],1,0),IF($D158=Pińczowski[[#Headers],[Pińczowski]],VLOOKUP($E158,Pińczowski[Pińczowski],1,0),IF($D158=Sandomierski[[#Headers],[Sandomierski]],VLOOKUP($E158,Sandomierski[Sandomierski],1,0),IF($D158=Skarżyski[[#Headers],[Skarżyski]],VLOOKUP($E158,Skarżyski[Skarżyski],1,0),IF($D158=Starachowicki[[#Headers],[Starachowicki]],VLOOKUP($E158,Starachowicki[Starachowicki],1,0),IF($D158=Staszowski[[#Headers],[Staszowski]],VLOOKUP($E158,Staszowski[Staszowski],1,0),IF($D158=Włoszczowski[[#Headers],[Włoszczowski]],VLOOKUP($E158,Włoszczowski[Włoszczowski],1,0),\"\")))))))))))))","v":"Secemin"},"włoszczowski"]
[null,null,null,"włoszczowski","Włoszczowa","gmina Włoszczowa",{"$f":"VLOOKUP($F159,'DANE - TERC'!$D$6:$P$119,10,0)","v":2613063},{"$f":"VLOOKUP($F159,'DANE - TERC'!$D$6:$P$119,12,0)","v":"GM-W"},{"$f":"VLOOKUP($F159,'DANE - K1 lit.A'!$D$6:$M$119,4,0)","v":"TAK"},{"$f":"VLOOKUP($F159,'DANE - K1 lit.A'!$D$6:$M$119,5,0)","v":"TAK"},{"$f":"VLOOKUP($F159,'DANE - K1 lit.A'!$D$6:$M$119,6,0)","v":"NIE"},{"$f":"IF($E159=\"\",\"\",VLOOKUP($F159,'DANE - K4 lit.B'!$D$6:$E$107,2,0))","v":"NIE"},{"$f":"IF($E159=\"\",\"\",VLOOKUP($F159,'DANE - K2 lit.C'!$B$14:$I$114,8,0))","v":"w przedziale od 30 do 50 minut"},null,0.7,{"$f":"IF($D159=Buski[[#Headers],[Buski]],VLOOKUP($E159,Buski[Buski],1,0),IF($D159=Jędrzejowski[[#Headers],[Jędrzejowski]],VLOOKUP($E159,Jędrzejowski[Jędrzejowski],1,0),IF($D159=Kazimierski[[#Headers],[Kazimierski]],VLOOKUP($E159,Kazimierski[Kazimierski],1,0),IF($D159=Kielecki[[#Headers],[Kielecki]],VLOOKUP($E159,Kielecki[Kielecki],1,0),IF($D159=Konecki[[#Headers],[Konecki]],VLOOKUP($E159,Konecki[Konecki],1,0),IF($D159=Opatowski[[#Headers],[Opatowski]],VLOOKUP($E159,Opatowski[Opatowski],1,0),IF($D159=Ostrowiecki[[#Headers],[Ostrowiecki]],VLOOKUP($E159,Ostrowiecki[Ostrowiecki],1,0),IF($D159=Pińczowski[[#Headers],[Pińczowski]],VLOOKUP($E159,Pińczowski[Pińczowski],1,0),IF($D159=Sandomierski[[#Headers],[Sandomierski]],VLOOKUP($E159,Sandomierski[Sandomierski],1,0),IF($D159=Skarżyski[[#Headers],[Skarżyski]],VLOOKUP($E159,Skarżyski[Skarżyski],1,0),IF($D159=Starachowicki[[#Headers],[Starachowicki]],VLOOKUP($E159,Starachowicki[Starachowicki],1,0),IF($D159=Staszowski[[#Headers],[Staszowski]],VLOOKUP($E159,Staszowski[Staszowski],1,0),IF($D159=Włoszczowski[[#Headers],[Włoszczowski]],VLOOKUP($E159,Włoszczowski[Włoszczowski],1,0),\"\")))))))))))))","v":"Włoszczowa"},"włoszczowski"]
[]
[]
[]
[null,null,null,"Rodzaj","jednoroczne","wieloletnie",null,"obszar wiejski",null,null,null,"utrata funkcji","miasto"]
[null,null,null,"jednoroczne",2026,2026,null,"TAK - odcinek przebiega W CAŁOŚCI na obszarze wiejskim",null,null,null,"TAK - odcinek drogi PRZEBIEGA w granicach administracyjnych jednego z miast ujętych w Pakiecie dla średnich miast uznanych za zagrożone utratą funkcji społeczno-gospodarczych","Busko-Zdrój"]
[null,null,null,"wieloletnie",2027,2027,null,"TAK - odcinek przebiega W CZĘŚCI na obszarze wiejskim",null,null,null,"NIE - odcinek drogi NIE PRZEBIEGA w granicach administracyjnych jednego z miast ujętych w Pakiecie dla średnich miast uznanych za zagrożone utratą funkcji społeczno-gospodarczych","Jędrzejów"]
[null,null,null,null,null,2028,null,"NIE - odcinek NIE PRZEBIEGA przez obszar wiejski",null,null,null,null,"Końskie"]
[null,null,null,null,null,2029,null,null,null,null,null,null,"Ostrowiec Świętokrzyski"]
[null,null,null,null,null,2030,null,null,null,null,null,null,"Sandomierz"]
[null,null,null,null,null,null,null,null,null,null,null,null,"Skarżysko-Kamienna"]
[null,null,null,null,null,null,null,null,null,null,null,null,"Starachowice"]
[null,null,null,"miesiąca","miesiąc",null,null,null,null,null,null,null,"Staszów"]
[null,null,null,"stycznia","styczeń"]
[null,null,null,"lutego","luty"]
[null,null,null,"marca","marzec"]
[null,null,null,"kwietnia","kwiecień"]
[null,null,null,"maja","maj"]
[null,null,null,"czerwca","czerwiec"]
[null,null,null,"lipca","lipiec"]
[null,null,null,"sierpnia","sierpień"]
[null,null,null,"września","wrzesień"]
[null,null,null,"października","październik"]
[null,null,null,"listopada","listopad"]
[null,null,null,"grudnia","grudzień"]

{"sheet":"DANE - TERC","index":4,"n_rows":119,"n_cols":16,"rows_kept":119,"cut":false,"hidden":false,"merged":[[3,8,3,11],[3,4,3,7],[1,1,1,10],[3,12,3,15]]}
[null,"DANE DO WNIOSKU","2025-01-01"]
[null,"Numery Teryt/TERC jednostek samorządu terytorialnego województwa świętokrzyskiego"]
[]
[null,null,null,null,2023,null,null,null,2024,null,null,null,2024]
[null,"powiat","gmina","JST","Teryt\nTERC","typ JST","SKRÓT - typ JST","uwagi","Teryt\nTERC","typ JST","SKRÓT - typ JST","uwagi","Teryt\nTERC","typ JST","SKRÓT - typ JST","uwagi"]
[null,"buski",null,"powiat buski",2601,"powiat ziemski","PZ","",2601,"powiat ziemski","PZ","",2601,"powiat ziemski","PZ",""]
[null,"jędrzejowski",null,"powiat jędrzejowski",2602,"powiat ziemski","PZ","",2602,"powiat ziemski","PZ","",2602,"powiat ziemski","PZ"]
[null,"kazimierski",null,"powiat kazimierski",2603,"powiat ziemski","PZ","",2603,"powiat ziemski","PZ","",2603,"powiat ziemski","PZ",""]
[null,"kielecki",null,"powiat kielecki",2604,"powiat ziemski","PZ","",2604,"powiat ziemski","PZ","",2604,"powiat ziemski","PZ",""]
[null,"konecki",null,"powiat konecki",2605,"powiat ziemski","PZ","",2605,"powiat ziemski","PZ","",2605,"powiat ziemski","PZ",""]
[null,"opatowski",null,"powiat opatowski",2606,"powiat ziemski","PZ","",2606,"powiat ziemski","PZ","",2606,"powiat ziemski","PZ",""]
[null,"ostrowiecki",null,"powiat ostrowiecki",2607,"powiat ziemski","PZ","",2607,"powiat ziemski","PZ","",2607,"powiat ziemski","PZ",""]
[null,"pińczowski",null,"powiat pińczowski",2608,"powiat ziemski","PZ","",2608,"powiat ziemski","PZ","",2608,"powiat ziemski","PZ",""]
[null,"sandomierski",null,"powiat sandomierski",2609,"powiat ziemski","PZ","",2609,"powiat ziemski","PZ","",2609,"powiat ziemski","PZ",""]
[null,"skarżyski",null,"powiat skarżyski",2610,"powiat ziemski","PZ","",2610,"powiat ziemski","PZ","",2610,"powiat ziemski","PZ",""]
[null,"starachowicki",null,"powiat starachowicki",2611,"powiat ziemski","PZ","",2611,"powiat ziemski","PZ","",2611,"powiat ziemski","PZ",""]
[null,"staszowski",null,"powiat staszowski",2612,"powiat ziemski","PZ","",2612,"powiat ziemski","PZ","",2612,"powiat ziemski","PZ",""]
[null,"włoszczowski",null,"powiat włoszczowski",2613,"powiat ziemski","PZ","",2613,"powiat ziemski","PZ","",2613,"powiat ziemski","PZ",""]
[null,"buski","Busko-Zdrój","gmina Busko-Zdrój",2601013,"gmina miejsko-wiejska","GM-W","",2601013,"gmina miejsko-wiejska","GM-W","",2601013,"gmina miejsko-wiejska","GM-W",""]
[null,"buski","Gnojno","gmina Gnojno",2601022,"gmina wiejska","GW","",2601022,"gmina wiejska","GW","",2601022,"gmina wiejska","GW",""]
[null,"buski","Nowy Korczyn","gmina Nowy Korczyn",2601033,"gmina miejsko-wiejska","GM-W","",2601033,"gmina miejsko-wiejska","GM-W","",2601033,"gmina miejsko-wiejska","GM-W",""]
[null,"buski","Pacanów","gmina Pacanów",2601043,"gmina miejsko-wiejska","GM-W","",2601043,"gmina miejsko-wiejska","GM-W","",2601043,"gmina miejsko-wiejska","GM-W",""]
[null,"buski","Solec-Zdrój","gmina Solec-Zdrój",2601052,"gmina wiejska","GW","",2601052,"gmina wiejska","GW","",2601052,"gmina wiejska","GW",""]
[null,"buski","Stopnica","gmina Stopnica",2601063,"gmina miejsko-wiejska","GM-W","",2601063,"gmina miejsko-wiejska","GM-W","",2601063,"gmina miejsko-wiejska","GM-W",""]
[null,"buski","Tuczępy","gmina Tuczępy",2601072,"gmina wiejska","GW","",2601072,"gmina wiejska","GW","",2601072,"gmina wiejska","GW",""]
[null,"buski","Wiślica","gmina Wiślica",2601083,"gmina miejsko-wiejska","GM-W","",2601083,"gmina miejsko-wiejska","GM-W","",2601083,"gmina miejsko-wiejska","GM-W",""]
[null,"jędrzejowski","Imielno","gmina Imielno",2602012,"gmina wiejska","GW","",2602012,"gmina wiejska","GW","",2602012,"gmina wiejska","GW",""]
[null,"jędrzejowski","Jędrzejów","gmina Jędrzejów",2602023,"gmina miejsko-wiejska","GM-W","",2602023,"gmina miejsko-wiejska","GM-W","",2602023,"gmina miejsko-wiejska","GM-W",""]
[null,"jędrzejowski","Małogoszcz","gmina Małogoszcz",2602033,"gmina miejsko-wiejska","GM-W","",2602033,"gmina miejsko-wiejska","GM-W","",2602033,"gmina miejsko-wiejska","GM-W",""]
[null,"jędrzejowski","Nagłowice","gmina Nagłowice",2602042,"gmina wiejska","GW","",2602042,"gmina wiejska","GW","",2602042,"gmina wiejska","GW",""]
[null,"jędrzejowski","Oksa","gmina Oksa",2602052,"gmina wiejska","GW","",2602052,"gmina wiejska","GW","",2602052,"gmina wiejska","GW",""]
[null,"jędrzejowski","Sędziszów","gmina Sędziszów",2602063,"gmina miejsko-wiejska","GM-W","",2602063,"gmina miejsko-wiejska","GM-W","",2602063,"gmina miejsko-wiejska","GM-W",""]
[null,"jędrzejowski","Słupia (Jędrzejowska)","gmina Słupia (Jędrzejowska)",2602072,"gmina wiejska","GW","",2602072,"gmina wiejska","GW","",2602072,"gmina wiejska","GW",""]
[null,"jędrzejowski","Sobków","gmina Sobków",2602082,"gmina wiejska","GW","",2602082,"gmina wiejska","GW","będzie zmiana od 2025 roku na 2602083",2602083,"gmina miejsko-wiejska","GM-W","zmiana od 2025 roku  (2602082 >> 2602083)"]
[null,"jędrzejowski","Wodzisław","gmina Wodzisław",2602093,"gmina miejsko-wiejska","GM-W","",2602093,"gmina miejsko-wiejska","GM-W","",2602093,"gmina miejsko-wiejska","GM-W",""]
[null,"kazimierski","Bejsce","gmina Bejsce",2603012,"gmina wiejska","GW","",2603012,"gmina wiejska","GW","",2603012,"gmina wiejska","GW",""]
[null,"kazimierski","Czarnocin","gmina Czarnocin",2603022,"gmina wiejska","GW","",2603022,"gmina wiejska","GW","",2603022,"gmina wiejska","GW",""]
[null,"kazimierski","Kazimierza Wielka","gmina Kazimierza Wielka",2603033,"gmina miejsko-wiejska","GM-W","",2603033,"gmina miejsko-wiejska","GM-W","",2603033,"gmina miejsko-wiejska","GM-W",""]
[null,"kazimierski","Opatowiec","gmina Opatowiec",2603043,"gmina miejsko-wiejska","GM-W","",2603043,"gmina miejsko-wiejska","GM-W","",2603043,"gmina miejsko-wiejska","GM-W",""]
[null,"kazimierski","Skalbmierz","gmina Skalbmierz",2603053,"gmina miejsko-wiejska","GM-W","",2603053,"gmina miejsko-wiejska","GM-W","",2603053,"gmina miejsko-wiejska","GM-W",""]
[null,"kielecki","Bieliny","gmina Bieliny",2604012,"gmina wiejska","GW","",2604012,"gmina wiejska","GW","",2604012,"gmina wiejska","GW",""]
[null,"kielecki","Bodzentyn","gmina Bodzentyn",2604023,"gmina miejsko-wiejska","GM-W","",2604023,"gmina miejsko-wiejska","GM-W","",2604023,"gmina miejsko-wiejska","GM-W",""]
[null,"kielecki","Chęciny","gmina Chęciny",2604033,"gmina miejsko-wiejska","GM-W","",2604033,"gmina miejsko-wiejska","GM-W","",2604033,"gmina miejsko-wiejska","GM-W",""]
[null,"kielecki","Chmielnik","gmina Chmielnik",2604043,"gmina miejsko-wiejska","GM-W","",2604043,"gmina miejsko-wiejska","GM-W","",2604043,"gmina miejsko-wiejska","GM-W",""]
[null,"kielecki","Daleszyce","gmina Daleszyce",2604053,"gmina miejsko-wiejska","GM-W","",2604053,"gmina miejsko-wiejska","GM-W","",2604053,"gmina miejsko-wiejska","GM-W",""]
[null,"kielecki","Górno","gmina Górno",2604062,"gmina wiejska","GW","",2604062,"gmina wiejska","GW","",2604062,"gmina wiejska","GW",""]
[null,"kielecki","Łagów","gmina Łagów",2604073,"gmina miejsko-wiejska","GM-W","",2604073,"gmina miejsko-wiejska","GM-W","",2604073,"gmina miejsko-wiejska","GM-W",""]
[null,"kielecki","Łopuszno","gmina Łopuszno",2604082,"gmina wiejska","GW","zmiana od 2023 \n(stary teryt 2604082 - gmina wiejska; \n nowy teryt 2604083 - gmina miejsko-wiejska) \nZMIANA NIE ZOSTAŁA UWZGLĘDNIONA na listach z 2023 oraz na liście z 2024",2604083,"gmina miejsko-wiejska","GM-W","zmiana od 2023 \n(stary teryt 2604082 - gmina wiejska; \n nowy teryt 2604083 - gmina miejsko-wiejska) \nZMIANA NIE ZOSTAŁA UWZGLĘDNIONA na listach z 2023 oraz na liście z 2024",2604083,"gmina miejsko-wiejska","GM-W"]
[null,"kielecki","Masłów","gmina Masłów",2604092,"gmina wiejska","GW","",2604092,"gmina wiejska","GW","",2604092,"gmina wiejska","GW"]
[null,"kielecki","Miedziana Góra","gmina Miedziana Góra",2604102,"gmina wiejska","GW","",2604102,"gmina wiejska","GW","",2604102,"gmina wiejska","GW"]
[null,"kielecki","Mniów","gmina Mniów",2604112,"gmina wiejska","GW","",2604112,"gmina wiejska","GW","",2604112,"gmina wiejska","GW"]
[null,"kielecki","Morawica","gmina Morawica",2604123,"gmina miejsko-wiejska","GM-W","",2604123,"gmina miejsko-wiejska","GM-W","",2604123,"gmina miejsko-wiejska","GM-W"]
[null,"kielecki","Nowa Słupia","gmina Nowa Słupia",2604133,"gmina miejsko-wiejska","GM-W","",2604133,"gmina miejsko-wiejska","GM-W","",2604133,"gmina miejsko-wiejska","GM-W"]
[null,"kielecki","Nowiny","gmina Nowiny",2604172,"gmina wiejska","GW","",2604172,"gmina wiejska","GW","",2604172,"gmina wiejska","GW"]
[null,"kielecki","Piekoszów","gmina Piekoszów",2604142,"gmina wiejska","GW","zmiana od 2023 \n(stary teryt 2604142 - gmina wiejska; \n nowy teryt 2604143 - gmina miejsko-wiejska) \nZMIANA NIE ZOSTAŁA UWZGLĘDNIONA na listach z 2023 oraz na liście z 2024",2604143,"gmina miejsko-wiejska","GM-W","zmiana od 2023 \n(stary teryt 2604142 - gmina wiejska; \n nowy teryt 2604143 - gmina miejsko-wiejska) \nZMIANA NIE ZOSTAŁA UWZGLĘDNIONA na listach z 2023 oraz na liście z 2024",2604143,"gmina miejsko-wiejska","GM-W"]
[null,"kielecki","Pierzchnica","gmina Pierzchnica",2604153,"gmina miejsko-wiejska","GM-W","",2604153,"gmina miejsko-wiejska","GM-W","",2604153,"gmina miejsko-wiejska","GM-W"]
[null,"kielecki","Raków","gmina Raków",2604162,"gmina wiejska","GW","",2604162,"gmina wiejska","GW","",2604162,"gmina wiejska","GW"]
[null,"kielecki","Strawczyn","gmina Strawczyn",2604182,"gmina wiejska","GW","",2604182,"gmina wiejska","GW","",2604182,"gmina wiejska","GW"]
[null,"kielecki","Zagnańsk","gmina Zagnańsk",2604192,"gmina wiejska","GW","",2604192,"gmina wiejska","GW","",2604192,"gmina wiejska","GW"]
[null,"konecki","Fałków","gmina Fałków",2605012,"gmina wiejska","GW","",2605012,"gmina wiejska","GW","",2605012,"gmina wiejska","GW"]
[null,"konecki","Gowarczów","gmina Gowarczów",2605022,"gmina wiejska","GW","będzie zmiana od 2024",2605023,"gmina miejsko-wiejska","GM-W","zmiana od 2024 \n(stary teryt 2605022 - gmina wiejska;\nnowy teryt 2605022 - gmina miejsko-wiejska) \nZMIANA NIE ZOSTAŁA UWZGLĘDNIONA na liście z 2024",2605023,"gmina miejsko-wiejska","GM-W"]
[null,"konecki","Końskie","gmina Końskie",2605033,"gmina miejsko-wiejska","GM-W","",2605033,"gmina miejsko-wiejska","GM-W","",2605033,"gmina miejsko-wiejska","GM-W"]
[null,"konecki","Radoszyce","gmina Radoszyce",2605043,"gmina miejsko-wiejska","GM-W","",2605043,"gmina miejsko-wiejska","GM-W","",2605043,"gmina miejsko-wiejska","GM-W"]
[null,"konecki","Ruda Maleniecka","gmina Ruda Maleniecka",2605052,"gmina wiejska","GW","",2605052,"gmina wiejska","GW","",2605052,"gmina wiejska","GW"]
[null,"konecki","Słupia Konecka","gmina Słupia Konecka",2605062,"gmina wiejska","GW","",2605062,"gmina wiejska","GW","",2605062,"gmina wiejska","GW"]
[null,"konecki","Smyków","gmina Smyków",2605072,"gmina wiejska","GW","",2605072,"gmina wiejska","GW","",2605072,"gmina wiejska","GW"]
[null,"konecki","Stąporków","gmina Stąporków",2605083,"gmina miejsko-wiejska","GM-W","",2605083,"gmina miejsko-wiejska","GM-W","",2605083,"gmina miejsko-wiejska","GM-W"]
[null,"opatowski","Baćkowice","gmina Baćkowice",2606012,"gmina wiejska","GW","",2606012,"gmina wiejska","GW","",2606012,"gmina wiejska","GW"]
[null,"opatowski","Iwaniska","gmina Iwaniska",2606022,"gmina wiejska","GW","zmiana od 2022 (stary teryt 2606022) \n(stary teryt 2606022 - gmina wiejska; \n nowy teryt 2606023 - gmina miejsko-wiejska) \nZMIANA NIE ZOSTAŁA UWZGLĘDNIONA na listach z 2022 i 2023 oraz na liście z 2024 \n\nZmiana nie została również uwzględniona w załączniku dowiadomości e-mail z MI z dnia 27.10.2022 dotyczącej dochodów podatkowych RFRD 2023",2606023,"gmina miejsko-wiejska","GM-W","zmiana od 2022 \n(stary teryt 2606022 - gmina wiejska; \n nowy teryt 2606023 - gmina miejsko-wiejska) \nZMIANA NIE ZOSTAŁA UWZGLĘDNIONA na listach z 2022 i 2023 oraz na liście z 2024\n\nZmiana nie została również uwzględniona w załączniku do widomości e-mail z MI z dnia 27.10.2022 dotyczącego dochodów podatkowych RFRD 2023",2606023,"gmina miejsko-wiejska","GM-W"]
[null,"opatowski","Lipnik","gmina Lipnik",2606032,"gmina wiejska","GW","",2606032,"gmina wiejska","GW","",2606032,"gmina wiejska","GW"]
[null,"opatowski","Opatów","gmina Opatów",2606043,"gmina miejsko-wiejska","GM-W","",2606043,"gmina miejsko-wiejska","GM-W","",2606043,"gmina miejsko-wiejska","GM-W"]
[null,"opatowski","Ożarów","gmina Ożarów",2606053,"gmina miejsko-wiejska","GM-W","",2606053,"gmina miejsko-wiejska","GM-W","",2606053,"gmina miejsko-wiejska","GM-W"]
[null,"opatowski","Sadowie","gmina Sadowie",2606062,"gmina wiejska","GW","",2606062,"gmina wiejska","GW","",2606062,"gmina wiejska","GW"]
[null,"opatowski","Tarłów","gmina Tarłów",2606072,"gmina wiejska","GW","",2606072,"gmina wiejska","GW","",2606072,"gmina wiejska","GW"]
[null,"opatowski","Wojciechowice","gmina Wojciechowice",2606082,"gmina wiejska","GW","",2606082,"gmina wiejska","GW","",2606082,"gmina wiejska","GW"]
[null,"ostrowiecki","Bałtów","gmina Bałtów",2607022,"gmina wiejska","GW","",2607022,"gmina wiejska","GW","",2607022,"gmina wiejska","GW"]
[null,"ostrowiecki","Bodzechów","gmina Bodzechów",2607032,"gmina wiejska","GW","",2607032,"gmina wiejska","GW","",2607032,"gmina wiejska","GW"]
[null,"ostrowiecki","Ćmielów","gmina Ćmielów",2607043,"gmina miejsko-wiejska","GM-W","",2607043,"gmina miejsko-wiejska","GM-W","",2607043,"gmina miejsko-wiejska","GM-W"]
[null,"ostrowiecki","Kunów","gmina Kunów",2607053,"gmina miejsko-wiejska","GM-W","",2607053,"gmina miejsko-wiejska","GM-W","",2607053,"gmina miejsko-wiejska","GM-W"]
[null,"ostrowiecki","Ostrowiec Świętokrzyski","gmina Ostrowiec Świętokrzyski",2607011,"gmina miejska","GM","",2607011,"gmina miejska","GM","",2607011,"gmina miejska","GM"]
[null,"ostrowiecki","Waśniów","gmina Waśniów",2607062,"gmina wiejska","GW","",2607062,"gmina wiejska","GW","",2607062,"gmina wiejska","GW"]
[null,"pińczowski","Działoszyce","gmina Działoszyce",2608013,"gmina miejsko-wiejska","GM-W","",2608013,"gmina miejsko-wiejska","GM-W","",2608013,"gmina miejsko-wiejska","GM-W"]
[null,"pińczowski","Kije","gmina Kije",2608022,"gmina wiejska","GW","",2608022,"gmina wiejska","GW","",2608022,"gmina wiejska","GW"]
[null,"pińczowski","Michałów","gmina Michałów",2608032,"gmina wiejska","GW","",2608032,"gmina wiejska","GW","",2608032,"gmina wiejska","GW"]
[null,"pińczowski","Pińczów","gmina Pińczów",2608043,"gmina miejsko-wiejska","GM-W","",2608043,"gmina miejsko-wiejska","GM-W","",2608043,"gmina miejsko-wiejska","GM-W"]
[null,"pińczowski","Złota","gmina Złota",2608052,"gmina wiejska","GW","",2608052,"gmina wiejska","GW","",2608052,"gmina wiejska","GW"]
[null,"sandomierski","Dwikozy","gmina Dwikozy",2609022,"gmina wiejska","GW","",2609022,"gmina wiejska","GW","",2609022,"gmina wiejska","GW"]
[null,"sandomierski","Klimontów","gmina Klimontów",2609033,"gmina miejsko-wiejska","GM-W","",2609033,"gmina miejsko-wiejska","GM-W","",2609033,"gmina miejsko-wiejska","GM-W"]
[null,"sandomierski","Koprzywnica","gmina Koprzywnica",2609043,"gmina miejsko-wiejska","GM-W","",2609043,"gmina miejsko-wiejska","GM-W","",2609043,"gmina miejsko-wiejska","GM-W"]
[null,"sandomierski","Łoniów","gmina Łoniów",2609052,"gmina wiejska","GW","",2609052,"gmina wiejska","GW","",2609052,"gmina wiejska","GW"]
[null,"sandomierski","Obrazów","gmina Obrazów",2609062,"gmina wiejska","GW","",2609062,"gmina wiejska","GW","",2609062,"gmina wiejska","GW",""]
[null,"sandomierski","Samborzec","gmina Samborzec",2609072,"gmina wiejska","GW","",2609072,"gmina wiejska","GW","",2609072,"gmina wiejska","GW",""]
[null,"sandomierski","Sandomierz","gmina Sandomierz",2609011,"gmina miejska","GM","",2609011,"gmina miejska","GM","",2609011,"gmina miejska","GM",""]
[null,"sandomierski","Wilczyce","gmina Wilczyce",2609082,"gmina wiejska","GW","",2609082,"gmina wiejska","GW","",2609082,"gmina wiejska","GW",""]
[null,"sandomierski","Zawichost","gmina Zawichost",2609093,"gmina miejsko-wiejska","GM-W","",2609093,"gmina miejsko-wiejska","GM-W","",2609093,"gmina miejsko-wiejska","GM-W",""]
[null,"skarżyski","Bliżyn","gmina Bliżyn",2610022,"gmina wiejska","GW","",2610022,"gmina wiejska","GW","",2610022,"gmina wiejska","GW",""]
[null,"skarżyski","Łączna","gmina Łączna",2610032,"gmina wiejska","GW","",2610032,"gmina wiejska","GW","",2610032,"gmina wiejska","GW",""]
[null,"skarżyski","Skarżysko-Kamienna","gmina Skarżysko-Kamienna",2610011,"gmina miejska","GM","",2610011,"gmina miejska","GM","",2610011,"gmina miejska","GM",""]
[null,"skarżyski","Skarżysko Kościelne","gmina Skarżysko Kościelne",2610042,"gmina wiejska","GW","",2610042,"gmina wiejska","GW","",2610042,"gmina wiejska","GW",""]
[null,"skarżyski","Suchedniów","gmina Suchedniów",2610053,"gmina miejsko-wiejska","GM-W","",2610053,"gmina miejsko-wiejska","GM-W","",2610053,"gmina miejsko-wiejska","GM-W",""]
[null,"starachowicki","Brody","gmina Brody",2611022,"gmina wiejska","GW","",2611022,"gmina wiejska","GW","",2611022,"gmina wiejska","GW",""]
[null,"starachowicki","Mirzec","gmina Mirzec",2611032,"gmina wiejska","GW","",2611032,"gmina wiejska","GW","",2611032,"gmina wiejska","GW",""]
[null,"starachowicki","Pawłów","gmina Pawłów",2611042,"gmina wiejska","GW","",2611042,"gmina wiejska","GW","",2611042,"gmina wiejska","GW"]
[null,"starachowicki","Starachowice","gmina Starachowice",2611011,"gmina miejska","GM","",2611011,"gmina miejska","GM","",2611011,"gmina miejska","GM"]
[null,"starachowicki","Wąchock","gmina Wąchock",2611053,"gmina miejsko-wiejska","GM-W","",2611053,"gmina miejsko-wiejska","GM-W","",2611053,"gmina miejsko-wiejska","GM-W"]
[null,"staszowski","Bogoria","gmina Bogoria",2612012,"gmina wiejska","GW","będzie zmiana od 2024",2612013,"gmina miejsko-wiejska","GM-W","zmiana od 2024 \n(stary teryt 2612012 - gmina wiejska;\nnowy teryt 2612013 - gmina miejsko-wiejska) \nZMIANA NIE ZOSTAŁA UWZGLĘDNIONA na liście z 2024",2612013,"gmina miejsko-wiejska","GM-W"]
[null,"staszowski","Łubnice","gmina Łubnice",2612022,"gmina wiejska","GW","",2612022,"gmina wiejska","GW","",2612022,"gmina wiejska","GW"]
[null,"staszowski","Oleśnica","gmina Oleśnica",2612033,"gmina miejsko-wiejska","GM-W","",2612033,"gmina miejsko-wiejska","GM-W","",2612033,"gmina miejsko-wiejska","GM-W"]
[null,"staszowski","Osiek","gmina Osiek",2612043,"gmina miejsko-wiejska","GM-W","",2612043,"gmina miejsko-wiejska","GM-W","",2612043,"gmina miejsko-wiejska","GM-W"]
[null,"staszowski","Połaniec","gmina Połaniec",2612053,"gmina miejsko-wiejska","GM-W","",2612053,"gmina miejsko-wiejska","GM-W","",2612053,"gmina miejsko-wiejska","GM-W",""]
[null,"staszowski","Rytwiany","gmina Rytwiany",2612062,"gmina wiejska","GW","",2612062,"gmina wiejska","GW","",2612062,"gmina wiejska","GW",""]
[null,"staszowski","Staszów","gmina Staszów",2612073,"gmina miejsko-wiejska","GM-W","",2612073,"gmina miejsko-wiejska","GM-W","",2612073,"gmina miejsko-wiejska","GM-W",""]
[null,"staszowski","Szydłów","gmina Szydłów",2612083,"gmina miejsko-wiejska","GM-W","",2612083,"gmina miejsko-wiejska","GM-W","",2612083,"gmina miejsko-wiejska","GM-W",""]
[null,"włoszczowski","Kluczewsko","gmina Kluczewsko",2613012,"gmina wiejska","GW","",2613012,"gmina wiejska","GW","",2613012,"gmina wiejska","GW",""]
[null,"włoszczowski","Krasocin","gmina Krasocin",2613022,"gmina wiejska","GW","",2613022,"gmina wiejska","GW","",2613022,"gmina wiejska","GW",""]
[null,"włoszczowski","Moskorzew","gmina Moskorzew",2613032,"gmina wiejska","GW","",2613032,"gmina wiejska","GW","",2613032,"gmina wiejska","GW",""]
[null,"włoszczowski","Radków","gmina Radków",2613042,"gmina wiejska","GW","",2613042,"gmina wiejska","GW","",2613042,"gmina wiejska","GW",""]
[null,"włoszczowski","Secemin","gmina Secemin",2613052,"gmina wiejska","GW","",2613052,"gmina wiejska","GW","",2613052,"gmina wiejska","GW",""]
[null,"włoszczowski","Włoszczowa","gmina Włoszczowa",2613063,"gmina miejsko-wiejska","GM-W","",2613063,"gmina miejsko-wiejska","GM-W","",2613063,"gmina miejsko-wiejska","GM-W",""]

{"sheet":"DANE - K1 lit.A","index":5,"n_rows":119,"n_cols":13,"rows_kept":119,"cut":false,"hidden":false,"merged":[[1,1,1,3],[3,4,3,5]]}
[null,"DANE DO WNIOSKU",null,"2024-12-31"]
[null,"Kryterium 1 lit. A — Ryzyko wypadków"]
[]
[null,null,null,null,2025]
[null,"powiat","gmina","JST","Teryt\nTERC","SKRÓT - typ JST","Ryzyko wypadków drogowych z udziałem pieszych na 100 tys. ludności","Ryzyko wypadków drogowych ogółem na 100 tys. ludności","Ryzyko ofiar śmiertelnych na 100 tys. ludności","Liczba przyznanych punktów - wypadki drogowe z udziałem pieszych na 100 tys. ludności","Liczba przyznanych punktów - wypadki drogowe ogółem na 100 tys. ludności","Liczba przyznanych punktów - ofiary śmiertelne na 100 tys. ludności","Łączna liczba przyznanych punktów \nw kryterium 1"]
[null,"buski",null,"powiat buski",2601,"PZ","NIE","NIE","NIE",0,0,0,0]
[null,"jędrzejowski",null,"powiat jędrzejowski",2602,"PZ","TAK","TAK","NIE",2,1,0,3]
[null,"kazimierski",null,"powiat kazimierski",2603,"PZ","TAK","NIE","TAK",2,0,1,3]
[null,"kielecki",null,"powiat kielecki",2604,"PZ","TAK","TAK","TAK",2,1,1,4]
[null,"konecki",null,"powiat konecki",2605,"PZ","TAK","NIE","TAK",2,0,1,3]
[null,"opatowski",null,"powiat opatowski",2606,"PZ","NIE","NIE","TAK",0,0,1,1]
[null,"ostrowiecki",null,"powiat ostrowiecki",2607,"PZ","NIE","NIE","NIE",0,0,0,0]
[null,"pińczowski",null,"powiat pińczowski",2608,"PZ","NIE","TAK","NIE",0,1,0,1]
[null,"sandomierski",null,"powiat sandomierski",2609,"PZ","TAK","TAK","NIE",2,1,0,3]
[null,"skarżyski",null,"powiat skarżyski",2610,"PZ","TAK","TAK","NIE",2,1,0,3]
[null,"starachowicki",null,"powiat starachowicki",2611,"PZ","NIE","NIE","NIE",0,0,0,0]
[null,"staszowski",null,"powiat staszowski",2612,"PZ","NIE","NIE","TAK",0,0,1,1]
[null,"włoszczowski",null,"powiat włoszczowski",2613,"PZ","NIE","TAK","TAK",0,1,1,2]
[null,"buski","Busko-Zdrój","gmina Busko-Zdrój",2601013,"GM-W","TAK","NIE","NIE",2,0,0,2]
[null,"buski","Gnojno","gmina Gnojno",2601022,"GW","NIE","NIE","NIE",0,0,0,0]
[null,"buski","Nowy Korczyn","gmina Nowy Korczyn",2601033,"GM-W","TAK","TAK","NIE",2,1,0,3]
[null,"buski","Pacanów","gmina Pacanów",2601043,"GM-W","NIE","NIE","NIE",0,0,0,0]
[null,"buski","Solec-Zdrój","gmina Solec-Zdrój",2601052,"GW","TAK","TAK","NIE",2,1,0,3]
[null,"buski","Stopnica","gmina Stopnica",2601063,"GM-W","NIE","NIE","NIE",0,0,0,0]
[null,"buski","Tuczępy","gmina Tuczępy",2601072,"GW","NIE","NIE","NIE",0,0,0,0]
[null,"buski","Wiślica","gmina Wiślica",2601083,"GM-W","NIE","TAK","NIE",0,1,0,1]
[null,"jędrzejowski","Imielno","gmina Imielno",2602012,"GW","NIE","NIE","NIE",0,0,0,0]
[null,"jędrzejowski","Jędrzejów","gmina Jędrzejów",2602023,"GM-W","TAK","TAK","TAK",2,1,1,4]
[null,"jędrzejowski","Małogoszcz","gmina Małogoszcz",2602033,"GM-W","TAK","TAK","TAK",2,1,1,4]
[null,"jędrzejowski","Nagłowice","gmina Nagłowice",2602042,"GW","NIE","TAK","NIE",0,1,0,1]
[null,"jędrzejowski","Oksa","gmina Oksa",2602052,"GW","NIE","NIE","NIE",0,0,0,0]
[null,"jędrzejowski","Sędziszów","gmina Sędziszów",2602063,"GM-W","TAK","TAK","TAK",2,1,1,4]
[null,"jędrzejowski","Słupia (Jędrzejowska)","gmina Słupia (Jędrzejowska)",2602072,"GW","NIE","NIE","NIE",0,0,0,0]
[null,"jędrzejowski","Sobków","gmina Sobków",2602083,"GM-W","TAK","TAK","TAK",2,1,1,4]
[null,"jędrzejowski","Wodzisław","gmina Wodzisław",2602093,"GM-W","TAK","TAK","NIE",2,1,0,3]
[null,"kazimierski","Bejsce","gmina Bejsce",2603012,"GW","NIE","NIE","NIE",0,0,0,0]
[null,"kazimierski","Czarnocin","gmina Czarnocin",2603022,"GW","NIE","NIE","NIE",0,0,0,0]
[null,"kazimierski","Kazimierza Wielka","gmina Kazimierza Wielka",2603033,"GM-W","TAK","TAK","NIE",2,1,0,3]
[null,"kazimierski","Opatowiec","gmina Opatowiec",2603043,"GM-W","NIE","NIE","NIE",0,0,0,0]
[null,"kazimierski","Skalbmierz","gmina Skalbmierz",2603053,"GM-W","TAK","TAK","NIE",2,1,0,3]
[null,"kielecki","Bieliny","gmina Bieliny",2604012,"GW","NIE","TAK","NIE",0,1,0,1]
[null,"kielecki","Bodzentyn","gmina Bodzentyn",2604023,"GM-W","NIE","NIE","TAK",0,0,1,1]
[null,"kielecki","Chęciny","gmina Chęciny",2604033,"GM-W","NIE","TAK","NIE",0,1,0,1]
[null,"kielecki","Chmielnik","gmina Chmielnik",2604043,"GM-W","NIE","TAK","NIE",0,1,0,1]
[null,"kielecki","Daleszyce","gmina Daleszyce",2604053,"GM-W","NIE","TAK","NIE",0,1,0,1]
[null,"kielecki","Górno","gmina Górno",2604062,"GW","TAK","TAK","NIE",2,1,0,3]
[null,"kielecki","Łagów","gmina Łagów",2604073,"GM-W","NIE","NIE","NIE",0,0,0,0]
[null,"kielecki","Łopuszno","gmina Łopuszno",2604083,"GM-W","NIE","NIE","NIE",0,0,0,0]
[null,"kielecki","Masłów","gmina Masłów",2604092,"GW","NIE","NIE","NIE",0,0,0,0]
[null,"kielecki","Miedziana Góra","gmina Miedziana Góra",2604102,"GW","NIE","NIE","NIE",0,0,0,0]
[null,"kielecki","Mniów","gmina Mniów",2604112,"GW","NIE","NIE","NIE",0,0,0,0]
[null,"kielecki","Morawica","gmina Morawica",2604123,"GM-W","NIE","TAK","NIE",0,1,0,1]
[null,"kielecki","Nowa Słupia","gmina Nowa Słupia",2604133,"GM-W","NIE","TAK","TAK",0,1,1,2]
[null,"kielecki","Nowiny","gmina Nowiny",2604172,"GW","TAK","TAK","NIE",2,1,0,3]
[null,"kielecki","Piekoszów","gmina Piekoszów",2604143,"GM-W","NIE","NIE","NIE",0,0,0,0]
[null,"kielecki","Pierzchnica","gmina Pierzchnica",2604153,"GM-W","NIE","TAK","TAK",0,1,1,2]
[null,"kielecki","Raków","gmina Raków",2604162,"GW","NIE","NIE","NIE",0,0,0,0]
[null,"kielecki","Strawczyn","gmina Strawczyn",2604182,"GW","NIE","NIE","NIE",0,0,0,0]
[null,"kielecki","Zagnańsk","gmina Zagnańsk",2604192,"GW","NIE","TAK","NIE",0,1,0,1]
[null,"konecki","Fałków","gmina Fałków",2605012,"GW","TAK","TAK","NIE",2,1,0,3]
[null,"konecki","Gowarczów","gmina Gowarczów",2605023,"GM-W","NIE","NIE","NIE",0,0,0,0]
[null,"konecki","Końskie","gmina Końskie",2605033,"GM-W","TAK","TAK","TAK",2,1,1,4]
[null,"konecki","Radoszyce","gmina Radoszyce",2605043,"GM-W","NIE","NIE","NIE",0,0,0,0]
[null,"konecki","Ruda Maleniecka","gmina Ruda Maleniecka",2605052,"GW","NIE","NIE","NIE",0,0,0,0]
[null,"konecki","Słupia Konecka","gmina Słupia Konecka",2605062,"GW","NIE","NIE","NIE",0,0,0,0]
[null,"konecki","Smyków","gmina Smyków",2605072,"GW","NIE","TAK","NIE",0,1,0,1]
[null,"konecki","Stąporków","gmina Stąporków",2605083,"GM-W","TAK","TAK","TAK",2,1,1,4]
[null,"opatowski","Baćkowice","gmina Baćkowice",2606012,"GW","NIE","NIE","NIE",0,0,0,0]
[null,"opatowski","Iwaniska","gmina Iwaniska",2606023,"GM-W","TAK","NIE","NIE",2,0,0,2]
[null,"opatowski","Lipnik","gmina Lipnik",2606032,"GW","NIE","NIE","NIE",0,0,0,0]
[null,"opatowski","Opatów","gmina Opatów",2606043,"GM-W","TAK","NIE","NIE",2,0,0,2]
[null,"opatowski","Ożarów","gmina Ożarów",2606053,"GM-W","TAK","TAK","NIE",2,1,0,3]
[null,"opatowski","Sadowie","gmina Sadowie",2606062,"GW","NIE","NIE","NIE",0,0,0,0]
[null,"opatowski","Tarłów","gmina Tarłów",2606072,"GW","NIE","TAK","NIE",0,1,0,1]
[null,"opatowski","Wojciechowice","gmina Wojciechowice",2606082,"GW","TAK","TAK","TAK",2,1,1,4]
[null,"ostrowiecki","Bałtów","gmina Bałtów",2607022,"GW","NIE","TAK","NIE",0,1,0,1]
[null,"ostrowiecki","Bodzechów","gmina Bodzechów",2607032,"GW","TAK","TAK","TAK",2,1,1,4]
[null,"ostrowiecki","Ćmielów","gmina Ćmielów",2607043,"GM-W","TAK","TAK","NIE",2,1,0,3]
[null,"ostrowiecki","Kunów","gmina Kunów",2607053,"GM-W","NIE","NIE","NIE",0,0,0,0]
[null,"ostrowiecki","Ostrowiec Świętokrzyski","gmina Ostrowiec Świętokrzyski",2607011,"GM","TAK","NIE","TAK",2,0,1,3]
[null,"ostrowiecki","Waśniów","gmina Waśniów",2607062,"GW","TAK","TAK","TAK",2,1,1,4]
[null,"pińczowski","Działoszyce","gmina Działoszyce",2608013,"GM-W","NIE","NIE","NIE",0,0,0,0]
[null,"pińczowski","Kije","gmina Kije",2608022,"GW","NIE","NIE","NIE",0,0,0,0]
[null,"pińczowski","Michałów","gmina Michałów",2608032,"GW","NIE","TAK","TAK",0,1,1,2]
[null,"pińczowski","Pińczów","gmina Pińczów",2608043,"GM-W","TAK","TAK","TAK",2,1,1,4]
[null,"pińczowski","Złota","gmina Złota",2608052,"GW","NIE","NIE","NIE",0,0,0,0]
[null,"sandomierski","Dwikozy","gmina Dwikozy",2609022,"GW","TAK","TAK","NIE",2,1,0,3]
[null,"sandomierski","Klimontów","gmina Klimontów",2609033,"GM-W","TAK","TAK","NIE",2,1,0,3]
[null,"sandomierski","Koprzywnica","gmina Koprzywnica",2609043,"GM-W","NIE","NIE","TAK",0,0,1,1]
[null,"sandomierski","Łoniów","gmina Łoniów",2609052,"GW","NIE","TAK","NIE",0,1,0,1]
[null,"sandomierski","Obrazów","gmina Obrazów",2609062,"GW","NIE","NIE","NIE",0,0,0,0]
[null,"sandomierski","Samborzec","gmina Samborzec",2609072,"GW","NIE","TAK","NIE",0,1,0,1]
[null,"sandomierski","Sandomierz","gmina Sandomierz",2609011,"GM","TAK","TAK","NIE",2,1,0,3]
[null,"sandomierski","Wilczyce","gmina Wilczyce",2609082,"GW","NIE","NIE","NIE",0,0,0,0]
[null,"sandomierski","Zawichost","gmina Zawichost",2609093,"GM-W","NIE","NIE","NIE",0,0,0,0]
[null,"skarżyski","Bliżyn","gmina Bliżyn",2610022,"GW","NIE","NIE","NIE",0,0,0,0]
[null,"skarżyski","Łączna","gmina Łączna",2610032,"GW","NIE","NIE","NIE",0,0,0,0]
[null,"skarżyski","Skarżysko-Kamienna","gmina Skarżysko-Kamienna",2610011,"GM","TAK","NIE","TAK",2,0,1,3]
[null,"skarżyski","Skarżysko Kościelne","gmina Skarżysko Kościelne",2610042,"GW","NIE","NIE","NIE",0,0,0,0]
[null,"skarżyski","Suchedniów","gmina Suchedniów",2610053,"GM-W","TAK","TAK","NIE",2,1,0,3]
[null,"starachowicki","Brody","gmina Brody",2611022,"GW","TAK","TAK","TAK",2,1,1,4]
[null,"starachowicki","Mirzec","gmina Mirzec",2611032,"GW","NIE","NIE","NIE",0,0,0,0]
[null,"starachowicki","Pawłów","gmina Pawłów",2611042,"GW","TAK","TAK","NIE",2,1,0,3]
[null,"starachowicki","Starachowice","gmina Starachowice",2611011,"GM","TAK","TAK","TAK",2,1,1,4]
[null,"starachowicki","Wąchock","gmina Wąchock",2611053,"GM-W","NIE","NIE","NIE",0,0,0,0]
[null,"staszowski","Bogoria","gmina Bogoria",2612013,"GM-W","NIE","TAK","NIE",0,1,0,1]
[null,"staszowski","Łubnice","gmina Łubnice",2612022,"GW","NIE","NIE","NIE",0,0,0,0]
[null,"staszowski","Oleśnica","gmina Oleśnica",2612033,"GM-W","NIE","TAK","NIE",0,1,0,1]
[null,"staszowski","Osiek","gmina Osiek",2612043,"GM-W","TAK","TAK","TAK",2,1,1,4]
[null,"staszowski","Połaniec","gmina Połaniec",2612053,"GM-W","NIE","NIE","NIE",0,0,0,0]
[null,"staszowski","Rytwiany","gmina Rytwiany",2612062,"GW","NIE","NIE","NIE",0,0,0,0]
[null,"staszowski","Staszów","gmina Staszów",2612073,"GM-W","TAK","TAK","TAK",2,1,1,4]
[null,"staszowski","Szydłów","gmina Szydłów",2612083,"GM-W","NIE","TAK","NIE",0,1,0,1]
[null,"włoszczowski","Kluczewsko","gmina Kluczewsko",2613012,"GW","NIE","NIE","NIE",0,0,0,0]
[null,"włoszczowski","Krasocin","gmina Krasocin",2613022,"GW","NIE","NIE","NIE",0,0,0,0]
[null,"włoszczowski","Moskorzew","gmina Moskorzew",2613032,"GW","TAK","TAK","TAK",2,1,1,4]
[null,"włoszczowski","Radków","gmina Radków",2613042,"GW","NIE","NIE","NIE",0,0,0,0]
[null,"włoszczowski","Secemin","gmina Secemin",2613052,"GW","NIE","NIE","NIE",0,0,0,0]
[null,"włoszczowski","Włoszczowa","gmina Włoszczowa",2613063,"GM-W","TAK","TAK","NIE",2,1,0,3]

{"sheet":"DANE - K2 lit.C","index":6,"n_rows":114,"n_cols":13,"rows_kept":114,"cut":false,"hidden":false,"merged":[[1,11,4,11],[5,11,7,11],[1,12,4,12],[5,12,7,12],[9,2,11,2],[9,4,9,6],[9,8,11,8],[11,4,11,6],[1,2,1,8]]}
[null,null,"DANE DO WNIOSKU",null,null,null,null,null,null,"legenda","20-30",0,"pkt"]
[null,null,"Kryterium nr 2 lit. C — Peryferyjność",null,null,null,null,null,null,null,"30-35",1,"pkt"]
[null,null,null,null,null,null,null,null,null,null,"35-40"]
[null,null,null,null,null,null,null,null,null,null,"40-45"]
[null,null,null,null,null,null,null,null,null,null,"45-50"]
[null,null,null,null,null,null,null,null,null,null,"50-55",2,"pkt"]
[null,null,null,null,null,null,null,null,null,null,"55-60"]
[null,null,null,null,null,null,null,null,null,null,"60-65"]
[]
[null,null,"Gmina",null,"Dostępność czasowa",null,null,null,"Peryferyjność"]
[null,null,null,"Dostępność czasowa","do 30 minut","od 30 minut do 50 minut","powyżej \n50 minut"]
[null,null,null,null,"Liczba przyznanych punktów"]
[null,null,1,2,3,4,5,null,6]
[null,"gmina Baćkowice","Baćkowice","35-40",null,1,null,1,"w przedziale od 30 do 50 minut"]
[null,"gmina Bałtów","Bałtów","60-65",null,null,2,2,"większy niż 50 minut"]
[null,"gmina Bejsce","Bejsce","45-50",null,1,null,1,"w przedziale od 30 do 50 minut"]
[null,"gmina Bieliny","Bieliny","35-40",null,1,null,1,"w przedziale od 30 do 50 minut"]
[null,"gmina Bliżyn","Bliżyn","30-35",null,1,null,1,"w przedziale od 30 do 50 minut"]
[null,"gmina Bodzechów","Bodzechów","50-55",null,null,2,2,"większy niż 50 minut"]
[null,"gmina Bodzentyn","Bodzentyn","35-40",null,1,null,1,"w przedziale od 30 do 50 minut"]
[null,"gmina Bogoria","Bogoria","40-45",null,1,null,1,"w przedziale od 30 do 50 minut"]
[null,"gmina Brody","Brody","45-50",null,1,null,1,"w przedziale od 30 do 50 minut"]
[null,"gmina Busko-Zdrój","Busko-Zdrój","35-40",null,1,null,1,"w przedziale od 30 do 50 minut"]
[null,"gmina Chęciny","Chęciny","20-30",0,null,null,0,"mniejszy niż 30 minut"]
[null,"gmina Chmielnik","Chmielnik","30-35",null,1,null,1,"w przedziale od 30 do 50 minut"]
[null,"gmina Czarnocin","Czarnocin","50-55",null,null,2,2,"większy niż 50 minut"]
[null,"gmina Ćmielów","Ćmielów","50-55",null,null,2,2,"większy niż 50 minut"]
[null,"gmina Daleszyce","Daleszyce","30-35",null,1,null,1,"w przedziale od 30 do 50 minut"]
[null,"gmina Dwikozy","Dwikozy","45-50",null,1,null,1,"w przedziale od 30 do 50 minut"]
[null,"gmina Działoszyce","Działoszyce","45-50",null,1,null,1,"w przedziale od 30 do 50 minut"]
[null,"gmina Fałków","Fałków","45-50",null,1,null,1,"w przedziale od 30 do 50 minut"]
[null,"gmina Gnojno","Gnojno","40-45",null,1,null,1,"w przedziale od 30 do 50 minut"]
[null,"gmina Gowarczów","Gowarczów","45-50",null,1,null,1,"w przedziale od 30 do 50 minut"]
[null,"gmina Górno","Górno","20-30",0,null,null,0,"mniejszy niż 30 minut"]
[null,"gmina Imielno","Imielno","35-40",null,1,null,1,"w przedziale od 30 do 50 minut"]
[null,"gmina Iwaniska","Iwaniska","35-40",null,1,null,1,"w przedziale od 30 do 50 minut"]
[null,"gmina Jędrzejów","Jędrzejów","30-35",null,1,null,1,"w przedziale od 30 do 50 minut"]
[null,"gmina Kazimierza Wielka","Kazimierza Wielka","45-50",null,1,null,1,"w przedziale od 30 do 50 minut"]
[null,"gmina Kije","Kije","30-35",null,1,null,1,"w przedziale od 30 do 50 minut"]
[null,"gmina Klimontów","Klimontów","40-45",null,1,null,1,"w przedziale od 30 do 50 minut"]
[null,"gmina Kluczewsko","Kluczewsko","45-50",null,1,null,1,"w przedziale od 30 do 50 minut"]
[null,"gmina Końskie","Końskie","35-40",null,1,null,1,"w przedziale od 30 do 50 minut"]
[null,"gmina Koprzywnica","Koprzywnica","40-45",null,1,null,1,"w przedziale od 30 do 50 minut"]
[null,"gmina Krasocin","Krasocin","40-45",null,1,null,1,"w przedziale od 30 do 50 minut"]
[null,"gmina Kunów","Kunów","50-55",null,null,2,2,"większy niż 50 minut"]
[null,"gmina Lipnik","Lipnik","40-45",null,1,null,1,"w przedziale od 30 do 50 minut"]
[null,"gmina Łagów","Łagów","35-40",null,1,null,1,"w przedziale od 30 do 50 minut"]
[null,"gmina Łączna","Łączna","20-30",0,null,null,0,"mniejszy niż 30 minut"]
[null,"gmina Łoniów","Łoniów","40-45",null,1,null,1,"w przedziale od 30 do 50 minut"]
[null,"gmina Łopuszno","Łopuszno","35-40",null,1,null,1,"w przedziale od 30 do 50 minut"]
[null,"gmina Łubnice","Łubnice","55-60",null,null,2,2,"większy niż 50 minut"]
[null,"gmina Małogoszcz","Małogoszcz","35-40",null,1,null,1,"w przedziale od 30 do 50 minut"]
[null,"gmina Masłów","Masłów","20-30",0,null,null,0,"mniejszy niż 30 minut"]
[null,"gmina Michałów","Michałów","40-45",null,1,null,1,"w przedziale od 30 do 50 minut"]
[null,"gmina Miedziana Góra","Miedziana Góra","20-30",0,null,null,0,"mniejszy niż 30 minut"]
[null,"gmina Mirzec","Mirzec","40-45",null,1,null,1,"w przedziale od 30 do 50 minut"]
[null,"gmina Mniów","Mniów","30-35",null,1,null,1,"w przedziale od 30 do 50 minut"]
[null,"gmina Morawica","Morawica","20-30",0,null,null,0,"mniejszy niż 30 minut"]
[null,"gmina Moskorzew","Moskorzew","50-55",null,null,2,2,"większy niż 50 minut"]
[null,"gmina Nagłowice","Nagłowice","40-45",null,1,null,1,"w przedziale od 30 do 50 minut"]
[null,"gmina Nowa Słupia","Nowa Słupia","40-45",null,1,null,1,"w przedziale od 30 do 50 minut"]
[null,"gmina Nowy Korczyn","Nowy Korczyn","50-55",null,null,2,2,"większy niż 50 minut"]
[null,"gmina Obrazów","Obrazów","40-45",null,1,null,1,"w przedziale od 30 do 50 minut"]
[null,"gmina Oksa","Oksa","40-45",null,1,null,1,"w przedziale od 30 do 50 minut"]
[null,"gmina Oleśnica","Oleśnica","50-55",null,null,2,2,"większy niż 50 minut"]
[null,"gmina Opatowiec","Opatowiec","50-55",null,null,2,2,"większy niż 50 minut"]
[null,"gmina Opatów","Opatów","35-40",null,1,null,1,"w przedziale od 30 do 50 minut"]
[null,"gmina Osiek","Osiek","45-50",null,1,null,1,"w przedziale od 30 do 50 minut"]
[null,"gmina Ostrowiec Świętokrzyski","Ostrowiec Świętokrzyski","45-50",null,1,null,1,"w przedziale od 30 do 50 minut"]
[null,"gmina Ożarów","Ożarów","50-55",null,null,2,2,"większy niż 50 minut"]
[null,"gmina Pacanów","Pacanów","50-55",null,null,2,2,"większy niż 50 minut"]
[null,"gmina Pawłów","Pawłów","40-45",null,1,null,1,"w przedziale od 30 do 50 minut"]
[null,"gmina Piekoszów","Piekoszów","20-30",0,null,null,0,"mniejszy niż 30 minut"]
[null,"gmina Pierzchnica","Pierzchnica","30-35",null,1,null,1,"w przedziale od 30 do 50 minut"]
[null,"gmina Pińczów","Pińczów","40-45",null,1,null,1,"w przedziale od 30 do 50 minut"]
[null,"gmina Połaniec","Połaniec","50-55",null,null,2,2,"większy niż 50 minut"]
[null,"gmina Radków","Radków","45-50",null,1,null,1,"w przedziale od 30 do 50 minut"]
[null,"gmina Radoszyce","Radoszyce","35-40",null,1,null,1,"w przedziale od 30 do 50 minut"]
[null,"gmina Raków","Raków","35-40",null,1,null,1,"w przedziale od 30 do 50 minut"]
[null,"gmina Ruda Maleniecka","Ruda Maleniecka","35-40",null,1,null,1,"w przedziale od 30 do 50 minut"]
[null,"gmina Rytwiany","Rytwiany","45-50",null,1,null,1,"w przedziale od 30 do 50 minut"]
[null,"gmina Sadowie","Sadowie","40-45",null,1,null,1,"w przedziale od 30 do 50 minut"]
[null,"gmina Samborzec","Samborzec","40-45",null,1,null,1,"w przedziale od 30 do 50 minut"]
[null,"gmina Sandomierz","Sandomierz","40-45",null,1,null,1,"w przedziale od 30 do 50 minut"]
[null,"gmina Secemin","Secemin","50-55",null,null,2,2,"większy niż 50 minut"]
[null,"gmina Sędziszów","Sędziszów","50-55",null,null,2,2,"większy niż 50 minut"]
[null,"gmina Nowiny","Nowiny","20-30",0,null,null,0,"mniejszy niż 30 minut"]
[null,"gmina Skalbmierz","Skalbmierz","45-50",null,1,null,1,"w przedziale od 30 do 50 minut"]
[null,"gmina Skarżysko Kościelne","Skarżysko Kościelne","40-45",null,1,null,1,"w przedziale od 30 do 50 minut"]
[null,"gmina Skarżysko-Kamienna","Skarżysko-Kamienna","30-35",null,1,null,1,"w przedziale od 30 do 50 minut"]
[null,"gmina Słupia (Jędrzejowska)","Słupia (Jędrzejowska)","50-55",null,null,2,2,"większy niż 50 minut"]
[null,"gmina Słupia Konecka","Słupia Konecka","40-45",null,1,null,1,"w przedziale od 30 do 50 minut"]
[null,"gmina Smyków","Smyków","30-35",null,1,null,1,"w przedziale od 30 do 50 minut"]
[null,"gmina Sobków","Sobków","20-30",0,null,null,0,"mniejszy niż 30 minut"]
[null,"gmina Solec-Zdrój","Solec-Zdrój","50-55",null,null,2,2,"większy niż 50 minut"]
[null,"gmina Starachowice","Starachowice","40-45",null,1,null,1,"w przedziale od 30 do 50 minut"]
[null,"gmina Staszów","Staszów","40-45",null,1,null,1,"w przedziale od 30 do 50 minut"]
[null,"gmina Stąporków","Stąporków","35-40",null,1,null,1,"w przedziale od 30 do 50 minut"]
[null,"gmina Stopnica","Stopnica","45-50",null,1,null,1,"w przedziale od 30 do 50 minut"]
[null,"gmina Strawczyn","Strawczyn","30-35",null,1,null,1,"w przedziale od 30 do 50 minut"]
[null,"gmina Suchedniów","Suchedniów","30-35",null,1,null,1,"w przedziale od 30 do 50 minut"]
[null,"gmina Szydłów","Szydłów","40-45",null,1,null,1,"w przedziale od 30 do 50 minut"]
[null,"gmina Tarłów","Tarłów","60-65",null,null,2,2,"większy niż 50 minut"]
[null,"gmina Tuczępy","Tuczępy","45-50",null,1,null,1,"w przedziale od 30 do 50 minut"]
[null,"gmina Waśniów","Waśniów","40-45",null,1,null,1,"w przedziale od 30 do 50 minut"]
[null,"gmina Wąchock","Wąchock","35-40",null,1,null,1,"w przedziale od 30 do 50 minut"]
[null,"gmina Wilczyce","Wilczyce","45-50",null,1,null,1,"w przedziale od 30 do 50 minut"]
[null,"gmina Wiślica","Wiślica","45-50",null,1,null,1,"w przedziale od 30 do 50 minut"]
[null,"gmina Włoszczowa","Włoszczowa","45-50",null,1,null,1,"w przedziale od 30 do 50 minut"]
[null,"gmina Wodzisław","Wodzisław","40-45",null,1,null,1,"w przedziale od 30 do 50 minut"]
[null,"gmina Wojciechowice","Wojciechowice","45-50",null,1,null,1,"w przedziale od 30 do 50 minut"]
[null,"gmina Zagnańsk","Zagnańsk","20-30",0,null,null,0,"mniejszy niż 30 minut"]
[null,"gmina Zawichost","Zawichost","50-55",null,null,2,2,"większy niż 50 minut"]
[null,"gmina Złota","Złota","50-55",null,null,2,2,"większy niż 50 minut"]

{"sheet":"DANE - K4 lit.B","index":7,"n_rows":107,"n_cols":8,"rows_kept":107,"cut":false,"hidden":false,"merged":[[1,1,1,4]]}
[null,"DANE DO WNIOSKU"]
[null,"Kryterium 4 lit. B — Miasta województwa świętokrzyskiego ujęte w pakiecie dla średnich miast uznanych za zagrożone utratą funkcji społeczno - gospodarczych (na podstawie Analizy Instytutu Geografii i Przestrzennego Zagospodarowania PAN)"]
[]
[]
[null,"powiat","gmina","JST","średnie miasta uznane za zagrożone utratą funkcji społeczno-gospodarczych (na podstawie Analizy Instytutu Geografii i Przestrzennego Zagospodarowania PAN) ","ilośc przyznanych pkt"]
[null,"buski","Busko-Zdrój","gmina Busko-Zdrój","TAK",{"$f":"IF(E6=\"TAK\",1,0)","v":1}]
[null,"buski","Gnojno","gmina Gnojno","NIE",{"$f":"IF(E7=\"TAK\",1,0)","v":0},null,""]
[null,"buski","Nowy Korczyn","gmina Nowy Korczyn","NIE",0,null,""]
[null,"buski","Pacanów","gmina Pacanów","NIE",0,null,""]
[null,"buski","Solec-Zdrój","gmina Solec-Zdrój","NIE",0,null,""]
[null,"buski","Stopnica","gmina Stopnica","NIE",0,null,""]
[null,"buski","Tuczępy","gmina Tuczępy","NIE",0,null,""]
[null,"buski","Wiślica","gmina Wiślica","NIE",0,null,""]
[null,"jędrzejowski","Imielno","gmina Imielno","NIE",0,null,""]
[null,"jędrzejowski","Jędrzejów","gmina Jędrzejów","TAK",{"$f":"IF(E15=\"TAK\",1,0)","v":1}]
[null,"jędrzejowski","Małogoszcz","gmina Małogoszcz","NIE",{"$f":"IF(E16=\"TAK\",1,0)","v":0},null,""]
[null,"jędrzejowski","Nagłowice","gmina Nagłowice","NIE",0,null,""]
[null,"jędrzejowski","Oksa","gmina Oksa","NIE",0,null,""]
[null,"jędrzejowski","Sędziszów","gmina Sędziszów","NIE",0,null,""]
[null,"jędrzejowski","Słupia (Jędrzejowska)","gmina Słupia (Jędrzejowska)","NIE",0,null,""]
[null,"jędrzejowski","Sobków","gmina Sobków","NIE",0,null,""]
[null,"jędrzejowski","Wodzisław","gmina Wodzisław","NIE",0,null,""]
[null,"kazimierski","Bejsce","gmina Bejsce","NIE",0,null,""]
[null,"kazimierski","Czarnocin","gmina Czarnocin","NIE",0,null,""]
[null,"kazimierski","Kazimierza Wielka","gmina Kazimierza Wielka","NIE",0,null,""]
[null,"kazimierski","Opatowiec","gmina Opatowiec","NIE",0,null,""]
[null,"kazimierski","Skalbmierz","gmina Skalbmierz","NIE",0,null,""]
[null,"kielecki","Bieliny","gmina Bieliny","NIE",0,null,""]
[null,"kielecki","Bodzentyn","gmina Bodzentyn","NIE",0,null,""]
[null,"kielecki","Chęciny","gmina Chęciny","NIE",0,null,""]
[null,"kielecki","Chmielnik","gmina Chmielnik","NIE",0,null,""]
[null,"kielecki","Daleszyce","gmina Daleszyce","NIE",0,null,""]
[null,"kielecki","Górno","gmina Górno","NIE",0,null,""]
[null,"kielecki","Kielce","gmina Kielce","NIE",0,null,""]
[null,"kielecki","Łagów","gmina Łagów","NIE",0,null,""]
[null,"kielecki","Łopuszno","gmina Łopuszno","NIE",0,null,""]
[null,"kielecki","Masłów","gmina Masłów","NIE",0,null,""]
[null,"kielecki","Miedziana Góra","gmina Miedziana Góra","NIE",0,null,""]
[null,"kielecki","Mniów","gmina Mniów","NIE",0,null,""]
[null,"kielecki","Morawica","gmina Morawica","NIE",0,null,""]
[null,"kielecki","Nowa Słupia","gmina Nowa Słupia","NIE",0,null,""]
[null,"kielecki","Nowiny","gmina Nowiny","NIE",0,null,""]
[null,"kielecki","Piekoszów","gmina Piekoszów","NIE",0,null,""]
[null,"kielecki","Pierzchnica","gmina Pierzchnica","NIE",0,null,""]
[null,"kielecki","Raków","gmina Raków","NIE",0,null,""]
[null,"kielecki","Strawczyn","gmina Strawczyn","NIE",0,null,""]
[null,"kielecki","Zagnańsk","gmina Zagnańsk","NIE",0,null,""]
[null,"konecki","Fałków","gmina Fałków","NIE",0,null,""]
[null,"konecki","Gowarczów","gmina Gowarczów","NIE",0,null,""]
[null,"konecki","Końskie","gmina Końskie","TAK",1]
[null,"konecki","Radoszyce","gmina Radoszyce","NIE",0,null,""]
[null,"konecki","Ruda Maleniecka","gmina Ruda Maleniecka","NIE",0,null,""]
[null,"konecki","Słupia Konecka","gmina Słupia Konecka","NIE",0,null,""]
[null,"konecki","Smyków","gmina Smyków","NIE",0,null,""]
[null,"konecki","Stąporków","gmina Stąporków","NIE",0,null,""]
[null,"opatowski","Baćkowice","gmina Baćkowice","NIE",0,null,""]
[null,"opatowski","Iwaniska","gmina Iwaniska","NIE",0,null,""]
[null,"opatowski","Lipnik","gmina Lipnik","NIE",0,null,""]
[null,"opatowski","Opatów","gmina Opatów","NIE",0,null,""]
[null,"opatowski","Ożarów","gmina Ożarów","NIE",0,null,""]
[null,"opatowski","Sadowie","gmina Sadowie","NIE",0,null,""]
[null,"opatowski","Tarłów","gmina Tarłów","NIE",0,null,""]
[null,"opatowski","Wojciechowice","gmina Wojciechowice","NIE",0,null,""]
[null,"ostrowiecki","Bałtów","gmina Bałtów","NIE",0,null,""]
[null,"ostrowiecki","Bodzechów","gmina Bodzechów","NIE",0,null,""]
[null,"ostrowiecki","Ćmielów","gmina Ćmielów","NIE",0,null,""]
[null,"ostrowiecki","Kunów","gmina Kunów","NIE",0,null,""]
[null,"ostrowiecki","Ostrowiec Świętokrzyski","gmina Ostrowiec Świętokrzyski","TAK",1]
[null,"ostrowiecki","Waśniów","gmina Waśniów","NIE",0,null,""]
[null,"pińczowski","Działoszyce","gmina Działoszyce","NIE",0,null,""]
[null,"pińczowski","Kije","gmina Kije","NIE",0,null,""]
[null,"pińczowski","Michałów","gmina Michałów","NIE",0,null,""]
[null,"pińczowski","Pińczów","gmina Pińczów","NIE",0,null,""]
[null,"pińczowski","Złota","gmina Złota","NIE",0,null,""]
[null,"sandomierski","Dwikozy","gmina Dwikozy","NIE",0,null,""]
[null,"sandomierski","Klimontów","gmina Klimontów","NIE",0,null,""]
[null,"sandomierski","Koprzywnica","gmina Koprzywnica","NIE",0,null,""]
[null,"sandomierski","Łoniów","gmina Łoniów","NIE",0,null,""]
[null,"sandomierski","Obrazów","gmina Obrazów","NIE",0,null,""]
[null,"sandomierski","Samborzec","gmina Samborzec","NIE",{"$f":"IF(E80=\"TAK\",1,0)","v":0},null,""]
[null,"sandomierski","Sandomierz","gmina Sandomierz","TAK",1]
[null,"sandomierski","Wilczyce","gmina Wilczyce","NIE",0,null,""]
[null,"sandomierski","Zawichost","gmina Zawichost","NIE",0,null,""]
[null,"skarżyski","Bliżyn","gmina Bliżyn","NIE",0,null,""]
[null,"skarżyski","Łączna","gmina Łączna","NIE",0,null,""]
[null,"skarżyski","Skarżysko-Kamienna","gmina Skarżysko-Kamienna","TAK",1]
[null,"skarżyski","Skarżysko Kościelne","gmina Skarżysko Kościelne","NIE",0,null,""]
[null,"skarżyski","Suchedniów","gmina Suchedniów","NIE",0,null,""]
[null,"starachowicki","Brody","gmina Brody","NIE",0,null,""]
[null,"starachowicki","Mirzec","gmina Mirzec","NIE",0,null,""]
[null,"starachowicki","Pawłów","gmina Pawłów","NIE",0,null,""]
[null,"starachowicki","Starachowice","gmina Starachowice","TAK",1]
[null,"starachowicki","Wąchock","gmina Wąchock","NIE",0,null,""]
[null,"staszowski","Bogoria","gmina Bogoria","NIE",0,null,""]
[null,"staszowski","Łubnice","gmina Łubnice","NIE",0,null,""]
[null,"staszowski","Oleśnica","gmina Oleśnica","NIE",0,null,""]
[null,"staszowski","Osiek","gmina Osiek","NIE",0,null,""]
[null,"staszowski","Połaniec","gmina Połaniec","NIE",0,null,""]
[null,"staszowski","Rytwiany","gmina Rytwiany","NIE",0,null,""]
[null,"staszowski","Staszów","gmina Staszów","TAK",1]
[null,"staszowski","Szydłów","gmina Szydłów","NIE",0,null,""]
[null,"włoszczowski","Kluczewsko","gmina Kluczewsko","NIE",0,null,""]
[null,"włoszczowski","Krasocin","gmina Krasocin","NIE",0,null,""]
[null,"włoszczowski","Moskorzew","gmina Moskorzew","NIE",0,null,""]
[null,"włoszczowski","Radków","gmina Radków","NIE",0,null,""]
[null,"włoszczowski","Secemin","gmina Secemin","NIE",0,null,""]
[null,"włoszczowski","Włoszczowa","gmina Włoszczowa","NIE",0,null,""]

{"sheet":"DANE - pkt 9","index":8,"n_rows":118,"n_cols":7,"rows_kept":118,"cut":false,"hidden":false,"merged":[[56,1,56,5],[57,1,57,5],[22,1,22,5],[23,1,23,5],[25,1,25,5],[41,1,41,5],[42,1,42,5],[26,1,26,5],[48,1,48,4],[60,1,60,2],[66,1,66,5],[68,1,68,4],[79,1,79,4],[76,1,76,4],[107,1,107,4],[99,1,99,5],[100,1,100,5],[89,1,89,4],[86,1,86,4],[103,3,104,5],[1,1,1,6],[43,1,43,5],[44,1,44,5],[45,1,45,5],[28,1,28,5],[4,3,4,4],[13,3,13,6]]}
[null,"DANE DO WNIOSKU"]
[null,"opracowanie na podstawie\nRozporządzenia Ministra Infrastruktury z dnia 24.06.2022 r. w sprawie przepisów techniczno-budowlanych dotyczących dróg publicznych (t.j. Dz. U. z 2022 r. poz. 1518)"]
[]
[]
[null,"KATEGORIA DROGI",null,"RODZAJ DROGI w zależności od jej klasy"]
[null,"gminna",null,"KLASA DROGI","RODZAJ DROGI"]
[null,"powiatowa",null,"D - dojazdowa","ulica, droga zamiejska"]
[null,null,null,"L - lokalna","ulica, droga zamiejska"]
[null,null,null,"Z - zbiorcza","ulica, droga zamiejska"]
[null,"RODZAJ DROGI",null,"G - główna","ulica, droga zamiejska"]
[null,"ulica",null,"GP - główna ruchu przyspieszonego","ulica, droga zamiejska"]
[null,"droga zamiejska"]
[]
[null,null,null,"KLASA DROGI w zależności od jej kategorii"]
[null,"KLASA DROGI",null,"KATEGORIA DROGI","KLASA DROGI \n(standardowa)","KLASA DROGI \n(dopuszczalna)","KLASA DROGI \n(w trudnych warunkach)"]
[null,"D - dojazdowa",null,"gminna","D, L","Z, G, GP","-"]
[null,"L - lokalna",null,"powiatowa","Z","G, GP","L"]
[null,"Z - zbiorcza"]
[null,"G - główna"]
[null,"GP - główna ruchu przyspieszonego"]
[]
[]
[null,"ulica - droga klasy GP, G, Z, L lub D otoczona terenami zabudowy lub terenami przeznaczonymi pod zabudowę, pełniąca oprócz funkcji komunikacyjnej także inne funkcje, w szczególności związane z jej otoczeniem (§ 4 pkt 24 rozporządzenia Ministra Infrastruktury w sprawie przepisów techniczno-budowlanych dotyczących dróg publicznych)"]
[null,"droga zamiejska -  droga nie będąca ulicą (§ 4 pkt 3 rozporządzenia Ministra Infrastruktury w sprawie przepisów techniczno-budowlanych dotyczących dróg publicznych)"]
[]
[null,"trudne warunki - warunki wynikające z istniejącego ukształtowania lub zagospodarowania terenu, ze stopnia złożoności warunków gruntowo-wodnych lub z konieczności ograniczenia oddziaływania drogi na środowisko, które przy zachowaniu podstawowych warunków, o których mowa w dziale II, uniemożliwiają zastosowanie rozwiązania standardowego lub powodują, że koszty zastosowania rozwiązania standardowego lub powodują, że koszty zastosowania rozwiązania standardowego w cyklu życia drogi byłoby rażąco wysokie względem rozwiązania alternatywnego (§ 4 pkt 22 rozporządzenia Ministra Infrastruktury w sprawie przepisów techniczno-budowlanych dotyczących dróg publicznych)"]
[null,"trudne warunki (zastosowanie) - zastosowanie przepisów, które odnoszą się do trudnych warunków, wymaga pisemnego uzasadnienia potwierdzającego brak możliwości lub rażąco wysokie koszty zastosowania rozwiązania standardowego względem rozwiązania alternatywnego, które dołącza się do dokumentacji projektowej (§ 2 pkt 5 rozporządzenia Ministra Infrastruktury w sprawie przepisów techniczno-budowlanych dotyczących dróg publicznych)"]
[]
[null,"PRZEKRÓJ n/m \ngdzie: \nn - liczba jezdni głównych,\nm - liczba pasów ruchu na jezdni głównej"]
[null,"RODZAJ DROGI","KLASA DROGI","PRZEKRÓJ \n(standardowy)","PRZEKRÓJ \n(dopuszczony)","PRZEKRÓJ \n(w trudnych warunkach)"]
[null,"ulica","D - dojazdowa","dwukierunkowy 1/2","dwukierunkowy 1/1*,  \n2/1, \njednokierunkowy 1/1, \njednokierunkowy 1/2, ","-"]
[null,"ulica","L - lokalna","dwukierunkowy 1/2","dwukierunkowy 1/2+0, \n2/1, \n2/2, \njednokierunkowy 1/1, \njednokierunkowy 1/2, ","-"]
[null,"ulica","Z - zbiorcza","dwukierunkowy 1/2","dwukierunkowy 1/2+0, \n2/1, \n2/2, \n2/3,  \njednokierunkowy 1/1, \njednokierunkowy 1/2, \njednokierunkowy 1/3, ","-"]
[null,"ulica","G - główna","dwukierunkowy 1/2","dwukierunkowy 1/2+0, \n2/2, \n2/3, \n2/4, \njednokierunkowy 1/1, \njednokierunkowy 1/2, \njednokierunkowy 1/3, \njednokierunkowy 1/4, ","-"]
[null,"ulica","GP - główna ruchu przyspieszonego","2/2","2/3, \n2/4, \ndwukierunkowy 1/2+0, \ndwukierunkowy 1/2","-"]
[null,"droga zamiejska","D - dojazdowa","dwukierunkowy 1/2**","dwukierunkowy 1/2-1, \ndwukierunkowy 1/1","dwukierunkowy 1/2** (bez możliwości wyprzedzania)"]
[null,"droga zamiejska","L - lokalna","dwukierunkowy 1/2**","dwukierunkowy 1/2-1","dwukierunkowy 1/2** (bez możliwości wyprzedzania)"]
[null,"droga zamiejska","Z - zbiorcza","dwukierunkowy 1/2**","2/2","dwukierunkowy 1/2** (bez możliwości wyprzedzania)"]
[null,"droga zamiejska","G - główna","dwukierunkowy 1/2**","dwukierunkowy 1/2+1, \n2/2,\n2/3","dwukierunkowy 1/2** (bez możliwości wyprzedzania)"]
[null,"droga zamiejska","GP - główna ruchu przyspieszonego","2/2","2/3, \ndwukierunkowy 1/2**, \ndwukierunkowy 1/2+1","dwukierunkowy 1/2** (bez możliwości wyprzedzania)"]
[]
[null,"dwukierunkowy 1/2+0 - oznacza przekrój ulicy ze środkowym pasem wielofunkcyjnym, który jest przeznaczony do ruchu pojazdów wyjeżdżających z ulicy lub wjeżdżających na ulicę (§ 15 ust. 5 rozporządzenia Ministra Infrastruktury w sprawie przepisów techniczno-budowlanych dotyczących dróg publicznych)"]
[null,"dwukierunkowy 1/1* - na ulicy o tym przekroju projektuje się odcinki o przekroju dwukierunkowym 1/2 umożliwiające wyminięcie się pojazdów (§ 15 ust. 6 rozporządzenia Ministra Infrastruktury w sprawie przepisów techniczno-budowlanych dotyczących dróg publicznych)"]
[null,"dwukierunkowy 1/2+1 - oznacza przekrój drogi zamiejskiej z zespołem naprzemiennych dodatkowych pasów ruchu do wyprzedzania (§ 15 ust. 2 rozporządzenia Ministra Infrastruktury w sprawie przepisów techniczno-budowlanych dotyczących dróg publicznych)"]
[null,"dwukierunkowy 1/2** - droga zamiejska o tym przekroju powinna mieć odcinki z możliwością wyprzedzania, które zapewniają niezbędne warunki widoczności, lub dodatkowe pasy ruchu do wyprzedzania. W trudnych warunkach dopuszcza się odcinki bez możliwości wyprzedzania (§ 15 ust. 2 rozporządzenia Ministra Infrastruktury w sprawie przepisów techniczno-budowlanych dotyczących dróg publicznych)"]
[null,"dwukierunkowy 1/2-1 - oznacza przekrój drogi ze środkowym pasem przeznaczonym do dwukierunkowego ruchu pojazdów (z wyjątkiem rowerów, hulajnóg elektrycznych i urządzeń transportu osobistego) oraz pasami usytuowanymi po obu stronach pasa środkowego, które są przeznaczone do jednokierunkowego ruchu pieszych, rowerów, hulajnóg elektrycznych i urządzeń transportu osobistego, a także do ruchu pozostałych pojazdów w trakcie wymijania, na której prędkość dopuszczalna wynosi nie więcej niż 50 km/h (§ 15 ust. 3 rozporządzenia Ministra Infrastruktury w sprawie przepisów techniczno-budowlanych dotyczących dróg publicznych)"]
[]
[]
[null,"SZEROKOŚĆ PASA RUCHU w zależności od klasy drogi "]
[null,"KLASA DROGI","SZEROKOŚĆ PASA RUCHU \n(standardowa)","SZEROKOŚĆ PASA RUCHU \n(dopuszczalna)","SZEROKOŚĆ PASA RUCHU \n(w trudnych warunkach)"]
[null,"D - dojazdowa","2,50 m","2,75 m, 3,00 m, 3,25 m, 3,50 m","2,25 m"]
[null,"L - lokalna","2,75 m","3,00 m, 3,25 m, 3,50 m","2,50 m"]
[null,"Z - zbiorcza","3,00 m","3,25 m, 3,50 m","2,75 m"]
[null,"G - główna","3,50 m","-","3,25 m, 3,00 m"]
[null,"GP - główna ruchu przyspieszonego","3,50 m","-","3,25 m"]
[]
[null,"Szerokość pasa ruchu na jezdni  z jednym pasem ruchu powinna być mniejsza niż suma szerokości dwóch pasów ruchu, ale nie mniejsza niż 3,50 m (§ 17 ust. 3 rozporządzenia Ministra Infrastruktury w sprawie przepisów techniczno-budowlanych dotyczących dróg publicznych)"]
[null,"W miejscu zastosowania rozwiązania w celu uspokojenia ruchu, dopuszcza się zmniejszenie szerokości pasa ruchu do nie mniej niż 2,25 m (§ 17 ust. 4 rozporządzenia Ministra Infrastruktury w sprawie przepisów techniczno-budowlanych dotyczących dróg publicznych)"]
[]
[]
[null,"POBOCZA  w zależności od rodzaju drogi"]
[null,"RODZAJ DROGI","POBOCZA",null,"KLASA DROGI","POBOCZE"]
[null,"doga zamiejska o jednej jezdni głównej","pobocza po obu stronach jezdni",null,"GP","częściowo o nawierzchni twardej, jako opaska zewnętrzna, częściowo o nawierzchni gruntowej"]
[null,"droga zamiejska o dwóch jezdniach głównych","pobocze z prawej strony i opaska wewnętrzna z lewej strony każdej jezdni (opaski wewnętrznej nie projektuje się na drogach klasy L lub D)",null,"G, Z","częściowo o nawierzchni twardej, jako opaska zewnętrzna, częściowo o nawierzchni gruntowej \nlub \nw całości o nawierzchni gruntowej"]
[null,null,null,null,"L,D","w całości o nawierzchni gruntowej"]
[]
[null,"Na ulicy projektuje się pobocza albo pobocze i opaskę wewnętrzną w taki sposób, jak na drodze zamiejskiej. Jeżeli jezdnia ulicy jest ograniczona wyniesionym krawężnikiem, a ruch pieszych odbywa się po drodze dla pieszych lub drodze dla pieszych i rowerów albo na ulicy obowiązuje zakaz ruchu pieszych, dopuszcza się inne rozwiązania w zakresie poboczy lub opasek wewnętrznych (§23 ust. 4 rozporządzenia Ministra Infrastruktury w sprawie przepisów techniczno-budowlanych dotyczących dróg publicznych)"]
[]
[null,"POBOCZA O NAWIERZCHNI TWARDEJ w postaci opaski zewnętrznej w zależności od klasy drogi"]
[null,"KLASA DROGI","SZEROKOŚĆ POBOCZA \n(standardowa)","SZEROKOŚĆ POBOCZA \n(dopuszczalna)","SZEROKOŚĆ POBOCZA \n(w trudnych warunkach)"]
[null,"D - dojazdowa","-","-","-"]
[null,"L - lokalna","-","-","-"]
[null,"Z - zbiorcza","0,50 m","-","-"]
[null,"G - główna","0,50 m","-","-"]
[null,"GP - główna ruchu przyspieszonego o jednej jezdni głównej","0,75 m","-","nie mniej niż 0,50 m"]
[null,"GP - główna ruchu przyspieszonego o dwóch jezdniach głównych","0,75 m","1,50 m","-"]
[null,"Dopuszcza się zwiększenie do 1,50 m szerokości pobocza o nawierzchni twardej, w postaci opaski zewnętrznej w miejscu istotnym ze względu na bezpieczeństwo ruchu"]
[]
[]
[null,"POBOCZA O NAWIERZCHNI TWARDEJ w postaci opaski wewnętrznej w zależności od klasy drogi"]
[null,"KLASA DROGI","SZEROKOŚĆ POBOCZA \n(standardowa)","SZEROKOŚĆ POBOCZA \n(dopuszczalna)","SZEROKOŚĆ POBOCZA \n(w trudnych warunkach)"]
[null,"D - dojazdowa"]
[null,"L - lokalna"]
[null,"Z - zbiorcza","0,50 m"]
[null,"G - główna","0,50 m"]
[null,"GP - główna ruchu przyspieszonego","0,75 m",null,"nie mniej niż 0,50 m"]
[null,"Dopuszcza się zwiększenie do 1,50 m szerokości pobocza o nawierzchni twardej, w postaci opaski zewnętrznej w miejscu istotnym ze względu na bezpieczeństwo ruchu"]
[]
[]
[null,"POBOCZA O NAWIERZCHNI GRUNTOWEJ w zależności od klasy drogi"]
[null,"KLASA DROGI","SZEROKOŚĆ POBOCZA \n(standardowa)","SZEROKOŚĆ POBOCZA \n(dopuszczalna)","SZEROKOŚĆ POBOCZA \n(w trudnych warunkach)"]
[null,"D - dojazdowa","0,75 m","-","nie mniej niż 0,50 m"]
[null,"L - lokalna","0,75 m","-","nie mniej niż 0,50 m"]
[null,"Z - zbiorcza","1,00 m","-","nie mniej niż 0,50 m"]
[null,"G - główna","1,25 m","-","nie mniej niż 0,50 m"]
[null,"GP - główna ruchu przyspieszonego","-","-","-"]
[null,"część pobocza przyległa do opaski zewnętrznej","0,75 m","-","nie mniej niż 0,50 m"]
[null,"część pobocza przyległa do pasa awaryjnego","1,25 m","-","nie mniej niż 0,75 m"]
[]
[null,"nawierzchnia gruntowa - nawierzchnię z gruntu rodzimego lub nasypowego, ulepszonego mechanicznie lub chemicznie, w której dopuszcza się wykonanie wierzchniej warstwy z kruszywa naturalnego, sztucznego lub pochodzącego z recyklingu (§ 4 pkt 2 lit. a rozporządzenia Ministra Infrastruktury w sprawie przepisów techniczno-budowlanych dotyczących dróg publicznych)"]
[null,"nawierzchnia twarda - nawierzchnia niebędąca nawierzchnią gruntową (§ 4 pkt 2 lit. b rozporządzenia Ministra Infrastruktury w sprawie przepisów techniczno-budowlanych dotyczących dróg publicznych)"]
[]
[]
[null,"SZEROKOŚĆ CHODNIKA \n(standardowa)","SZEROKOŚĆ CHODNIKA \n(w trudnych warunkach)","(§ 29 ust. 1, 2 rozporządzenia Ministra Infrastruktury w sprawie przepisów techniczno-budowlanych dotyczących dróg publicznych)"]
[null,"nie mniejsza niż 1,80 m","nie mniejsza niż 1,00 m pod warunkiem zaprojektowania miejsc do wymijania się osób ze szczególnymi potrzebami o długości nie mniejszej niż 2,00 m i szerokości nie mniejszej niż 1,80 m"]
[]
[]
[null,"RUCH PIESZYCH i ROWERÓW"]
[null,"RODZAJ URZĄDZENIA RUCHU","SZEROKOŚĆ \n(standardowa)","SZEROKOŚĆ \n(w trudnych warunkach)","Dodatkowe informacje"]
[null,"Chodnik","nie mniejsza niż 1,80 m","nie mniejsza niż 1,00 m pod warunkiem zaprojektowania miejsc do wymijania się osób ze szczególnymi potrzebami o długości nie mniejszej niż 2,00 m i szerokości nie mniejszej niż 1,80 m","(§ 29 ust. 1, 2 rozporządzenia Ministra Infrastruktury w sprawie przepisów techniczno-budowlanych dotyczących dróg publicznych)"]
[null,"Przejście dla pieszych","nie mniejsza niż 4,00 m i nie większa niż 16,00 m","zmniejszenie szerokości do 2,50 m na ulicy w trudnych warunkach w obszarze skrzyżowania, na wlocie ulicy podporządkowanej, w przypadku połączenia z przejazdem dla rowerów","(§ 35 rozporządzenia Ministra Infrastruktury w sprawie przepisów techniczno-budowlanych dotyczących dróg publicznych)"]
[null,"Strefa oczekiwania (związana z przejściem dla pieszych)","szerokość równa szerokości przejścia i długości nie mniejszej niż 2,50 m","szerokość równa szerokości przejścia i długości nie mniejszej niż 2,00 m","(§ 36 rozporządzenia Ministra Infrastruktury w sprawie przepisów techniczno-budowlanych dotyczących dróg publicznych)"]
[null,"Jednokierunkowa droga dla rowerów","nie mniejsza 1,50 m","1,20 m (w trudnych warunkach, na moście lub wiadukcie),\n1,00 m na odcinku nie dłuższym niż 20 m (konieczność zapewnienia segregacji kierunków ruchu)","(§ 42 ust. 2 rozporządzenia Ministra Infrastruktury w sprawie przepisów techniczno-budowlanych dotyczących dróg publicznych)"]
[null,"Dwukierunkowa droga dla rowerów","nie mniejsza niż 2,50 m","2,00 m (w trudnych warunkach, na moście lub wiadukcie)","(§ 42 ust. 3 rozporządzenia Ministra Infrastruktury w sprawie przepisów techniczno-budowlanych dotyczących dróg publicznych)"]
[null,"Droga dla pieszych i rowerów","nie mniejsza niż 3,00 m","2,50 m (w trudnych warunkach, na moście lub wiadukcie)","(§ 42 ust. 4 rozporządzenia Ministra Infrastruktury w sprawie przepisów techniczno-budowlanych dotyczących dróg publicznych)"]
[null,"Pas lub kontrapas ruchu dla rowerów","nie mniejsza niż 1,50 m i mniejsza niż 2,25 m","nie mniejsza niż 1,25 m (na moście lub wiadukcie lub braku krawężnika), \nnie mniejsza niż 1,00 m (w trudnych warunkach)","(§ 42 ust. 5 rozporządzenia Ministra Infrastruktury w sprawie przepisów techniczno-budowlanych dotyczących dróg publicznych)"]
[null,"Przejazd dla rowerów","nie mniejsza niż szerokość drogi dla rowerów przed przejazdem i nie mniejsza niż 1,80 m (przejazdu jednokierunkowego) i 3,00 m (przejazdu dwukierunkowego)",null,"(§ 45 ust. 2 rozporządzenia Ministra Infrastruktury w sprawie przepisów techniczno-budowlanych dotyczących dróg publicznych)"]
[null,"Strefa oczekiwania (związana z przejazdem dla rowerów)","szerokość równa szerokości przejazdów i długości nie mniejszej niż 2,50 m","szerokość równa szerokości przejazdów i długości nie mniejszej niż 2,00 m","(§ 45 ust. 3 rozporządzenia Ministra Infrastruktury w sprawie przepisów techniczno-budowlanych dotyczących dróg publicznych)"]