{"text_format":"1","workbook":"xlsx","n_sheets":9,"sheets":["Budowa","Remont","DANE","DANE - TERC","DANE - K1 lit.A","DANE - K2 lit.C","DANE - K4 lit.B","DANE - pkt 9","INSTRUKCJA"],"not_rendered":{"charts":0,"images":0,"macros":1,"external_links":0,"defined_names":31,"comments":0,"pivot_tables":0},"unopened":[],"bounds":{"document_bytes":16777216,"sheet_cells":100000,"rows_first":2000,"rows_last":500,"rows_between":2000,"halvings":0,"cell_chars":16384,"cell_head_chars":4096},"cells_cut":0,"cells_raw":0,"read":"whole","date_system":"1900"}

{"sheet":"Budowa","index":0,"n_rows":254,"n_cols":59,"rows_kept":254,"cut":false,"hidden":false,"merged":[[123,30,123,47],[124,30,126,47],[117,30,117,47],[120,30,120,47],[121,30,121,47],[122,30,122,47],[143,1,143,25],[149,30,149,47],[143,30,143,47],[144,30,144,47],[145,30,145,47],[146,30,146,47],[147,30,147,47],[148,30,148,47],[137,3,137,20],[138,3,138,20],[139,3,139,20],[137,21,137,22],[120,1,120,25],[131,2,131,25],[137,0,142,0],[137,1,140,1],[140,3,140,20],[142,2,142,20],[142,21,142,22],[142,23,142,24],[142,30,142,47],[128,30,128,47],[129,30,129,47],[130,30,130,47],[131,30,131,47],[132,30,132,47],[133,30,133,47],[134,30,134,47],[135,30,135,47],[136,30,136,47],[137,30,137,47],[138,30,138,47],[139,30,139,47],[140,30,140,47],[141,30,141,47],[130,0,134,0],[128,1,128,13],[128,14,128,25],[4,30,5,47],[6,30,7,47],[8,30,8,47],[9,30,9,47],[10,30,10,47],[11,30,11,47],[12,30,12,47],[13,30,13,47],[166,30,166,47],[163,30,163,47],[164,30,164,47],[165,30,165,47],[158,30,158,47],[159,30,159,47],[160,30,160,47],[161,30,161,47],[162,30,162,47],[152,30,152,47],[153,30,153,47],[154,30,154,47],[155,30,157,47],[114,30,116,47],[118,30,119,47],[150,30,150,47],[0,30,1,47],[29,30,29,47],[30,30,30,47],[219,30,219,47],[224,30,224,47],[191,30,191,47],[183,30,183,47],[180,30,180,47],[168,30,168,47],[151,30,151,47],[127,30,127,47],[212,30,212,47],[22,30,22,47],[23,30,23,47],[24,30,24,47],[25,30,25,47],[26,30,26,47],[220,30,220,47],[27,30,27,47],[223,30,223,47],[2,30,2,47],[3,30,3,47],[28,30,28,47],[31,30,31,47],[239,30,239,47],[240,30,240,47],[239,0,239,22],[235,30,235,47],[231,22,231,25],[239,23,239,25],[237,0,237,22],[237,23,237,25],[237,30,237,47],[238,1,238,25],[238,30,238,47],[116,1,116,25],[117,1,117,25],[124,3,124,10],[125,3,125,10],[19,30,19,47],[231,2,231,13],[232,2,232,13],[236,1,236,25],[222,2,222,4],[222,5,222,22],[223,2,223,22],[223,23,224,25],[166,1,166,25],[221,2,221,22],[221,23,222,25],[32,30,32,47],[42,30,42,47],[167,30,167,47],[178,30,178,47],[179,30,179,47],[181,30,181,47],[182,30,182,47],[175,30,175,47],[95,30,95,47],[98,30,98,47],[33,30,33,47],[34,30,34,47],[35,30,35,47],[36,30,36,47],[37,30,37,47],[92,30,92,47],[64,30,67,47],[56,30,62,47],[69,30,75,47],[77,30,80,47],[82,30,85,47],[87,30,90,47],[54,30,54,47],[40,30,40,47],[41,30,41,47],[43,30,44,47],[45,30,45,47],[46,30,53,47],[104,30,104,47],[105,30,105,47],[106,30,106,47],[253,30,253,47],[250,30,250,47],[249,30,249,47],[251,30,251,47],[243,30,243,47],[241,30,241,47],[252,30,252,47],[248,30,248,47],[204,30,204,47],[242,30,242,47],[187,30,187,47],[192,30,192,47],[188,30,190,47],[176,30,176,47],[177,30,177,47],[172,30,172,47],[173,30,173,47],[174,30,174,47],[169,30,169,47],[170,30,170,47],[171,30,171,47],[14,30,14,47],[15,30,15,47],[16,30,16,47],[17,30,17,47],[18,30,18,47],[20,30,20,47],[21,30,21,47],[38,30,38,47],[39,30,39,47],[6,26,11,28],[21,12,22,15],[21,3,22,11],[101,1,101,25],[152,1,152,25],[98,2,98,23],[99,2,99,23],[47,3,47,7],[47,8,47,12],[47,13,47,19],[48,8,48,12],[48,13,48,19],[48,20,48,25],[93,1,93,4],[93,5,93,25],[14,1,14,25],[88,1,88,7],[15,0,15,25],[17,11,17,17],[18,11,18,17],[19,0,19,25],[37,20,37,25],[88,9,88,10],[88,12,88,13],[45,3,45,7],[45,8,45,12],[44,0,45,2],[36,4,36,25],[0,1,0,3],[0,4,0,25],[1,1,1,3],[1,4,1,25],[3,0,3,3],[3,4,3,25],[4,0,4,25],[2,4,2,25],[5,0,5,25],[16,1,16,25],[30,1,30,9],[26,1,26,25],[27,18,27,25],[27,10,27,17],[27,1,27,9],[32,18,32,25],[39,1,39,19],[38,4,38,25],[17,18,17,25],[18,18,18,25],[51,0,51,2],[47,20,47,25],[44,13,45,19],[48,3,48,7],[29,10,29,17],[30,10,30,17],[32,0,32,9],[38,1,38,3],[37,1,37,19],[31,10,31,17],[31,18,31,25],[31,1,31,9],[32,10,32,17],[29,1,29,9],[35,20,35,25],[43,0,43,25],[36,1,36,3],[46,0,46,2],[46,3,46,7],[49,13,49,19],[44,3,44,12],[41,20,41,25],[41,1,41,19],[39,20,39,25],[64,1,64,7],[67,1,67,7],[67,8,67,16],[67,17,67,25],[61,1,61,7],[58,8,58,16],[58,17,58,25],[60,1,60,7],[54,1,54,25],[58,1,58,7],[55,17,55,25],[56,1,56,7],[56,8,56,16],[56,17,56,25],[66,17,66,24],[65,1,65,7],[52,0,52,2],[46,8,46,12],[46,13,46,19],[46,20,46,25],[44,20,45,25],[62,1,62,7],[60,8,60,25],[59,1,59,7],[59,8,59,16],[59,17,59,25],[62,8,62,24],[51,3,51,7],[51,8,51,12],[51,13,51,19],[51,20,51,25],[50,3,50,7],[50,8,50,12],[50,13,50,19],[47,0,47,2],[48,0,48,2],[49,0,49,2],[50,0,50,2],[49,3,49,7],[49,8,49,12],[52,3,52,7],[52,8,52,12],[52,13,52,19],[52,20,52,25],[53,3,53,12],[53,13,53,19],[53,20,53,25],[89,23,89,24],[90,18,90,19],[64,8,64,16],[64,17,64,25],[66,1,66,7],[66,8,66,15],[61,8,61,25],[83,21,83,22],[83,23,83,24],[53,0,53,2],[65,8,65,15],[65,17,65,24],[57,1,57,7],[55,0,55,7],[55,8,55,16],[57,8,57,16],[57,17,57,25],[20,1,20,25],[17,1,17,3],[18,1,18,3],[17,4,17,6],[18,4,18,6],[17,7,17,10],[18,7,18,10],[175,1,175,25],[252,0,252,25],[241,23,241,25],[242,1,242,25],[240,1,240,25],[234,1,234,25],[235,1,235,25],[217,7,217,22],[189,19,189,25],[190,19,190,25],[188,14,188,18],[174,1,174,25],[177,1,177,25],[179,1,179,2],[219,2,219,22],[212,23,212,25],[219,23,219,25],[190,8,190,13],[188,19,188,25],[188,1,188,7],[193,23,196,25],[253,0,253,25],[247,2,247,25],[250,0,250,22],[250,23,250,25],[251,1,251,25],[243,0,243,22],[243,23,243,25],[244,1,244,25],[248,0,248,22],[248,23,248,25],[249,1,249,25],[245,2,245,25],[246,2,246,25],[241,0,241,22],[232,22,232,25],[233,2,233,25],[196,2,196,22],[213,23,215,25],[182,1,182,2],[182,3,182,25],[173,3,173,25],[176,1,176,2],[176,3,176,25],[178,1,178,25],[204,2,204,22],[202,7,202,22],[203,7,203,22],[202,2,202,6],[203,2,203,6],[191,1,191,25],[197,23,200,25],[194,2,194,6],[195,2,195,6],[194,7,194,22],[195,7,195,22],[198,2,198,6],[198,7,198,22],[199,2,199,6],[200,2,200,22],[187,1,187,25],[188,8,188,13],[189,8,189,13],[163,1,163,25],[168,6,168,25],[164,1,164,2],[164,3,164,25],[216,23,218,25],[183,1,183,4],[183,6,183,25],[180,1,180,4],[180,6,180,25],[181,1,181,25],[184,1,184,25],[218,2,218,6],[218,7,218,22],[204,23,204,25],[186,1,186,25],[201,2,201,22],[212,2,212,22],[201,23,203,25],[192,1,192,25],[193,2,193,22],[190,1,190,7],[199,7,199,22],[215,2,215,6],[215,7,215,22],[21,22,21,25],[21,17,21,21],[33,0,33,9],[42,1,42,25],[40,4,40,25],[28,1,28,9],[28,10,28,17],[28,18,28,25],[40,1,40,3],[29,18,29,25],[33,10,33,25],[34,1,34,25],[35,1,35,19],[22,22,22,25],[22,17,22,21],[21,0,22,2],[23,1,23,25],[24,8,24,15],[24,16,24,25],[25,8,25,14],[25,16,25,24],[24,0,24,7],[25,0,25,6],[30,18,30,25],[49,20,49,25],[50,20,50,25],[89,14,89,15],[84,12,84,13],[84,14,84,15],[85,9,85,10],[89,1,89,7],[89,9,89,10],[86,1,86,25],[87,1,87,7],[87,8,87,16],[87,17,87,25],[80,9,80,10],[83,1,83,7],[83,9,83,10],[83,12,83,13],[83,14,83,15],[84,1,84,7],[84,9,84,10],[85,1,85,7],[88,14,88,15],[69,1,69,7],[69,8,69,16],[69,17,69,25],[106,3,106,23],[107,3,107,23],[104,3,104,23],[90,1,90,7],[90,9,90,10],[89,18,89,19],[102,2,102,25],[98,24,98,25],[103,24,103,25],[100,2,100,23],[92,5,92,25],[100,24,100,25],[89,21,89,22],[99,24,99,25],[91,1,91,25],[96,6,96,25],[104,24,104,25],[92,1,92,4],[95,1,95,25],[96,1,96,4],[105,3,105,23],[109,3,109,23],[108,2,108,25],[129,1,129,25],[126,1,126,25],[111,3,111,23],[134,21,134,22],[133,23,133,24],[134,23,134,24],[130,23,130,24],[132,23,132,24],[115,1,115,2],[115,3,115,25],[119,1,119,2],[119,3,119,25],[124,1,125,2],[118,1,118,25],[122,13,122,25],[123,1,123,25],[121,1,121,25],[122,1,122,12],[124,11,124,25],[125,11,125,25],[112,24,112,25],[111,24,111,25],[110,3,110,23],[230,1,230,25],[224,2,224,22],[226,0,226,25],[225,1,225,25],[228,1,228,25],[229,1,229,25],[145,24,145,25],[146,24,146,25],[145,2,145,23],[146,2,146,23],[147,24,147,25],[148,24,148,25],[147,2,147,23],[148,2,148,23],[151,1,151,4],[213,2,213,22],[216,2,216,22],[165,1,165,25],[134,3,134,20],[170,1,170,2],[170,3,170,25],[153,1,153,25],[197,2,197,22],[189,14,189,18],[190,14,190,18],[189,1,189,7],[185,1,185,2],[185,3,185,25],[173,1,173,2],[154,1,154,25],[159,2,159,25],[160,1,160,25],[157,1,157,25],[168,1,168,4],[167,1,167,2],[167,3,167,25],[162,1,162,25],[179,3,179,25],[155,1,155,25],[161,1,161,2],[161,3,161,25],[169,1,169,25],[172,1,172,25],[158,1,158,25],[171,1,171,25],[156,1,156,3],[156,4,156,25],[205,23,207,25],[205,2,205,22],[209,2,209,22],[208,23,211,25],[227,1,227,25],[217,2,217,6],[220,2,220,22],[205,30,211,47],[213,30,215,47],[214,2,214,6],[214,7,214,22],[208,2,208,22],[206,2,206,6],[206,7,206,22],[207,2,207,6],[207,7,207,22],[211,2,211,6],[211,7,211,22],[210,2,210,6],[210,7,210,22],[7,13,7,25],[6,13,6,25],[7,0,13,12],[8,13,8,25],[9,13,9,15],[10,13,10,15],[11,13,11,15],[12,13,12,15],[13,13,13,15],[9,16,9,25],[10,16,10,25],[11,16,11,25],[13,16,13,25],[12,16,12,21],[12,22,12,25],[6,0,6,12],[151,6,151,25],[141,23,141,24],[140,23,140,24],[139,21,139,22],[140,21,140,22],[141,21,141,22],[141,2,141,20],[130,2,130,20],[139,23,139,24],[132,3,132,20],[133,3,133,20],[135,1,135,25],[137,23,137,24],[138,23,138,24],[130,21,130,22],[132,21,132,22],[133,21,133,22],[138,21,138,22],[136,1,136,25],[149,2,149,23],[150,2,150,23],[149,24,149,25],[150,24,150,25],[144,1,144,25],[70,1,70,7],[75,1,75,7],[89,12,89,13],[94,1,94,4],[127,1,127,4],[127,6,127,25],[94,5,94,25],[105,24,105,25],[106,24,106,25],[107,24,107,25],[113,1,113,4],[113,6,113,25],[114,1,114,25],[97,1,97,25],[109,24,109,25],[110,24,110,25],[103,3,103,23],[112,3,112,23],[84,18,84,19],[84,21,84,22],[73,18,73,19],[78,23,78,24],[79,18,79,19],[79,21,79,22],[75,9,75,10],[75,18,75,19],[76,1,76,25],[244,30,247,47],[220,23,220,25],[63,1,63,25],[68,1,68,25],[70,9,70,10],[70,12,70,13],[70,14,70,15],[70,18,70,19],[70,21,70,22],[70,23,70,24],[71,1,71,7],[71,9,71,10],[71,12,71,13],[71,14,71,15],[71,18,71,19],[71,21,71,22],[71,23,71,24],[72,1,72,7],[72,9,72,10],[72,18,72,19],[73,1,73,7],[74,1,74,7],[74,9,74,10],[74,12,74,13],[74,14,74,15],[74,18,74,19],[74,21,74,22],[74,23,74,24],[73,9,73,10],[73,12,73,13],[73,14,73,15],[77,1,77,7],[77,8,77,16],[77,17,77,25],[81,1,81,25],[82,1,82,7],[82,8,82,16],[82,17,82,25],[84,23,84,24],[85,18,85,19],[79,23,79,24],[80,18,80,19],[83,18,83,19],[78,1,78,7],[78,9,78,10],[78,12,78,13],[78,14,78,15],[79,1,79,7],[79,9,79,10],[79,12,79,13],[79,14,79,15],[80,1,80,7],[88,18,88,19],[88,21,88,22],[88,23,88,24],[78,18,78,19],[78,21,78,22],[55,30,55,47],[93,30,93,47],[94,30,94,47],[97,30,97,47],[76,30,76,47],[81,30,81,47],[86,30,86,47],[68,30,68,47],[63,30,63,47],[91,30,91,47],[73,21,73,22],[73,23,73,24],[96,30,96,47],[99,30,99,47],[100,30,100,47],[101,30,101,47],[102,30,102,47],[103,30,103,47],[216,30,218,47],[221,30,222,47],[193,30,203,47],[231,30,231,47],[107,30,107,47],[108,30,108,47],[109,30,109,47],[110,30,110,47],[111,30,111,47],[112,30,112,47],[225,30,225,47],[226,30,226,47],[185,30,185,47],[184,30,184,47],[113,30,113,47],[227,30,227,47],[228,30,228,47],[229,30,229,47],[230,30,230,47]]}
["!"," UWAGA: ",null,null,"WNIOSEK NALEŻY ZŁOŻYĆ ZA PISMEM PRZEWODNIM.",null,null,null,null,null,null,null,null,null,null,null,null,null,null,null,null,null,null,null,null,null,null,null,null,null,"INSTRUKCJA WYPEŁNIANIA WNIOSKU",null,null,null,null,null,null,null,null,null,null,null,null,null,null,null,null,null,null,null,null,null,null,null,null,null,"OK"]
[null,null,null,null,"PRZED WYPEŁNIENIEM WNIOSKU NALEŻY ZAPOZNAĆ SIĘ Z INSTRUKCJĄ ",null,null,null,null,null,null,null,null,null,null,null,null,null,null,null,null,null,null,null,null,null,null,null,null,null,null,null,null,null,null,null,null,null,null,null,null,null,null,null,null,null,null,null,null,null,null,null,null,null,null,null,"Wprowadzono błędną daną - proszę wprowadzić poprawną daną wybierając ją z listy rozwijanej"]
[null,null,null,null,"WYPEŁNIAJĄC WNIOSEK NALEŻY KIEROWAĆ SIĘ INSTRUKCJĄ POMOCNICZĄ I WSKAZÓWKAMI  - (szare pola po prawej stronie wniosku oraz żółte pola pojawiające się po zaznaczeniu komórki).",null,null,null,null,null,null,null,null,null,null,null,null,null,null,null,null,null,null,null,null,null,null,null,null,null,"szare pola - NIE ZMIENIAJ"]
[null,null,null,null,"PLIK ZOSTAŁ ZABEZPIECZONY PRZED EDYTOWANIEM. \nPROSZĘ NIE USUWAĆ ZABEZPIECZEŃ I SAMODZIELNIE NIE EDYTOWAĆ PLIKU.",null,null,null,null,null,null,null,null,null,null,null,null,null,null,null,null,null,null,null,null,null,null,null,null,null,"żółte pola - WYBIERZ Z LISTY ROZWIJANEJ"]
["WNIOSEK O DOFINANSOWANIE W RAMACH RZĄDOWEGO FUNDUSZU ROZWOJU DRÓG",null,null,null,null,null,null,null,null,null,null,null,null,null,null,null,null,null,null,null,null,null,null,null,null,null,null,null,null,null,"białe pola - WPISZ"]
["BUDOWA / ROZBUDOWA / PRZEBUDOWA"]
["PIECZĘĆ WPŁYWU DO URZĘDU WOJEWÓDZKIEGO",null,null,null,null,null,null,null,null,null,null,null,null,"NR EWIDENCYJNY \nWNIOSKU",null,null,null,null,null,null,null,null,null,null,null,null,"POLA POMOCNICZE - liczniki znaków użytych\nw komórkach",null,null,null,"PIECZĘĆ WPŁYWU DO URZĘDU WOJEWÓDZKIEGO oraz NR EWIDENCYJNY WNIOSKU uzupełniają pracownicy Świętokrzyskiego Urzędu Wojewódzkiego."]
[null,null,null,null,null,null,null,null,null,null,null,null,null,"/A /2025     "]
[null,null,null,null,null,null,null,null,null,null,null,null,null,"1. JEDNOSTKA SAMORZĄDU TERYTORIALNEGO",null,null,null,null,null,null,null,null,null,null,null,null,null,null,null,null,{"$f":"N9","v":"1. JEDNOSTKA SAMORZĄDU TERYTORIALNEGO"}]
[null,null,null,null,null,null,null,null,null,null,null,null,null,"JST  ",null,null,null,null,null,null,null,null,null,null,null,null,null,null,null,null,{"$f":"IF(Q10=\"\",\"Wybierz z listy rozwijanej jaka jednostka ubiega się o dofinansowanie (powiat czy gmina)\",IF(AND(Q10<>\"\",AY10<>\"B\"),\"OK\",\"Błąd danej - wprowadź poprawną daną wybierając ją z listy rozwijanej\"))","v":"Wybierz z listy rozwijanej jaka jednostka ubiega się o dofinansowanie (powiat czy gmina)"},null,null,null,null,null,null,null,null,null,null,null,null,null,null,null,null,null,null,{"$f":"IF(AE10=\"\",\"\",IF(AE10=\"OK\",\"OK\",IF(AE10=\"Wprowadzono błędną daną - wprowadź poprawną daną wybierając ją z listy rozwijanej\",\"B\",\"W\")))","v":"W"},{"$f":"IFERROR(IF(Q10=\"\",\"\",VLOOKUP(Q10,DANE!B8:B9,1,0)),\"B\")","v":""}]
[null,null,null,null,null,null,null,null,null,null,null,null,null,"POWIAT  ",null,null,null,null,null,null,null,null,null,null,null,null,null,null,null,null,{"$f":"IF(AND(Q10=\"\",Q11=\"\"),\"\",IF(AND(Q10=\"POWIAT\",Q11=\"\"),\"Wybierz z listy rozwijanej powiat\",IF(AND(Q10=\"\",Q11<>\"\"),\"Wybierz z listy rozwijanej JST (pole powyżej)\",IF(AND(Q10=\"GMINA\",Q11=\"\"),\"Wybierz z listy rozwijanej powiat, w którym znajduje się gmina\",IF(AY11=\"b\",\"Błąd danej - wprowadź poprawną daną wybierając ją z listy rozwijanej\",\"OK\")))))","v":""},null,null,null,null,null,null,null,null,null,null,null,null,null,null,null,null,null,null,{"$f":"IF(AE11=\"\",\"\",IF(AE11=\"OK\",\"OK\",IF(AE11=\"Wprowadzono błędną daną - wprowadź poprawną daną wybierając ją z listy rozwijanej\",\"B\",\"W\")))","v":""},{"$f":"IFERROR(IF(Q11=\"\",\"\",VLOOKUP(Q11,POWIAT[POWIAT],1,FALSE)),\"B\")","v":""}]
[null,null,null,null,null,null,null,null,null,null,null,null,null,{"$f":"IF(Q10=\"powiat\",\"\",\"GMINA  \")","v":"GMINA  "},null,null,null,null,null,null,null,null,null,null,null,null,null,null,null,null,{"$f":"IF(AND(Q10=\"POWIAT\",Q12=\"\"),\"\",IF(AND(Q10=\"POWIAT\",Q12<>\"\"),\"Błąd danej - błędnie wskazana JST lub GMINA\",IF(AND(Q10=\"GMINA\",Q11=\"\"),\"\",IF(AND(Q10=\"GMINA\",Q11<>\"\",Q12=\"\"),\"Wybierz z listy rozwijanej gminę\",IF(AND(Q10=\"\",Q11<>\"\",Q12<>\"\"),\"Wybierz z listy rozwijanej JST (dwa pola powyżej)\",IF(AND(Q10=\"\",Q11=\"\",Q12<>\"\"),\"Wybierz z listy rozwijanej JST (dwa pola powyżej) oraz POWIAT (pole powyżej)\",IF(AND(Q10=\"\",Q11=\"\",Q12=\"\"),\"\",IF(AND(Q10<>\"\",AX10=\"b\"),\"\",\"OK\"))))))))","v":""},null,null,null,null,null,null,null,null,null,null,null,null,null,null,null,null,null,null,{"$f":"IFERROR(IF(AE12=\"\",\"\",IF(AE12=\"OK\",\"OK\",IF(FIND(\"błąd danej\",AE12),\"B\",\"W\"))),\"W\")","v":""}]
[null,null,null,null,null,null,null,null,null,null,null,null,null,"NR TERC  ",null,null,{"$f":"IFERROR(IF(Q10=\"powiat\",VLOOKUP(Q11,DANE!$D$46:$H$58,4,0),IF(Q10=\"gmina\",VLOOKUP(Q12,DANE!$E$59:$H$159,3,0),\"\")),\"\")","v":""},null,null,null,null,null,{"$f":"IFERROR(IF(Q10=\"powiat\",VLOOKUP(Q11,DANE!$D$46:$H$58,5,0),IF(Q10=\"gmina\",VLOOKUP(Q12,DANE!$E$59:$H$159,4,0),\"\")),\"\")","v":""},null,null,null,null,"↓",null,null,{"$f":"IF(Q13=\"\",\"NR TERC ładuje się automatycznie po uzupełnieniu powyższych danych dotyczących jst\",IF(AND(Q10=\"POWIAT\",Q13<>\"\",AY13=4),\"OK - Załadowano NR TERC dla powiatu\",IF(AND(Q10=\"GMINA\",Q13<>\"\",AY13=7),\"OK - Załadowano NR TERC dla gminy\",IF(AND(Q10=\"POWIAT\",Q13<>\"\",AY13=7),\"Błąd danej - Załadowano NR TERC dla gminy\",IF(AND(Q10=\"GMINA\",Q13<>\"\",AY13=4),\"błąd danej - Załadowano NR TERC dla powiatu\",\"\")))))","v":"NR TERC ładuje się automatycznie po uzupełnieniu powyższych danych dotyczących jst"},null,null,null,null,null,null,null,null,null,null,null,null,null,null,null,null,null,null,{"$f":"IF(AE13=\"\",\"\",IF(AE13=\"NR TERC ładuje się automatycznie po uzupełnieniu powyższych danych dotyczących jst\",\"\",IFERROR(IF(FIND(\"OK\",AE13),\"OK\",\"\"),IF(FIND(\"Błąd danej\",AE13),\"B\",\"\"))))","v":""},{"$f":"LEN(Q13)","v":0}]
[null,null,null,null,null,null,null,null,null,null,null,null,null,"ADRES  ",null,null,null,null,null,null,null,null,null,null,null,null,{"$f":"LEN(Q14)","v":0},"z",120,null,{"$f":"IF(AA14=0,\"Wpisz adres jednostki samorządu terytorialnego ubiegającej się o dofinansowanie - [można użyć do 120 znaków]\",IF(AA14>120,\"błąd danej - Wprowadzono zbyt dużą ilość znków. Zmniejsz ilość wprowadzonych znaków\",\"Wprowadzono dane dotyczące adresu jednostki samorządu terytorialnego\"))","v":"Wpisz adres jednostki samorządu terytorialnego ubiegającej się o dofinansowanie - [można użyć do 120 znaków]"},null,null,null,null,null,null,null,null,null,null,null,null,null,null,null,null,null,null,{"$f":"IF(AE14=\"\",\"\",IF(AND(AA14>0,AE14=\"Wprowadzono dane dotyczące adresu jednostki samorządu terytorialnego\"),\"D\",IF(AND(AA14=0,AE14=\"Wpisz adres jednostki samorządu terytorialnego ubiegającej się o dofinansowanie - [można użyć do 120 znaków]\"),\"W\",IFERROR(IF(AE14=\"Wprowadzono zbyt dużą ilość znków. Zmniejsz ilość wprowadzonych znaków\",\"B\",\"\"),\"\"))))","v":"W"}]
["2. ","TYTUŁ ZADANIA (nazwa zadania)",null,null,null,null,null,null,null,null,null,null,null,null,null,null,null,null,null,null,null,null,null,null,null,null,null,null,null,null,{"$f":"_xlfn.CONCAT(A15,B15)","v":"2. TYTUŁ ZADANIA (nazwa zadania)"}]
[null,null,null,null,null,null,null,null,null,null,null,null,null,null,null,null,null,null,null,null,null,null,null,null,null,null,{"$f":"LEN(A16)","v":0},"z",300,null,"Wpisz tytuł zadania (nazwę zadania) - [można użyć do 300 wszystkich znaków]\nWAŻNE:\nTytuł powinien identyfikować zadanie (rodzaj robót i ich lokalizację: nazwa ulicy, nr drogi i lokalizacja drogi) oraz sugerować klasyfikację środków (remont / budowa / rozbudowa / przebudowa)"]
["3. \n","LOKALIZACJA ZADANIA (kategoria, numer i lokalizacja drogi, na której znajduje się realizowane zadanie)",null,null,null,null,null,null,null,null,null,null,null,null,null,null,null,null,null,null,null,null,null,null,null,null,null,null,null,null,{"$f":"_xlfn.CONCAT(A17,B17)","v":"3. \nLOKALIZACJA ZADANIA (kategoria, numer i lokalizacja drogi, na której znajduje się realizowane zadanie)"}]
["L.p.","KATEGORIA",null,null,"NR DROGI",null,null,"POWIAT ",null,null,null,"GMINA",null,null,null,null,null,null,"MIEJSCOWOŚĆ",null,null,null,null,null,null,null,null,null,null,null,"Wybierz z list rozwijanych kategorię drogi oraz powiat i gminę"]
[1,null,null,null,null,null,null,null,null,null,null,null,null,null,null,null,null,null,null,null,null,null,null,null,null,null,null,null,null,null,"Wpisz nr drogi, na której znajduje się zgłoszone zadanie oraz miejscowość"]
[null,null,null,null,null,null,null,null,null,null,null,null,null,null,null,null,null,null,null,null,null,null,null,null,null,null,{"$f":"LEN(A20)","v":0},"z",400,null,"(miejsce na dodatkowe informacje dotyczące rodzaju i lokalizacji zadania np., gdy droga biegnie przez więcej niż jedną gminę lub więcej niż jedną miejscowość)"]
["4. ","PRZEWIDYWANY OKRES REALIZACJI ZADANIA (rozpoczęcie i zakończenie realizacji zadania)",null,null,null,null,null,null,null,null,null,null,null,null,null,null,null,null,null,null,null,null,null,null,null,null,null,null,null,null,{"$f":"_xlfn.CONCAT(A21,B21)","v":"4. PRZEWIDYWANY OKRES REALIZACJI ZADANIA (rozpoczęcie i zakończenie realizacji zadania)"}]
["Zadanie ",null,null,{"$f":"IF(AND(R22=\"\",R23=\"\",W23=\"\"),\"\",IFERROR(IF(BG22=0,\"nie wybrano lub błędnie wybrano daty realizacji zadania\",IF(BG22<12,\"JEDNOROCZNE\",\"WIELOLETNIE\")),\"nie wybrano lub błędnie wybrano daty realizacji zadania\"))","v":""},null,null,null,null,null,null,null,null,"realizowane ",null,null,null,"od ",null,null,null,null,null,2025,null,null,null,null,null,null,null,"Wybierz z listy rozwijanej przewidywany miesiąc rozpoczęcia robót budowlanych",null,null,null,null,null,null,null,null,null,null,null,null,null,null,null,null,null,null,null,null,null,null,null,null,null,{"$f":"IF(R22=\"stycznia\",1,IF(R22=\"lutego\",2,IF(R22=\"marca\",3,IF(R22=\"kwietnia\",4,IF(R22=\"maja\",5,IF(R22=\"czerwca\",6,IF(R22=\"lipca\",7,IF(R22=\"sierpnia\",8,IF(R22=\"września\",9,IF(R22=\"października\",10,IF(R22=\"listopada\",11,IF(R22=\"grudnia\",12,\"\"))))))))))))","v":""},{"$f":"DATE(W22,BE22,1)","v":{"$error":"#VALUE!"}},{"$f":"DATEDIF(BF22,BF23,\"m\")","v":{"$error":"#VALUE!"}}]
[null,null,null,null,null,null,null,null,null,null,null,null,null,null,null,null,"do ",null,null,null,null,null,null,null,null,null,null,null,null,null,"Wybierz z listy rozwijanej przewidywany miesiąc i rok zakończenia robót budowlanych",null,null,null,null,null,null,null,null,null,null,null,null,null,null,null,null,null,null,null,null,null,null,null,null,null,{"$f":"IF(R23=\"stycznia\",1,IF(R23=\"lutego\",2,IF(R23=\"marca\",3,IF(R23=\"kwietnia\",4,IF(R23=\"maja\",5,IF(R23=\"czerwca\",6,IF(R23=\"lipca\",7,IF(R23=\"sierpnia\",8,IF(R23=\"września\",9,IF(R23=\"października\",10,IF(R23=\"listopada\",11,IF(R23=\"grudnia\",12,\"\"))))))))))))","v":""},{"$f":"DATE(W23,BE23,1)","v":{"$error":"#VALUE!"}},{"$f":"IFERROR(IF(BG22>0,\"OK\",\"BŁĄD\"),\"liczba\")","v":"liczba"}]
["5. ","DŁUGOŚĆ ODCINKÓW DRÓG OBJĘTYCH ZADANIEM, WG RODZAJU ROBÓT BUDOWLANYCH [km]",null,null,null,null,null,null,null,null,null,null,null,null,null,null,null,null,null,null,null,null,null,null,null,null,null,null,null,null,{"$f":"_xlfn.CONCAT(A24,B24)","v":"5. DŁUGOŚĆ ODCINKÓW DRÓG OBJĘTYCH ZADANIEM, WG RODZAJU ROBÓT BUDOWLANYCH [km]"}]
["BUDOWA",null,null,null,null,null,null,null,"PRZEBUDOWA",null,null,null,null,null,null,null,"ŁĄCZNIE",null,null,null,null,null,null,null,null,null,null,null,null,null,"Wpisz długość odcinka objętego danym rodzajem robót budowlanych (długość podaj w metrach)",null,null,null,null,null,null,null,null,null,null,null,null,null,null,null,null,null,null,null,null,null,null,null,null,null,"funkcja do opracowania/zastanowienia"]
[null,null,null,null,null,null,null,"m",null,null,null,null,null,null,null,"m",{"$f":"IF(AND(I26=\"\",A26=\"\"),\"\",A26+I26)","v":""},null,null,null,null,null,null,null,null,"m",null,null,null,null,"Łączna długość załaduje się automatycznie. Powinna być taka sama jak realizowana długość odcinka w pkt 9",null,null,null,null,null,null,null,null,null,null,null,null,null,null,null,null,null,null,null,null,null,null,null,null,null,{"$f":"IF(AND(A26=\"\",G26=\"\",M26=\"\"),\"\",IF(AND(A26<>\"\",G26=\"\",M26=\"\"),\"BUDOWA\",IF(AND(A26=\"\",G26<>\"\",M26=\"\"),\"ROZBUDOWA\",IF(AND(A26=\"\",G26=\"\",M26<>\"\"),\"PRZEBUDOWA\",IF(AND(A26<>\"\",G26<>\"\",M26=\"\",A26>G26),\"BUDOWA (rozbudowa)\",IF(AND(A26<>\"\",G26<>\"\",M26=\"\",A26<G26),\"ROZBUDOWA (budowa)\",IF(AND(A26<>\"\",G26=\"\",M26<>\"\",A26>M26),\"BUDOWA (przebudowa)\",IF(AND(A26<>\"\",G26=\"\",M26<>\"\",A26<M26),\"PRZEBUDOWA (budowa)\",IF(AND(A26=\"\",G26<>\"\",M26<>\"\",G26>M26),\"ROZBUDOWA (przebudowa)\",IF(AND(A26=\"\",G26<>\"\",M26<>\"\",G26<M26),\"PRZEBUDOWA (rozbudowa)\",IF(AND(A26<>\"\",G26<>\"\",M26<>\"\",A26>M26,A26>G26,G26>M26),\"BUDOWA (rozbudowa, przebudowa)\",IF(AND(A26<>\"\",G26<>\"\",M26<>\"\",A26>M26,A26>G26,G26<M26),\"BUDOWA (przebudowa, rozbudowa)\",IF(AND(A26<>\"\",G26<>\"\",M26<>\"\",G26>A26,G26>M26,A26>M26),\"ROZBUDOWA (budowa, przebudowa)\",IF(AND(A26<>\"\",G26<>\"\",M26<>\"\",G26>A26,G26>M26,A26<M26),\"ROZBUDOWA (przebudowa, budowa)\",IF(AND(A26<>\"\",G26<>\"\",M26<>\"\",M26>A26,M26>G26,A26>G26),\"PRZEBUDOWA (budowa, rozbudowa)\",IF(AND(A26<>\"\",G26<>\"\",M26<>\"\",M26>A26,M26>G26,A26<G26),\"PRZEBUDOWA (rozbudowa, budowa)\",\"\"))))))))))))))))","v":""}]
["6. ","PRZEWIDYWANY HARMONOGRAM RZECZOWO-FINANSOWY REALIZACJI ZADANIA (brutto)",null,null,null,null,null,null,null,null,null,null,null,null,null,null,null,null,null,null,null,null,null,null,null,null,null,null,null,null,{"$f":"_xlfn.CONCAT(A27,B27)","v":"6. PRZEWIDYWANY HARMONOGRAM RZECZOWO-FINANSOWY REALIZACJI ZADANIA (brutto)"}]
["Lp.","ELEMENTY I RODZAJE ROBÓT",null,null,null,null,null,null,null,null,"KOSZT KWALIFIKOWALNY [zł]",null,null,null,null,null,null,null,"KOSZT NIEKWALIFIKOWALNY [zł]"]
["1.","Roboty budowlane",null,null,null,null,null,null,null,null,null,null,null,null,null,null,null,null,null,null,null,null,null,null,null,null,null,null,null,null,"Wpisz koszt brutto robót budowlanych w podziale na wydatki kwalifikowalne i niekwalifikowalne"]
["2.","Nadzór inwestorski (wszystkie branże)",null,null,null,null,null,null,null,null,null,null,null,null,null,null,null,null,null,null,null,null,null,null,null,null,null,null,null,null,"Wpisz koszt brutto nadzoru inwestorskiego (wszystkie branże) w podziale na wydatki kwalifikowalne i niekwalifikowalne"]
["3.","Tablice informacyjne",null,null,null,null,null,null,null,null,null,null,null,null,null,null,null,null,null,null,null,null,null,null,null,null,null,null,null,null,"Wpisz koszt brutto tablic informacyjnych w podziale na wydatki kwalifikowalne i niekwalifikowalne"]
["4.","Dodatkowy obowiązek informacyjny\n(jeśli dotyczy na podst. art. 38 ust. 6 ustawy o RFRD)"]
["SUMA ",null,null,null,null,null,null,null,null,null,{"$f":"SUM(K29:R32)","v":0},null,null,null,null,null,null,null,{"$f":"SUM(S29:Z32)","v":0},null,null,null,null,null,null,null,null,null,null,null,"SUMY OBLICZĄ SIĘ AUTOMATYCZNIE"]
["OGÓŁEM ",null,null,null,null,null,null,null,null,null,{"$f":"SUM(K33,S33)","v":0},null,null,null,null,null,null,null,null,null,null,null,null,null,null,null,null,null,null,null,"KWOTA OGÓŁEM OBLICZY SIĘ AUTOMATYCZNIE"]
["7. ","PRZEWIDYWANE KOSZTY REALIZACJI ZADANIA BRUTTO - WYDATKI KWALIFIKOWALNE [zł]",null,null,null,null,null,null,null,null,null,null,null,null,null,null,null,null,null,null,null,null,null,null,null,null,null,null,null,null,{"$f":"_xlfn.CONCAT(A35,B35)","v":"7. PRZEWIDYWANE KOSZTY REALIZACJI ZADANIA BRUTTO - WYDATKI KWALIFIKOWALNE [zł]"}]
["A.","ŁĄCZNY KOSZT REALIZACJI ZADANIA [zł]",null,null,null,null,null,null,null,null,null,null,null,null,null,null,null,null,null,null,{"$f":"K33","v":0},null,null,null,null,null,null,null,null,null,"Koszty i kwoty słownie załadują się automatycznie po poprawnym wypełnieniu pkt 6 wniosku",null,null,null,null,null,null,null,null,null,null,null,null,null,null,null,null,null,null,null,null,null,null,null,null,null,{"$f":"IF(K33=U36,\"ok\",\"b\")","v":"ok"},null,{"$f":"IF(U36<0,\"b\",\"OK\")","v":"OK"}]
[null,"SŁOWNIE :",null,null,{"$f":"IF(OR(U36=0,U36=\"\"),\"\",Slownie(U36))","v":""}]
["B.","KWOTA WNIOSKOWANEGO DOFINANSOWANIA [zł]",null,null,null,null,null,null,null,null,null,null,null,null,null,null,null,null,null,null,{"$f":"IF(OR(U36=\"\",U42=\"\"),\"\",IF(ROUNDDOWN(U36*U42,0)>30000000,BF38,ROUNDDOWN((U36*U42),0)))","v":0},null,null,null,null,null,null,null,null,null,"Kwota dofinansowania nie może przekraczać 30 mln zł, jeśli przekracza, to wniosek ją automatycznie zmniejsza do kwoty maksymalnej",null,null,null,null,null,null,null,null,null,null,null,null,null,null,null,null,null,null,null,null,null,null,null,null,null,{"$f":"IF(U38>BF38,\"b\",\"ok\")","v":"ok"},30000000,{"$f":"IF(U38<0,\"b\",\"OK\")","v":"OK"}]
[null,"SŁOWNIE :",null,null,{"$f":"IF(OR(U38=0,U38=\"\"),\" \",Slownie(U38))","v":" "}]
["C.","KWOTA WKŁADU WŁASNEGO [zł]",null,null,null,null,null,null,null,null,null,null,null,null,null,null,null,null,null,null,{"$f":"IF(OR(U36=\"\",U42=\"\"),\"\",U36-U38)","v":0},null,null,null,null,null,null,null,null,null,null,null,null,null,null,null,null,null,null,null,null,null,null,null,null,null,null,null,null,null,null,null,null,null,null,null,null,null,{"$f":"IF(U40<0,\"b\",\"OK\")","v":"OK"}]
[null,"SŁOWNIE :",null,null,{"$f":"IF(OR(U40=0,U40=\"\"),\" \",Slownie(U40))","v":" "}]
["D.","UDZIAŁ DOFINANSOWANIA W KOSZTACH KWALIFIKOWALNYCH ZADANIA [%]",null,null,null,null,null,null,null,null,null,null,null,null,null,null,null,null,null,null,0.8,null,null,null,null,null,null,null,null,null,"Poziom dofinansowania nie może przekraczać 80,00%. Wprowadzono 80,00%, ale dana ta może ulec zmianie zgodnie z zatwierdzoną listą",null,null,null,null,null,null,null,null,null,null,null,null,null,null,null,null,null,null,null,null,null,null,null,null,null,null,{"$f":"U38/U36","v":{"$error":"#DIV/0!"}},{"$f":"IF(U42<0,\"b\",\"OK\")","v":"OK"}]
["8. ","PRZEWIDYWANY TERMIN DOKONYWANIA WYPŁAT NA RZECZ WYKONAWCY ZADANIA",null,null,null,null,null,null,null,null,null,null,null,null,null,null,null,null,null,null,null,null,null,null,null,null,null,null,null,null,{"$f":"_xlfn.CONCAT(A43,B43)","v":"8. PRZEWIDYWANY TERMIN DOKONYWANIA WYPŁAT NA RZECZ WYKONAWCY ZADANIA"}]
["KWOTA DO WYPŁATY W DANYM ROKU NA RZECZ WYKONAWCY ZADANIA ",null,null,null,null,null,null,null,null,null,null,null,null,null,null,null,null,null,null,null,null,null,null,null,null,null,null,null,null,null,"Uzupełnij dane dotyczące dokonywania wypłat na rzecz wykonawcy zadania w podziale na poszczególne lata oraz na wydatki kwalifikowalne i niekwalifikowalne. Wydatki kwalifikowalne należy podać w podziale na dofinansowanie i wkład własny."]
["ROK",null,null,"KWALIFIKOWALNE",null,null,null,null,null,null,null,null,null,"NIEKWALIFIKOWALNE",null,null,null,null,null,null,"OGÓŁEM"]
[null,null,null,"DOFINANSOWANIE",null,null,null,null,"WKŁAD WŁASNY"]
[2025,null,null,null,null,null,null,null,null,null,null,null,null,null,null,null,null,null,null,null,{"$f":"IF(AND(D47=\"\",I47=\"\",N47=\"\"),\"\",SUM(D47:T47))","v":""},null,null,null,null,null,null,null,null,null,"Jeśli dane nie będą wprowadzone poprawnie, to kwoty sum i łącznie wyświetlą się czerwoną czcionką. \nBędzie to miało miejsce w przypadku, gdy:\n - kwota dofinansowania (suma z wiersza 53), będzie się różnić od kwoty dofinansowania w pkt 7 lit. B (wiersz 38);\n - kwota wkładu własnego (suma z wiersza 53), będzie się różnić od kwoty wkładu własnego w pkt 7 lit. C (wiersz 40);\n - kwota środków kwalifikowalnych (łącznie z wiersza 54), będzie się różnić od kwoty łącznego kosztu realizacji zadania w pkt 7 lit. A (wiersz 36);\n - kwota środków niekwalifikowalnych (łącznie z wiersza 54), będzie się różnić od kwoty kosztów niekwalifikowalnych w pkt 6 (wiersz 33);\n - kwota środków ogółem (łącznie z wiersza 54), będzie się różnić od kwoty kosztów ogółem w pkt 6 (wiersz 34);\n\nNależy wtedy poprawić kwoty z wierszy 47-52 lub kwoty z pkt 6 (jeśli tam zostały wprowadzone błędnie)"]
[2026,null,null,null,null,null,null,null,null,null,null,null,null,null,null,null,null,null,null,null,{"$f":"IF(AND(D48=\"\",I48=\"\",N48=\"\"),\"\",SUM(D48:T48))","v":""}]
[2027,null,null,null,null,null,null,null,null,null,null,null,null,null,null,null,null,null,null,null,""]
[2028,null,null,null,null,null,null,null,null,null,null,null,null,null,null,null,null,null,null,null,""]
[2029,null,null,null,null,null,null,null,null,null,null,null,null,null,null,null,null,null,null,null,""]
[2030,null,null,null,null,null,null,null,null,null,null,null,null,null,null,null,null,null,null,null,""]
["SUMA",null,null,{"$f":"SUM(D47:H52)","v":0},null,null,null,null,{"$f":"SUM(I47:M52)","v":0},null,null,null,null,null,null,null,null,null,null,null,null,null,null,null,null,null,null,null,null,null,null,null,null,null,null,null,null,null,null,null,null,null,null,null,null,null,null,null,null,null,null,null,null,null,null,null,{"$f":"IF(U38=\"\",\"ok\",IF(D53<>U38,\"błąd\",\"ok\"))","v":"ok"},{"$f":"IF(U40=\"\",\"ok\",IF(I53<>U40,\"błąd\",\"ok\"))","v":"ok"}]
["ŁĄCZNIE",null,null,{"$f":"D53+I53","v":0},null,null,null,null,null,null,null,null,null,{"$f":"SUM(N47:T52)","v":0},null,null,null,null,null,null,{"$f":"SUM(U47:Z52)","v":0},null,null,null,null,null,null,null,null,null,null,null,null,null,null,null,null,null,null,null,null,null,null,null,null,null,null,null,null,null,null,null,null,null,null,null,{"$f":"IF(U36=\"\",\"ok\",IF(D54<>U36,\"błąd\",\"ok\"))","v":"ok"},{"$f":"IF(N54<>S33,\"błąd\",\"ok\")","v":"ok"},{"$f":"IF(U54<>K34,\"błąd\",\"ok\")","v":"ok"}]
["9.\n ","OPIS ZADANIA OBEJMUJĄCY STAN ISTNIEJĄCY ORAZ PROJEKTOWANY WRAZ Z UZASADNIENIEM REALIZACJI ZADANIA",null,null,null,null,null,null,null,null,null,null,null,null,null,null,null,null,null,null,null,null,null,null,null,null,null,null,null,null,{"$f":"_xlfn.CONCAT(A55,B55)","v":"9.\n OPIS ZADANIA OBEJMUJĄCY STAN ISTNIEJĄCY ORAZ PROJEKTOWANY WRAZ Z UZASADNIENIEM REALIZACJI ZADANIA"}]
["PARAMETRY ODCINKA",null,null,null,null,null,null,null,"STAN ISTNIEJĄCY",null,null,null,null,null,null,null,null,"STAN PROJEKTOWANY",null,null,null,null,null,null,null,null,null,null,null,null,"Parametry odcinka dotyczą stanu istniejącego oraz stanu projektowanego, czyli stanu jaki ma zostać osiągnięty w wyniku budowy lub przebudowy"]
[null,"kategoria drogi ",null,null,null,null,null,null,{"$f":"IF(B19=\"\",\"\",B19)","v":""},null,null,null,null,null,null,null,null,null,null,null,null,null,null,null,null,null,null,null,null,null,"Wpisz lub wybierz z list rozwijanych dane dotyczące kategorii drogi, numeru drogi, rodzaju drogi, rodzaju robót budowlanych, realizowanego kilometraża i długości odcinka"]
[null,"numer drogi "]
[null,"klasa drogi "]
[null,"rodzaj drogi "]
[null,"rodzaj robót budowlanych "]
[null,"realizowany kilometraż "]
[null,"realizowana długość odcinka ",null,null,null,null,null,null,null,null,null,null,null,null,null,null,null,null,null,null,null,null,null,null,null,"m"]
[]
[null,"przekrój jezdni",null,null,null,null,null,null,null,null,null,null,null,null,null,null,null,null,null,null,null,null,null,null,null,null,null,null,null,null,"Wpisz dane dotyczące przekroju jezdni, szerokości jezdni i szerokości pasa ruchu.\nJeśli powyższe parametry nie są zgodne z warunkami technicznymi, to należy wystąpić o zgodę na odstępstwo od przepisów budowlanych i załączyć stosowny dokument do wniosku"]
[null,"szerokość jezdni ",null,null,null,null,null,null,null,null,null,null,null,null,null,null,"m",null,null,null,null,null,null,null,null,"m"]
[null,"szerokość pasa ruchu ",null,null,null,null,null,null,null,null,null,null,null,null,null,null,"m",null,null,null,null,null,null,null,null,"m"]
[null,"zgoda na odstępstwo od przepisów"]
[]
[null,"pobocza",null,null,null,null,null,null,null,null,null,null,null,null,null,null,null,null,null,null,null,null,null,null,null,null,null,null,null,null,"Uzupełnij dane dotyczące poboczy przez wybranie z list rozwijanych \"TAK/NIE\", czy odcinek posiada pobocza - w stanie istniejącym, oraz czy pobocza będą realizowane w ramach zadania - w stanie projektowanym.\nJeśli \"TAK\", to proszę wypełnić dane dotyczące długości i szerokości poboczy."]
[null,"o nawierzchni gruntowej \n(strona prawa)",null,null,null,null,null,null,"dł.",null,null,"m","szer.",null,null,null,"m","dł.",null,null,"m","szer.",null,null,null,"m"]
[null,"o nawierzchni gruntowej \n(strona lewa)",null,null,null,null,null,null,"dł.",null,null,"m","szer.",null,null,null,"m","dł.",null,null,"m","szer.",null,null,null,"m"]
[null,"o nawierzchni gruntowej",null,null,null,null,null,null,"dł.",{"$f":"IF(AND(J71=\"\",J72=\"\"),\"\",SUM(J71:K72))","v":""},null,"m",null,null,null,null,null,"dł.",{"$f":"IF(AND(S71=\"\",S72=\"\"),\"\",SUM(S71:T72))","v":""},null,"m"]
[null,"o nawierzchni twardej \n(strona prawa)",null,null,null,null,null,null,"dł.",null,null,"m","szer.",null,null,null,"m","dł.",null,null,"m","szer.",null,null,null,"m"]
[null,"o nawierzchni twardej \n(strona lewa)",null,null,null,null,null,null,"dł.",null,null,"m","szer.",null,null,null,"m","dł.",null,null,"m","szer.",null,null,null,"m"]
[null,"o nawierzchni twardej",null,null,null,null,null,null,"dł.",{"$f":"IF(AND(J74=\"\",J75=\"\"),\"\",SUM(J74:K75))","v":""},null,"m",null,null,null,null,null,"dł.",{"$f":"IF(AND(S74=\"\",S75=\"\"),\"\",SUM(S74:T75))","v":""},null,"m"]
[]
[null,"droga dla pieszych (chodnik)",null,null,null,null,null,null,null,null,null,null,null,null,null,null,null,null,null,null,null,null,null,null,null,null,null,null,null,null,"Uzupełnij dane dotyczące chodnika przez wybranie z list rozwijanych \"TAK/NIE\", czy odcinek posiada chodnik - w stanie istniejącym, oraz czy chodnik będzie realizowany w ramach zadania - w stanie projektowanym.\nJeśli \"TAK\", to proszę wypełnić dane dotyczące długości i szerokości chodnika."]
[null,"droga dla pieszych\n(strona prawa)",null,null,null,null,null,null,"dł.",null,null,"m","szer.",null,null,null,"m","dł.",null,null,"m","szer.",null,null,null,"m"]
[null,"droga dla pieszych\n(strona lewa)",null,null,null,null,null,null,"dł.",null,null,"m","szer.",null,null,null,"m","dł.",null,null,"m","szer.",null,null,null,"m"]
[null,"łączna długość \ndrogi dla pieszych",null,null,null,null,null,null,"dł.",{"$f":"IF(AND(J79=\"\",J80=\"\"),\"\",SUM(J79:K80))","v":""},null,"m",null,null,null,null,null,"dł.",{"$f":"IF(AND(S79=\"\",S80=\"\"),\"\",SUM(S79:T80))","v":""},null,"m"]
[]
[null,"droga dla pieszych i rowerów",null,null,null,null,null,null,null,null,null,null,null,null,null,null,null,null,null,null,null,null,null,null,null,null,null,null,null,null,"Uzupełnij dane dotyczące drogi dla pieszych i rowerów przez wybranie z list rozwijanych \"TAK/NIE\", czy odcinek posiada drogę dla pieszych i rowerów - w stanie istniejącym, oraz czy droga dla pieszych i rowerów będzie realizowana w ramach zadania - w stanie projektowanym.\nJeśli \"TAK\", to proszę wypełnić dane dotyczące długości i szerokości drogi dla pieszych i rowerów.",null,null,null,null,null,null,null,null,null,null,null,null,null,null,null,null,null,null,null,null,null,null,null,null,null,{"$f":"IF(R83=\"\",\"\",R83)","v":""}]
[null,"droga dla pieszych i rowerów\n(strona prawa)",null,null,null,null,null,null,"dł.",null,null,"m","szer.",null,null,null,"m","dł.",null,null,"m","szer.",null,null,null,"m"]
[null,"droga dla pieszych i rowerów\n(strona lewa)",null,null,null,null,null,null,"dł.",null,null,"m","szer.",null,null,null,"m","dł.",null,null,"m","szer.",null,null,null,"m"]
[null,"łączna długość \ndrogi dla pieszych i rowerów",null,null,null,null,null,null,"dł.",{"$f":"IF(AND(J84=\"\",J85=\"\"),\"\",SUM(J84:K85))","v":""},null,"m",null,null,null,null,null,"dł.",{"$f":"IF(AND(S84=\"\",S85=\"\"),\"\",SUM(S84:T85))","v":""},null,"m"]
[]
[null,"droga dla rowerów",null,null,null,null,null,null,null,null,null,null,null,null,null,null,null,null,null,null,null,null,null,null,null,null,null,null,null,null,"Uzupełnij dane dotyczące drogi dla rowerów przez wybranie z list rozwijanych \"TAK/NIE\", czy odcinek posiada drogę dla rowerów - w stanie istniejącym, oraz czy droga dla rowerów będzie realizowana w ramach zadania - w stanie projektowanym.\nJeśli \"TAK\", to proszę wypełnić dane dotyczące długości i szerokości drogi dla rowerów."]
[null,"droga dla rowerów\n(strona prawa)",null,null,null,null,null,null,"dł.",null,null,"m","szer.",null,null,null,"m","dł.",null,null,"m","szer.",null,null,null,"m"]
[null,"droga dla pieszych\n(strona lewa)",null,null,null,null,null,null,"dł.",null,null,"m","szer.",null,null,null,"m","dł.",null,null,"m","szer.",null,null,null,"m"]
[null,"łączna długość \ndrogi dla rowerów",null,null,null,null,null,null,"dł.",{"$f":"IF(AND(J89=\"\",J90=\"\"),\"\",SUM(J89:K90))","v":""},null,"m",null,null,null,null,null,"dł.",{"$f":"IF(AND(S89=\"\",S90=\"\"),\"\",SUM(S89:T90))","v":""},null,"m"]
[]
[null,"stan istniejący",null,null,null,null,null,null,null,null,null,null,null,null,null,null,null,null,null,null,null,null,null,null,null,null,{"$f":"LEN(F93)","v":0},"z",800,null,"Opisz stan istniejący odcinka, czyli stan w jakim znajdują się elementy drogi"]
[null,"stan projektowany",null,null,null,null,null,null,null,null,null,null,null,null,null,null,null,null,null,null,null,null,null,null,null,null,{"$f":"LEN(F94)","v":0},"z",800,null,"Opisz stan jaki ma zostać osiągnięty w wyniku budowy lub przebudowy"]
[null,"uzasadnienie",null,null,null,null,null,null,null,null,null,null,null,null,null,null,null,null,null,null,null,null,null,null,null,null,{"$f":"LEN(F95)","v":0},"z",800,null,"Uzasadnij realizację zadania"]
["10. ","CHARAKTERYSTYKA ZADANIA WEDŁUG KRYTERIÓW OCENY MERYTORYCZNEJ",null,null,null,null,null,null,null,null,null,null,null,null,null,null,null,null,null,null,null,null,null,null,null,null,null,null,null,null,{"$f":"_xlfn.CONCAT(A96,B96)","v":"10. CHARAKTERYSTYKA ZADANIA WEDŁUG KRYTERIÓW OCENY MERYTORYCZNEJ"}]
[null,"Kryterium nr 1",null,null,null,"-","Poprawa stanu bezpieczeństwa ruchu drogowego, ze szczególnym uwzględnieniem bezpieczeństwa ruchu drogowego niechronionych uczestników ruchu",null,null,null,null,null,null,null,null,null,null,null,null,null,null,null,null,null,null,null,null,null,null,null,{"$f":"_xlfn.CONCAT(A97,B97,\" \",F97,\" \",G97)","v":"Kryterium nr 1 - Poprawa stanu bezpieczeństwa ruchu drogowego, ze szczególnym uwzględnieniem bezpieczeństwa ruchu drogowego niechronionych uczestników ruchu"}]
["A. ","Ryzyko wypadków.\nOdcinek drogi przebiega przez gminę/powiat o dużym poziomie ryzyka społecznego pod względem:",null,null,null,null,null,null,null,null,null,null,null,null,null,null,null,null,null,null,null,null,null,null,null,null,null,null,null,null,"Dane ładują się automatycznie po poprawnym uzupełnieniu pkt 1 oraz 3 wniosku"]
[null,"1)","wypadków drogowych z udziałem pieszych ",null,null,null,null,null,null,null,null,null,null,null,null,null,null,null,null,null,null,null,null,null,{"$f":"IF($Q$10=\"\",\"\",IF($Q$10=\"powiat\",VLOOKUP($Q$11,DANE!$D$46:$K$58,6,0),VLOOKUP($Q$12,DANE!$E$59:$K$159,5,0)))","v":""}]
[null,"2)","wypadków drogowych ogółem",null,null,null,null,null,null,null,null,null,null,null,null,null,null,null,null,null,null,null,null,null,{"$f":"IF($Q$10=\"\",\"\",IF($Q$10=\"powiat\",VLOOKUP($Q$11,DANE!$D$46:$K$58,7,0),VLOOKUP($Q$12,DANE!$E$59:$K$159,6,0)))","v":""}]
[null,"3)","ofiar śmiertelnych w wypadkach drogowych",null,null,null,null,null,null,null,null,null,null,null,null,null,null,null,null,null,null,null,null,null,{"$f":"IF($Q$10=\"\",\"\",IF($Q$10=\"powiat\",VLOOKUP($Q$11,DANE!$D$46:$K$58,8,0),VLOOKUP($Q$12,DANE!$E$59:$K$159,7,0)))","v":""}]
["B. ","Bezpieczeństwo uczestników ruchu drogowego. \nRealizacja rozwiązań zwiększających bezpieczeństwo uczestników ruchu drogowego \n(poprzez budowę lub przebudowę):",null,null,null,null,null,null,null,null,null,null,null,null,null,null,null,null,null,null,null,null,null,null,null,null,null,null,null,null,"Wybierz z list rozwijanych \"TAK/NIE\", czy w ramach zadania będzie realizowana budowa/przebudowat podanych (w pkt 1 lit. a-e oraz pkt 2 lit. a-d) rozwiązań zwiększających bezpieczeństwo uczestników ruchu drogowego"]
[null,"1)","przejścia dla pieszych lub/i przejazdu dla rowerów o podwyższonym standardzie bezpieczeństwa:"]
[null,null,"a)","z oświetleniem lub/i doświetleniem"]
[null,null,"b)","z wyspą dzielącą (tzw. azylem)"]
[null,null,"c)","wyniesionego przejścia dla pieszych lub/i przejazdu dla rowerów"]
[null,null,"d)","z sygnalizacją świetlną"]
[null,null,"e)","z oznakowaniem aktywnym lub sygnalizacją ostrzegawczą"]
[null,"2)","innego rozwiązania w zakresie bezpieczeństwa nie związanego z przejściem dla pieszych lub/i przejazdem dla rowerów:"]
[null,null,"a)","wyniesionego skrzyżowania"]
[null,null,"b)","wyspy dzielącej na jezdni wraz z odgięciem toru jazdy na wjeździe do miejscowości"]
[null,null,"c)","radaru ze znakiem/tablicą zmiennej treści (aktywną), informującym o prędkości ruchu pojazdu"]
[null,null,"d)","oznakowania aktywnego na dojeździe do przejazdu kolejowo-drogowego"]
[null,"Kryterium nr 2",null,null,null,"-","Zapewnienie spójności sieci dróg publicznych ",null,null,null,null,null,null,null,null,null,null,null,null,null,null,null,null,null,null,null,null,null,null,null,{"$f":"_xlfn.CONCAT(A114,B114,\" \",F114,\" \",G114)","v":"Kryterium nr 2 - Zapewnienie spójności sieci dróg publicznych "}]
["A.\n ","Połączenie z innymi drogami publicznymi. \nBezpośrednie połączenie odcinka drogi z inną drogą publiczną wyższego rzędu",null,null,null,null,null,null,null,null,null,null,null,null,null,null,null,null,null,null,null,null,null,null,null,null,null,null,null,null,"Wybierz z listy rozwijanej \"TAK/NIE\", czy odcinek drogi ma bezpośrednie połączenie z drogą wyższego rzędu.\nJeśli \"TAK\" podaj numer drogi wyższego rzędu stosując oznaczenia: DK – droga krajowa, DW – droga wojewódzka, DP – droga powiatowa, DG – droga gminna. Numer należy podać w formacie np. DP-1234T (można użyć do 100 wszystkich znaków). Zaznacz to połączenie na załączonej mapie poglądowej."]
[null,null,null,null,null,null,null,null,null,null,null,null,null,null,null,null,null,null,null,null,null,null,null,null,null,null,{"$f":"LEN(D116)","v":0},"z",100]
[null,"jeżeli wybrano odpowiedź TAK, należy wskazać to połączenie na załączonej mapie poglądowej"]
["B.\n ","Kontynuacja zadania. \nKontynuacja robót budowlanych* realizowanych na podstawie umowy dofinansowania w ramach RFRD oraz zakończonych w ciągu 3 lat przed datą złożenia wniosku o dofinansowanie"]
[null,"*kontynuacja robót budowlanych oznacza, że wcześniejsze roboty budowlane realizowane były na odcinku drogi bezpośrednio połączonym z odcinkiem drogi objętym wnioskowanym zadaniem ",null,null,null,null,null,null,null,null,null,null,null,null,null,null,null,null,null,null,null,null,null,null,null,null,null,null,null,null,"Wybierz z listy rozwijanej 'TAK/NIE\", czy odcinek stanowi kontynuację robót budowlanych (budowy, przebudowy lub remontu) w ramach wcześniej zawartych umów o dofinansowanie ze środków RFRD i zakończonych w ciągu 3 lat przed datą złożenia wniosku o dofinansowanie.\nJeśli \"TAK\" wpisz numer umowy z wojewodą i datę jej zawarcia (np. 175/RFRD/A/2023 z dnia 30.04.2023) (można użyć do 100 znaków) oraz zaznacz to połącznie na załączonej mapie poglądowej."]
[null,null,null,null,null,null,null,null,null,null,null,null,null,null,null,null,null,null,null,null,null,null,null,null,null,null,{"$f":"LEN(D120)","v":0},"z",100]
[null,"jeżeli wybrano odpowiedź TAK, należy wskazać to połączenie na załączonej mapie poglądowej"]
["C. \n","Peryferyjność. \nOdcinek drogi biegnie przez gminę, dla której wskaźnik peryferyjności czasowej jest mniejszy niż 30 min., mieści się w przedziale od 30 do 50 minut, jest większy niż 50 min.",null,null,null,null,null,null,null,null,null,null,null,null,null,null,null,null,null,null,null,null,null,null,null,null,null,null,null,null,"Dana ładuje się automatycznie, po poprawnym wypełnieniu pkt 3 wniosku"]
[null,"wskaźnik peryferyjności czasowej:",null,null,null,null,null,null,null,null,null,null,null,{"$f":"IF(L19=\"\",\"\",VLOOKUP(L19,DANE!E46:M159,9,0))","v":""}]
["D.\n ","Uszkodzenie w wyniku niekorzystnych zjawisk atmosferycznych. \nOdcinek drogi został uszkodzony w wyniku działania niekorzystnych zjawisk atmosferycznych w ciągu 3 lat przed datą złożenia wniosku o dofinansowanie i jest ujęty w protokole strat potwierdzonym przez Wojewodę Świętokrzyskiego"]
[null,null,null,"rodzaj i data zjawiska",null,null,null,null,null,null,null,null,null,null,null,null,null,null,null,null,null,null,null,null,null,null,{"$f":"LEN(L125)","v":0},"z",70,null,"Wybierz z listy rozwijanej \"TAK/NIE\", czy odcinek drogi został uszkodzony w wyniku działania niekorzystnych zjawisk atmosferycznych w ciągu 3 lat przed datą złożenia wniosku o dofinansowanie i jest ujęty w protokole strat potwierdzonym przez Wojewodę Świętokrzyskiego.\nJeśli \"TAK\", to wpisz rodzaj klęski i jej datę (można użyć do 70 wszystkich znaków) oraz numer i datę protokołu strat potwierdzonego przez Wojewodę Świętokrzyskiego (można  użyć do 70 wszystkich znaków).\nJeśli \"TAK\", to należy załączyć kopię protokołu strat potwierdzonego przez Wojewodę Świętokrzyskiego."]
[null,null,null,"protokół strat potwierdzony przez Wojewodę Świętokrzyskiego",null,null,null,null,null,null,null,null,null,null,null,null,null,null,null,null,null,null,null,null,null,null,{"$f":"LEN(L126)","v":0},"z",70]
[null,"jeżeli wybrano odpowiedź TAK, należy załączyć do wniosku kopię protokołu strat potwierdzonego przez Wojewodę"]
[null,"Kryterium nr 3\n",null,null,null,"-","Podnoszenie standardów technicznych dróg powiatowych i dróg gminnych, \nw szczególności dostosowanie ich do ruchu pojazdów o dopuszczalnym nacisku pojedynczej osi napędowej do 11,5 t, oraz zachowanie jednorodności sieci dróg powiatowych i dróg gminnych pod względem spełniania tych standardów ",null,null,null,null,null,null,null,null,null,null,null,null,null,null,null,null,null,null,null,null,null,null,null,{"$f":"_xlfn.CONCAT(A128,B128,\" \",F128,\" \",G128)","v":"Kryterium nr 3\n - Podnoszenie standardów technicznych dróg powiatowych i dróg gminnych, \nw szczególności dostosowanie ich do ruchu pojazdów o dopuszczalnym nacisku pojedynczej osi napędowej do 11,5 t, oraz zachowanie jednorodności sieci dróg powiatowych i dróg gminnych pod względem spełniania tych standardów "}]
["A. ","Rodzaj robót budowlanych",null,null,null,null,null,null,null,null,null,null,null,null,null,null,null,null,null,null,null,null,null,null,null,null,null,null,null,null,"Wybierz z listy rozwijanej \"BUDOWA/PRZEBUDOWA\" główny rodzaj robót budowlanych"]
["B. ","Skrzyżowania. \nBudowa/przebudowa skrzyżowań:",null,null,null,null,null,null,null,null,null,null,null,null,null,null,null,null,null,null,null,null,null,null,null,null,null,null,null,null,"Wybierz z list rozwijanych „TAK/NIE”, czy w ramach zadania będzie realizowana budowa/przebudowa podanych rodzajów skrzyżowań (lit. B pkt 1-2).   Jeśli \"TAK\" , to podaj ich ilości w sztukach oraz zaznacz te skrzyżowania na załączonej mapie poglądowej."]
[null,"1)","zwykłych z drogami publicznymi",null,null,null,null,null,null,null,null,null,null,null,null,null,null,null,null,null,null,null,null,null,null,"szt.",null,null,null,null,{"$f":"IF(BE131=\"b\",\"Błąd - wybrano NIE i podano ilość sztuk, lub wybrano TAK i nie podano ilości sztuk\",\"\")","v":""},null,null,null,null,null,null,null,null,null,null,null,null,null,null,null,null,null,null,null,null,null,null,null,null,null,{"$f":"IF(AND(V131=\"\",X131=\"\"),\"ok\",IF(AND(V131=\"tak\",X131>0),\"ok\",IF(AND(V131=\"nie\",X131=0),\"ok\",IF(AND(V131=\"nie\",X131>\"\"),\"ok\",\"b\"))))","v":"ok"}]
[null,"2)","innych:"]
[null,null,"•","skanalizowanych",null,null,null,null,null,null,null,null,null,null,null,null,null,null,null,null,null,null,null,null,null,"szt.",null,null,null,null,{"$f":"IF(BE133=\"b\",\"Błąd - wybrano NIE i podano ilość sztuk, lub wybrano TAK i nie podano ilości sztuk\",\"\")","v":""},null,null,null,null,null,null,null,null,null,null,null,null,null,null,null,null,null,null,null,null,null,null,null,null,null,{"$f":"IF(AND(V133=\"\",X133=\"\"),\"ok\",IF(AND(V133=\"tak\",X133>0),\"ok\",IF(AND(V133=\"nie\",X133=0),\"ok\",IF(AND(V133=\"nie\",X133>\"\"),\"ok\",\"b\"))))","v":"ok"}]
[null,null,"•","w formie ronda",null,null,null,null,null,null,null,null,null,null,null,null,null,null,null,null,null,null,null,null,null,"szt.",null,null,null,null,{"$f":"IF(BE134=\"b\",\"Błąd - wybrano NIE i podano ilość sztuk, lub wybrano TAK i nie podano ilości sztuk\",\"\")","v":""},null,null,null,null,null,null,null,null,null,null,null,null,null,null,null,null,null,null,null,null,null,null,null,null,null,"ok"]
[null,null,"•","innych podnoszących poziom bezpieczeństwa np. z sygnalizacją świetlną ",null,null,null,null,null,null,null,null,null,null,null,null,null,null,null,null,null,null,null,null,null,"szt.",null,null,null,null,{"$f":"IF(BE135=\"b\",\"Błąd - wybrano NIE i podano ilość sztuk, lub wybrano TAK i nie podano ilości sztuk\",\"\")","v":""},null,null,null,null,null,null,null,null,null,null,null,null,null,null,null,null,null,null,null,null,null,null,null,null,null,"ok"]
[null,"jeśli wybrano odpowiedź TAK, należy wskazać to skrzyżowanie na załączonej mapie poglądowej"]
["C. ","Drogowe obiekty inżynierskie. \nBudowa/przebudowa drogowych obiektów inżynierskich:",null,null,null,null,null,null,null,null,null,null,null,null,null,null,null,null,null,null,null,null,null,null,null,null,null,null,null,null,"Wybierz z list rozwijanych „TAK/NIE”, czy w ramach zadania będzie realizowana budowa/przebudowa podanych obiektów inżynierskich (lit. C pkt 1-3).   Jeśli \"TAK\" , to podaj ich ilości w sztukach oraz zaznacz te obiekty na załączonej mapie poglądowej."]
[null,"1)","•","mostów",null,null,null,null,null,null,null,null,null,null,null,null,null,null,null,null,null,null,null,null,null,"szt.",null,null,null,null,{"$f":"IF(BE138=\"b\",\"Błąd - wybrano NIE i podano ilość sztuk, lub wybrano TAK i nie podano ilości sztuk\",\"\")","v":""},null,null,null,null,null,null,null,null,null,null,null,null,null,null,null,null,null,null,null,null,null,null,null,null,null,{"$f":"IF(AND(V138=\"\",X138=\"\"),\"ok\",IF(AND(V138=\"tak\",X138>0),\"ok\",IF(AND(V138=\"nie\",X138=0),\"ok\",IF(AND(V138=\"nie\",X138>\"\"),\"ok\",\"b\"))))","v":"ok"}]
[null,null,"•","wiaduktów",null,null,null,null,null,null,null,null,null,null,null,null,null,null,null,null,null,null,null,null,null,"szt.",null,null,null,null,"",null,null,null,null,null,null,null,null,null,null,null,null,null,null,null,null,null,null,null,null,null,null,null,null,null,{"$f":"IF(AND(V139=\"\",X139=\"\"),\"ok\",IF(AND(V139=\"tak\",X139>0),\"ok\",IF(AND(V139=\"nie\",X139=0),\"ok\",IF(AND(V139=\"nie\",X139>\"\"),\"ok\",\"b\"))))","v":"ok"}]
[null,null,"•","estakad",null,null,null,null,null,null,null,null,null,null,null,null,null,null,null,null,null,null,null,null,null,"szt.",null,null,null,null,"",null,null,null,null,null,null,null,null,null,null,null,null,null,null,null,null,null,null,null,null,null,null,null,null,null,"ok"]
[null,null,"•","kładek dla pieszych",null,null,null,null,null,null,null,null,null,null,null,null,null,null,null,null,null,null,null,null,null,"szt.",null,null,null,null,"",null,null,null,null,null,null,null,null,null,null,null,null,null,null,null,null,null,null,null,null,null,null,null,null,null,"ok"]
[null,"2)","przepustów pod koroną drogi",null,null,null,null,null,null,null,null,null,null,null,null,null,null,null,null,null,null,null,null,null,null,"szt.",null,null,null,null,"",null,null,null,null,null,null,null,null,null,null,null,null,null,null,null,null,null,null,null,null,null,null,null,null,null,"ok"]
[null,"3)","konstrukcji oporowej",null,null,null,null,null,null,null,null,null,null,null,null,null,null,null,null,null,null,null,null,null,null,"szt.",null,null,null,null,"",null,null,null,null,null,null,null,null,null,null,null,null,null,null,null,null,null,null,null,null,null,null,null,null,null,"ok"]
[null,"jeśli wybrano odpowiedź TAK, należy wskazać ten obiekt na załączonej mapie poglądowej"]
["D.","Inne. \nBudowa/przebudowa elementów w ramach wnioskowanego zadania:",null,null,null,null,null,null,null,null,null,null,null,null,null,null,null,null,null,null,null,null,null,null,null,null,null,null,null,null,"Wybierz z list rozwijanych „TAK/NIE”, czy w ramach zadania będzie realizowana budowa lub przebudowa podanych elementów (lit. D pkt 1-6)."]
[null,"1)","drogi dla pieszych lub rowerów "]
[null,"2)","drogi dla pieszych i rowerów (ciągu pieszo-rowerowego) "]
[null,"3)","oświetlenia ulicznego "]
[null,"4)","odwodnienia drogi (kanału deszczowego, rowu) "]
[null,"5)","przebudowy drogi wewnętrznej i zaliczenie jej do kategorii dróg "]
[null,"6)","dostosowania drogi do ruchu pojazdów o dopuszczalnym nacisku pojedynczej osi napędowej do 11,5 t "]
[null,"Kryterium nr 4",null,null,null,"-","Zwiększenie dostępności transportowej jednostek administracyjnych",null,null,null,null,null,null,null,null,null,null,null,null,null,null,null,null,null,null,null,null,null,null,null,{"$f":"_xlfn.CONCAT(A152,B152,\" \",F152,\" \",G152)","v":"Kryterium nr 4 - Zwiększenie dostępności transportowej jednostek administracyjnych"}]
["A.\n","Obszar wiejski. \nOdcinek drogi przebiega w całości lub w części na obszarze wiejskim (wykracza poza granice administracyjne miasta)",null,null,null,null,null,null,null,null,null,null,null,null,null,null,null,null,null,null,null,null,null,null,null,null,null,null,null,null,"Wybierz z listy rozwijanej \"TAK – odcinek przebiega W CAŁOŚCI na obszarze wiejskim/TAK – odcinek przebiega W CZĘŚCI na obszarze wiejskim/NIE – odcinek NIE PRZEBIEGA przez obszar wiejski\", czy odcinek drogi przebiega w całości lub w części na obszarze wiejskim (wykracza poza granice administracyjne miasta)"]
[]
["B.\n\n","Utrata funkcji społeczno-gospodarczych. \nOdcinek drogi przebiega w całości lub w części w granicach administracyjnych miast ujętych w pakiecie dla średnich miast uznanych za zagrożone utratą funkcji społeczno-gospodarczych (na podstawie Analizy Instytutu Geografii i Przestrzennego Zagospodarowania PAN)"]
[null,null,null,null,null,null,null,null,null,null,null,null,null,null,null,null,null,null,null,null,null,null,null,null,null,null,null,null,null,null,"Wybierz z listy rozwijanej „TAK - odcinek drogi PRZEBIEGA w granicach administracyjnych jednego z miast ujętych w Pakiecie dla średnich miast uznanych za zagrożone utratą funkcji społeczno-gospodarczych/NIE - odcinek drogi NIE PRZEBIEGA w granicach administracyjnych jednego z miast ujętych w Pakiecie dla średnich miast uznanych za zagrożone utratą funkcji społeczno-gospodarczych”, czy odcinek biegnie w całości lub w części w granicach administracyjnych jednego z miast ujętych w Pakiecie dla średnich miast uznanych za zagrożone utratą funkcji społeczno-gospodarczych. Jeśli \"TAK\", to wybierz z listy rozwijanej miasto, przez które przebiega odcinek."]
[null,{"$f":"IFERROR(IF(FIND(\"TAK\",B156)=1,\"miasto\",\"\"),\"\")","v":""}]
[null,"średnie miasta uznane za zagrożone utratą funkcji społeczno-gospodarczych w województwie świętokrzyskim – \nOstrowiec Świętokrzyski, Starachowice, Staszów, Jędrzejów, Końskie, Skarżysko-Kamienna, Sandomierz, Busko-Zdrój."]
["C.\n\n\n","Instytucje publiczne i miejsca zgromadzeń. \nOdcinek drogi zapewnia bezpośredni dojazd* do:\n"]
[null,"• \n\n• ","miejsc zgromadzeń ludności (np.: cmentarz, boisko, amfiteatr, obiekty zabytkowe, sakralne, turystyczne, itp.)\ninstytucji publicznych lub świadczących usługi publiczne (np.: urząd gminy, szkoła, ośrodek zdrowia, ośrodek pomocy społecznej, remiza OSP, świetlica wiejska, żłobek, przedszkole, klub seniora. itp.)"]
[null," *bezpośredni dojazd - położenie do 200 m od odcinka drogi"]
[null,null,null,null,null,null,null,null,null,null,null,null,null,null,null,null,null,null,null,null,null,null,null,null,null,null,{"$f":"LEN(D162)","v":0},"z",500,null,"Wybierz z listy rozwijanej \"TAK/NIE\", czy odcinek drogi zapewnia bezpośredni dojazd (do 200 m od odcinka) do miejsc zgromadzeń ludności, instytucji publicznych lub świadczących usługi publiczne.\nJeśli \"TAK\", to wymień do jakich miejsc zgromadzeń ludności, instytucji publicznych lub świadczących usługi publiczne odcinek zapewnia bezpośredni dojazd  (można użyć do 500 wszystkich znaków) oraz zaznacz te miejsca na załączonej mapie poglądowej."]
[null,"jeżeli wybrano odpowiedź TAK, należy wskazać te miejsca i instytucje na załączonej mapie poglądowej"]
["D.\n\n","Transport publiczny. \nNa odcinku drogi przebiega linia autobusowa objęta wsparciem z Funduszu Rozwoju Przewozów Autobusowych, realizowane są usługi transportu publicznego, uchwalono planowany przebieg linii użyteczności publicznej"]
[null,null,null,null,null,null,null,null,null,null,null,null,null,null,null,null,null,null,null,null,null,null,null,null,null,null,{"$f":"LEN(D165)","v":0},"z",300,null,"Wybierz z listy rozwijanej \"TAK/NIE\", czy na odcinku drogi przebiega linia autobusowa objęta wsparciem z Funduszu Rozwoju Przewozów Autobusowych, realizowane są usługi transportu publicznego, uchwalono planowany przebieg linii użyteczności publicznej.\nJeśli \"TAK\", to wpisz nr umowy z wojewodą i datę jej zawarcia oraz nr linii autobusowej lub usługi transportu publicznego lub numer i datę uchwały o planowanym przebiegu linii użyteczności publicznej (można użyć do 300 wszystkich znaków), zaznacz przebieg linii na załączonej mapie poglądowej oraz załącz do wniosku kopię odpowiedniego dokumentu."]
[null,"jeżeli wybrano odpowiedź TAK, należy załączyć do wniosku kopię odpowiedniego dokumentu"]
["E.\n\n","Dostępność komunikacyjna. \nWpływ odcinka drogi na dostępność komunikacyjną obszaru, na którym znajduje się ta droga "]
[null,null,null,null,null,null,null,null,null,null,null,null,null,null,null,null,null,null,null,null,null,null,null,null,null,null,{"$f":"LEN(D168)","v":0},"z",500,null,"Wybierz z listy rozwijanej \"TAK/NIE\", czy odcinek drogi wpływa na dostępność komunikacyjną obszaru, na którym znajduje się ta droga.\nJeśli \"TAK\", to opisz wpływ odcinka drogi na dostępność komunikacyjną obszaru, na którym znajduje się ta droga (można użyć do 500 wszystkich znaków)."]
[null,"Kryterium nr 5",null,null,null,"-","Poprawa dostępności terenów inwestycyjnych i gospodarczych",null,null,null,null,null,null,null,null,null,null,null,null,null,null,null,null,null,null,null,null,null,null,null,{"$f":"_xlfn.CONCAT(A169,B169,\" \",F169,\" \",G169)","v":"Kryterium nr 5 - Poprawa dostępności terenów inwestycyjnych i gospodarczych"}]
["A.\n\n","Lokalne ośrodki gospodarcze. \nOdcinek drogi zapewnia bezpośredni dojazd* do lokalnych ośrodków gospodarczych np. do strefy ekonomicznej, podmiotów gospodarczych, lokalnego targowiska \n*bezpośredni dojazd - położenie do 200 m od odcinka drogi"]
[null,null,null,null,null,null,null,null,null,null,null,null,null,null,null,null,null,null,null,null,null,null,null,null,null,null,{"$f":"LEN(D171)","v":0},"z",400,null,"Wybierz z listy rozwijanej \"TAK/NIE\", czy odcinek drogi zapewnia bezpośredni dojazd (do 200 m od odcinka) do lokalnych ośrodków gospodarczych np. do strefy ekonomicznej, podmiotów gospodarczych, lokalnego targowiska.\nJeśli \"TAK\", to wymień do jakich lokalnych ośrodków gospodarczych odcinek stanowi bezpośredni dojazd (można użyć do 400 wszystkich znaków) oraz zaznacz te ośrodki na załączonej mapie poglądowej."]
[null,"jeżeli wybrano odpowiedź TAK, należy wskazać te ośrodki gospodarcze na załączonej mapie poglądowej"]
["B.\n\n\n","Tereny inwestycyjne. \nOdcinek drogi zapewnia bezpośredni dojazd* do terenów inwestycyjnych, rozumianych jako tereny przeznaczone pod działalność gospodarczą w studium uwarunkowań przestrzennych, miejscowym planie zagospodarowania, warunkach zabudowy lub decyzji lokalizacyjnej celu publicznego \n*bezpośredni dojazd - położenie do 200 m od odcinka drogi"]
[null,null,null,null,null,null,null,null,null,null,null,null,null,null,null,null,null,null,null,null,null,null,null,null,null,null,{"$f":"LEN(D174)","v":0},"z",400,null,"Wybierz z listy rozwijanej \"TAK/NIE\", czy odcinek drogi zapewnia bezpośredni dojazd (do 200 m od odcinka) do terenów inwestycyjnych, rozumianych jako tereny przeznaczone pod działalność gospodarczą w studium uwarunkowań przestrzennych, miejscowym planie zagospodarowania, warunkach zabudowy lub decyzji lokalizacyjnej celu publicznego.\nJeśli \"TAK\", to wymień do jakich terenów inwestycyjnych odcinek stanowi bezpośredni dojazd (można użyć do 400 wszystkich znaków) oraz zaznacz te tereny na załączonej mapie poglądowej."]
[null,"jeżeli wybrano odpowiedź TAK, należy wskazać te tereny inwestycyjne na załączonej mapie poglądowej"]
["C.\n\n\n","Tereny rolne. \nOdcinek drogi zapewnia bezpośredni dojazd do terenów, na których prowadzona jest produkcja rolna, sadownictwo, ogrodnictwo lub/i zlokalizowane są gospodarstwa agroturystyczne ważne ze względu na specyfikę obszaru \n*bezpośredni dojazd - położenie do 200 m od odcinka drogi"]
[null,null,null,null,null,null,null,null,null,null,null,null,null,null,null,null,null,null,null,null,null,null,null,null,null,null,{"$f":"LEN(D177)","v":0},"z",400,null,"Wybierz z listy rozwijanej \"TAK/NIE\", czy odcinek drogi zapewnia bezpośredni dojazd (do 200 m od odcinka) do terenów, na których prowadzona jest produkcja rolna, sadownictwo, ogrodnictwo lub/i zlokalizowane są gospodarstwa agroturystyczne ważne ze względu na specyfikę obszaru.\nJeśli \"TAK\", to wymień do jakich terenów rolnych odcinek stanowi bezpośredni dojazd (można użyć do 400 wszystkich znaków) oraz zaznacz te tereny na załączonej mapie poglądowej."]
[null,"jeżeli wybrano odpowiedź TAK, należy wskazać te tereny rolne na załączonej mapie poglądowej"]
["D.\n","Rozwój społeczno-gospodarczy. \nStrategiczne znaczenia odcinka drogi dla rozwoju społeczno-gospodarczego województwa"]
[null,null,null,null,null,null,null,null,null,null,null,null,null,null,null,null,null,null,null,null,null,null,null,null,null,null,{"$f":"LEN(D180)","v":0},"z",500,null,"Wybierz z listy rozwijanej \"TAK/NIE\", czy odcinek drogi ma strategiczne znaczenie dla rozwoju społeczno-gospodarczego województwa.\nJeśli \"TAK\", to opisz przewidywane znaczenie wnioskowanego odcinka drogi dla rozwoju społeczno-gospodarczego województwa (można użyć do 500 wszystkich znaków)."]
[null,"Kryterium nr 6",null,null,null,"-","Zwiększenie liczby obwodnic w ciągu dróg powiatowych i dróg gminnych",null,null,null,null,null,null,null,null,null,null,null,null,null,null,null,null,null,null,null,null,null,null,null,{"$f":"_xlfn.CONCAT(A181,B181,\" \",F181,\" \",G181)","v":"Kryterium nr 6 - Zwiększenie liczby obwodnic w ciągu dróg powiatowych i dróg gminnych"}]
[null,"Zwiększenie liczby obwodnic. \nOdcinek drogi przyczynia się do zwiększenia liczby dróg spełniających funkcję obwodnicy, która w rozumieniu art. 2 ust.1 pkt 2a ustawy o RFRD oznacza drogę omijającą miejscowość lub teren zwartej zabudowy miejscowości, planowaną do realizacji w większości w nowym przebiegu i mającą na celu wyprowadzenie części ruchu pojazdów z tej miejscowości"]
[null,null,null,null,null,null,null,null,null,null,null,null,null,null,null,null,null,null,null,null,null,null,null,null,null,null,{"$f":"LEN(D183)","v":0},"z",500,null,"Wybierz z listy rozwijanej \"TAK/NIE\", czy odcinek drogi przyczynia się do zwiększenia ilości dróg spełniających funkcję obwodnicy.\nJeśli \"TAK\", to opisz/uzasadnij przyczynianie się odcinka do zwiększenia ilości dróg spełniających funkcję obwodnicy (można użyć do 500 wszystkich znaków)."]
[null,"Kryterium nr 7",null,null,null,"-","Poprawa dostępności terenów objętych przedsięwzięciami lub inwestycjami powiązanymi z przedsięwzięciem infrastrukturalnym",null,null,null,null,null,null,null,null,null,null,null,null,null,null,null,null,null,null,null,null,null,null,null,{"$f":"_xlfn.CONCAT(A184,B184,\" \",F184,\" \",G184)","v":"Kryterium nr 7 - Poprawa dostępności terenów objętych przedsięwzięciami lub inwestycjami powiązanymi z przedsięwzięciem infrastrukturalnym"}]
[null,"Tereny powiązane z przedsięwzięciem infrastrukturalnym. \nOdcinek drogi przyczynia się do poprawy dostępności terenów objętych przedsięwzięciami lub inwestycjami powiązanymi z przedsięwzięciem infrastrukturalnym, o których mowa w art. 5c ust. 1 ustawy z dnia 8 grudnia 2006 r. o finansowym wsparciu niektórych przedsięwzięć mieszkaniowych (Dz. U. z 2023 r. poz. 788 i 1463)"]
[null,null,null,null,null,null,null,null,null,null,null,null,null,null,null,null,null,null,null,null,null,null,null,null,null,null,{"$f":"LEN(D186)","v":0},"z",500,null,"Wybierz z listy rozwijanej \"TAK/NIE\", czy odcinek drogi przyczynia się do poprawy dostępności terenów objętych przedsięwzięciami lub inwestycjami powiązanymi z przedsięwzięciem infrastrukturalnym.\nJeśli \"TAK\" wymień te tereny i krótko opisz (można użyć do 500 wszystkich znaków)."]
[null,"jeżeli wybrano odpowiedź TAK, należy wskazać te tereny na załączonej mapie poglądowej"]
["11. ","OSOBY UPOWAŻNIONE DO UDZIELANIA WYJAŚNIEŃ KOMISJI",null,null,null,null,null,null,null,null,null,null,null,null,null,null,null,null,null,null,null,null,null,null,null,null,null,null,null,null,{"$f":"_xlfn.CONCAT(A188,B188)","v":"11. OSOBY UPOWAŻNIONE DO UDZIELANIA WYJAŚNIEŃ KOMISJI"}]
["Lp.","imię i nazwisko",null,null,null,null,null,null,"stanowisko służbowe",null,null,null,null,null,"nr telefonu",null,null,null,null,"e-mail",null,null,null,null,null,null,null,null,null,null,"Wskaż osobę/osoby do kontaktu przez podanie następujących danych:\n - imię i nazwisko, \n - zajmowane stanowisko służbowe, \n - nr telefonu (ze wskazaniem nr wewnętrznego - jeśli dotyczy), \n - adres e-mail."]
[1,"uhybuyhbu",null,null,null,null,null,null,"nbjinihn",null,null,null,null,null,"hbhubhb",null,null,null,null,"vuvuybhib"]
[2,"nnbiubnib",null,null,null,null,null,null,"buhbiub",null,null,null,null,null,"vgvbuhb",null,null,null,null,"hubhubijbn"]
["12. ","ZŁĄCZNIKI",null,null,null,null,null,null,null,null,null,null,null,null,null,null,null,null,null,null,null,null,null,null,null,null,null,null,null,null,{"$f":"_xlfn.CONCAT(A192,B192)","v":"12. ZŁĄCZNIKI"}]
["1)","Do wniosku dołączone zostały załączniki:   ",null,null,null,null,null,null,null,null,null,null,null,null,null,null,null,null,null,null,null,null,null,null,null,null,null,null,null,null,"Wybierz z list rozwijanych, które z wymienionych załączników zostały dołączone do wniosku."]
[null,"a)","kopia prawomocnej decyzji o pozwoleniu na budowę - dotyczy robót realizowanych na podstawie pozwolenia na budowę (obligatoryjnie),\n",null,null,null,null,null,null,null,null,null,null,null,null,null,null,null,null,null,null,null,null,null,null,null,null,null,null,null,"Wybierz z list rozwijanych \"TAK/NIE\", czy załączono minimum jeden z trzech wymienionych załączników:\n - kopię prawomocnej decyzji o pozwoleniu na budowę - dla robót realizowanych na podst. pozwolenia na budowę;\n - kopię prawomocnej decyzji o zezwoleniu na realizację inwestycji drogowej - dotyczy robót realizowanych na podst. ZRID;\n - kopię zgłoszenia robót budowlanych z poświadczeniem o braku podstaw do wniesienia sprzeciwu na zgłoszenie wykonania robót budowlanych.\nJeśli \"TAK\", to wpisz nr/znak dokumentu i jego datę (jeśli załączony dokument posiada te dane).\nZałącznik jest OBLIGATORYJNY (należy załączyć minimum jeden z trzech wymienionych załączników)"]
[null,null,"nr / znak dokumentu"]
[null,null,"data dokumentu"]
[null,null,"lub"]
[null,null,"kopia prawomocnej decyzji o zezwoleniu na realizację inwestycji drogowej - dotyczy robót realizowanych na podstawie ZRID (obligatoryjnie), "]
[null,null,"nr / znak dokumentu"]
[null,null,"data dokumentu"]
[null,null,"lub"]
[null,null,"kopia zgłoszenia robót budowlanych z poświadczeniem o braku podstaw do wniesienia sprzeciwu na zgłoszenie wykonania robót budowlanych potwierdzonym:\n      - zaświadczeniem organu administracji architektoniczno-budowlanej \n        lub \n      - pieczęcią organu administracji architektoniczno-budowlanej \ndotyczy robót realizowanych na podstawie zgłoszenia (obligatoryjnie),"]
[null,null,"nr / znak dokumentu"]
[null,null,"data dokumentu"]
[null,"b)","zgodna ze stanem faktycznym, czytelna mapa poglądowa zawierająca: \n   - naniesioną skalę, \n   - zaznaczone miejsce/odcinek realizacji wnioskowanego zadania, \n   - obszar obrazujący odległość 200 m od odcinka drogi objętego zadaniem, \n   - zaznaczone elementy mające wpływ na ocenę merytoryczną wniosku - \n     dotyczy kryterium: nr 2 lit. A, B; nr 3 lit. B, C; nr 4 lit. C, D; nr 5 lit. A, B, C \n(obligatoryjnie),",null,null,null,null,null,null,null,null,null,null,null,null,null,null,null,null,null,null,null,null,null,null,null,null,null,null,null,"Wybierz z listy rozwijanej \"TAK/NIE\", czy załączono mapę poglądową.\nZałącznik jest OBLIGATORYJNY."]
[null,"c)","kopia strony projektu stałej organizacji ruchu, z której wynika, że projekt jest zatwierdzony (obligatoryjnie)\n",null,null,null,null,null,null,null,null,null,null,null,null,null,null,null,null,null,null,null,null,null,null,null,null,null,null,null,"Wybierz z listy rozwijanej \"TAK/NIE\", czy załączono kopię strony projektu stałej organizacji ruchu, z której wynika, że projekt jest zatwierdzony lub pismo organu uprawnionego do zatwierdzenia organizacji ruchu.\nJeśli \"TAK\", to wpisz nr/znak dokumentu i jego datę (jeśli załączony dokument posiada te dane).\nZałącznik jest OBLIGATORYJNY."]
[null,null,"nr / znak dokumentu"]
[null,null,"data dokumentu"]
[null,null,"lub"]
[null,null,"pismo organu uprawnionego do zatwierdzenia organizacji ruchu (obligatoryjnie)"]
[null,null,"nr / znak dokumentu"]
[null,null,"data dokumentu"]
[null,"d)","rysunki  z charakterystycznymi przekrojami poprzecznymi pasa drogowego w liniach rozgraniczających z wykazaniem wszystkich elementów drogi - przekroje normalne i przekroje konstrukcyjne lub normalno-konstrukcyjne (obligatoryjnie)",null,null,null,null,null,null,null,null,null,null,null,null,null,null,null,null,null,null,null,null,null,null,null,null,null,null,null,"Wybierz z listy rozwijanej \"TAK/NIE\", czy załączono rysunki  z charakterystycznymi przekrojami poprzecznymi pasa drogowego w liniach rozgraniczających z wykazaniem wszystkich elementów drogi - przekroje normalne i przekroje konstrukcyjne lub normalno-konstrukcyjne.\nZałącznik jest OBLIGATORYJNY."]
[null,"e)","kopia kosztorysu inwestorskiego (obligatoryjnie)",null,null,null,null,null,null,null,null,null,null,null,null,null,null,null,null,null,null,null,null,null,null,null,null,null,null,null,"Wybierz z listy rozwijanej \"TAK/NIE\", czy załączono kopię kosztorysu inwestorskiego ( aktualnego kosztorysu, czyli sporządzonego nie wcześniej niż 6 miesięcy przed złożeniem wniosku)\nJeśli \"TAK\", to wpisz nr/znak dokumentu i jego datę (jeśli załączony dokument posiada te dane).\nZałącznik jest OBLIGATORYJNY."]
[null,null,"nr / znak dokumentu"]
[null,null,"data dokumentu"]
[null,"f)","kopia zgody na odstępstwo od przepisów techniczno-budowlanych (jeśli dotyczy),",null,null,null,null,null,null,null,null,null,null,null,null,null,null,null,null,null,null,null,null,null,null,null,null,null,null,null,"Wybierz z listy rozwijanej \"TAK/NIE\", czy załączono kopię zgody na odstępstwo od przepisów techniczno-budowlanych - jeśli dotyczy\nJeśli \"TAK\", to wpisz nr/znak dokumentu i jego datę (jeśli załączony dokument posiada te dane).\nZałącznik jest OBLIGATORYJNY w przypadku, gdy budowana lub przebudowywana droga nie będzie spełniała warunków technicznych."]
[null,null,"nr / znak dokumentu"]
[null,null,"data dokumentu"]
[null,"g)","kopia protokołu strat potwierdzonego przez Wojewodę Świętokrzyskiego - dotyczy kryterium nr 2 lit. D (jeśli dotyczy),",null,null,null,null,null,null,null,null,null,null,null,null,null,null,null,null,null,null,null,null,null,null,null,null,null,null,null,"Wybierz z listy rozwijanej \"TAK/NIE\", czy załączono kopię protokołu strat potwierdzonego przez Wojewodę Świętokrzyskiego - jeśli dotyczy"]
[null,"h)","dokument potwierdzający przebieg linii autobusowej objętej wsparciem  z FRPA, linii użyteczności publicznej lub realizowanie usług transportu publicznego - dotyczy kryterium nr 4 lit. D (jeśli dotyczy),",null,null,null,null,null,null,null,null,null,null,null,null,null,null,null,null,null,null,null,null,null,null,null,null,null,null,null,"Wybierz z listy rozwijanej \"TAK/NIE\", czy załączono dokument potwierdzający przebieg linii autobusowej objętej wsparciem  z FRPA, linii użyteczności publicznej lub realizowanie usług transportu publicznego - jeśli dotyczy"]
[null,"i)","kopia uchwały o zaliczeniu drogi do odpowiedniej kategorii dróg publicznych (jeśli dotyczy)",null,null,null,null,null,null,null,null,null,null,null,null,null,null,null,null,null,null,null,null,null,null,null,null,null,null,null,"Wybierz z listy rozwijanej \"TAK/NIE\", czy załączono uchwałę o zaliczeniu drogi do odpowiedniej kategorii dróg publicznych - dotyczy dróg publicznych.\nJeśli \"TAK\", to wpisz dane uchwały (np. uchwała nr XXIX/2020 Rady Gminy XYZ z dnia 10.10.2020)"]
[null,null,"Uchwała",null,null,null,null,null,null,null,null,null,null,null,null,null,null,null,null,null,null,null,null,null,null,null,{"$f":"LEN(F223)","v":0},"z",200]
[null,"j)","dodatkowe załączniki (jeśli dotyczy),"]
[null,null,null,null,null,null,null,null,null,null,null,null,null,null,null,null,null,null,null,null,null,null,null,null,null,null,{"$f":"LEN(C225)","v":0},"z",500,null,"Wybierz z listy rozwijanej \"TAK/NIE\", czy załączono dodatkowe załączniki.\nJeśli \"TAK\", to wpisz jakie dodatkowe załączniki dołączono do wniosku."]
["13. ","OŚWIADCZENIA WNIOSKODAWCY (ustawowego zarządcy drogi)",null,null,null,null,null,null,null,null,null,null,null,null,null,null,null,null,null,null,null,null,null,null,null,null,null,null,null,null,{"$f":"_xlfn.CONCAT(A226,B226)","v":"13. OŚWIADCZENIA WNIOSKODAWCY (ustawowego zarządcy drogi)"}]
["Wnioskodawca oświadcza, że: "]
["1)","do wniosku dołączone zostały załączniki wskazane w pkt 12 wniosku;"]
["2)","dane i informacje zawarte we wniosku są prawidłowe i kompletne;"]
["3)","na dzień złożenia wniosku, zadanie obejmuje inwestycję wyłącznie na drodze dla której wnioskodawca pełni rolę ustawowego zarządcy;"]
["4)","na dzień złożenia wniosku, zadanie obejmuje inwestycję wyłącznie na drodze, która:",null,null,null,null,null,null,null,null,null,null,null,null,null,null,null,null,null,null,null,null,null,null,null,null,null,null,null,null,"Wybierz z list rozwijanych \"TAK/NIE/NIE DOTYCZY\", czy droga została/zostanie zaliczona do odpowiedniej kategorii dróg"]
[null,"•","została zaliczona do kategorii dróg publicznych",null,null,null,null,null,null,null,null,null,null,null,null,null,null,null,null,null,null,null,null,null,null,null,null,null,null,null,{"$f":"IF(AND(AY232=\"b\",AY233=\"b\"),\"Błąd - nie określono czy droga jest zaliczona do dróg publicznych, czy będzie zaliczona do dróg publicznych\",\"\")","v":""},null,null,null,null,null,null,null,null,null,null,null,null,null,null,null,null,null,null,null,{"$f":"IF(AND(W233=\"\",W232=\"\"),\"W\",IF(AND(W233=\"nie dotyczy\",W232=\"nie dotyczy\"),\"B\",IF(AND(W233=\"NIE\",W232=\"NIE\"),\"B\",IF(AND(W233=\"nie dotyczy\",W232=\"NIE\"),\"B\",IF(AND(W233=\"NIE\",W232=\"nie dotyczy\"),\"B\",IF(AND(W233=\"\",W232=\"nie dotyczy\"),\"B\",IF(AND(W233=\"\",W232=\"NIE\"),\"B\",IF(AND(W233=\"NIE\",W232=\"\"),\"B\",IF(AND(W233=\"nie dotyczy\",W232=\"\"),\"B\",\"OK\")))))))))","v":"W"}]
[null,"•","zostanie zaliczona do kategorii dróg publicznych*",null,null,null,null,null,null,null,null,null,null,null,null,null,null,null,null,null,null,null,null,null,null,null,null,null,null,null,null,null,null,null,null,null,null,null,null,null,null,null,null,null,null,null,null,null,null,null,{"$f":"IF(AND(W233=\"\",W232=\"\"),\"W\",IF(AND(W233=\"nie dotyczy\",W232=\"nie dotyczy\"),\"B\",IF(AND(W233=\"NIE\",W232=\"NIE\"),\"B\",IF(AND(W233=\"nie dotyczy\",W232=\"NIE\"),\"B\",IF(AND(W233=\"NIE\",W232=\"nie dotyczy\"),\"B\",IF(AND(W233=\"\",W232=\"nie dotyczy\"),\"B\",IF(AND(W233=\"\",W232=\"NIE\"),\"B\",IF(AND(W233=\"NIE\",W232=\"\"),\"B\",IF(AND(W233=\"nie dotyczy\",W232=\"\"),\"B\",\"OK\")))))))))","v":"W"}]
[null,null,"* uchwałą właściwego organu jst w sprawie zaliczenia drogi/dróg do odpowiedniej kategorii w terminie \n12 miesięcy od dnia zatwierdzenia rozliczenia; "]
["5)","zapewnione zostanie zabezpieczenie całości zadeklarowanego we wniosku wkładu własnego;"]
["6)","dopełnił lub dopełni wszelkich wymogów wynikających z przepisów prawa uprawniających do realizacji zadania;"]
["7)","przeprowadzi postępowanie o zamówienie publiczne zgodnie z obowiązującymi przepisami Prawa zamówień publicznych (t.j. Dz. U. z 2023 r. poz. 1605 ze zm.)."]
["OŚWIADCZENIE O REALIZACJI ZADANIA W PASIE DROGOWYM (obligatoryjnie)",null,null,null,null,null,null,null,null,null,null,null,null,null,null,null,null,null,null,null,null,null,null,null,null,null,null,null,null,null,{"$f":"A238","v":"OŚWIADCZENIE O REALIZACJI ZADANIA W PASIE DROGOWYM (obligatoryjnie)"}]
[null,"Wnioskodawca oświadcza, że planowane do realizacji elementy drogi mieszczą się w granicach pasa drogowego (nie zaplanowano ich na działkach stanowiących własność prywatną bądź na działkach niestanowiących pasa drogowego)",null,null,null,null,null,null,null,null,null,null,null,null,null,null,null,null,null,null,null,null,null,null,null,null,null,null,null,null,{"$f":"IF(X238=\"\",\"Wybierz z listy rozwijanej czy wnioskodawca oświadcza, że zadnie realizowane jest w pasie drogowym.\nRealizacja zadania w pasie drogowym jest OBLIGATORYJNA.\",IF(X238=\"tak\",\"OK - wnioskodawca oświadcza, że zadnie realizowane jest w pasie drogowym.\",IF(X238=\"nie\",\"Oświadczenie jest OBLIGATORYJNE\",\"Błąd danej - wprowadzono daną spoza listy rozwijanej\")))","v":"Wybierz z listy rozwijanej czy wnioskodawca oświadcza, że zadnie realizowane jest w pasie drogowym.\nRealizacja zadania w pasie drogowym jest OBLIGATORYJNA."},null,null,null,null,null,null,null,null,null,null,null,null,null,null,null,null,null,null,null,{"$f":"IF(X238=\"\",\"W\",IF(X238=\"tak\",\"OK\",\"B\"))","v":"W"}]
["OŚWIADCZENIE O PRZEKAZANIU DANYCH O SIECI DRÓG PUBLICZNYCH (obligatoryjnie)",null,null,null,null,null,null,null,null,null,null,null,null,null,null,null,null,null,null,null,null,null,null,null,null,null,null,null,null,null,{"$f":"A240","v":"OŚWIADCZENIE O PRZEKAZANIU DANYCH O SIECI DRÓG PUBLICZNYCH (obligatoryjnie)"}]
[null,"Wnioskodawca oświadcza, że zgodnie z zapisami § 2 rozporządzenia Ministra Infrastruktury z dnia 16 lutego 2005 r. w sprawie trybu sporządzania informacji oraz gromadzenia i udostępniania danych o sieci dróg publicznych, obiektach mostowych, tunelach oraz promach (Dz.U. 2005 nr 67 poz. 583) sporządzono oraz przekazano do Generalnego Dyrektora Dróg Krajowych i Autostrad informacje dla celów statystycznych o sieci dróg publicznych według stanu na dzień 31 grudnia 2023 r. ",null,null,null,null,null,null,null,null,null,null,null,null,null,null,null,null,null,null,null,null,null,null,null,null,null,null,null,null,{"$f":"IF(X240=\"\",\"Wybierz z listy rozwijanej czy wnioskodawca oświadcza, że sporządził i przekazał do Generalnego Dyrektora Dróg Krajowych i Autostrad informacje do celów statystycznych o sieci dróg publicznych.\nOświadczenie jest OBLIGATORYJNE.\",IF(X240=\"tak\",\"OK - wnioskodawca oświadcza, że sporządził i przekazał do Generalnego Dyrektora Dróg Krajowych i Autostrad informacje do celów statystycznych o sieci dróg publicznych.\",IF(X240=\"nie\",\"Oświadczenie jest OBLIGATORYJNE\",\"Błąd danej - wprowadzono daną spoza listy rozwijanej\")))","v":"Wybierz z listy rozwijanej czy wnioskodawca oświadcza, że sporządził i przekazał do Generalnego Dyrektora Dróg Krajowych i Autostrad informacje do celów statystycznych o sieci dróg publicznych.\nOświadczenie jest OBLIGATORYJNE."},null,null,null,null,null,null,null,null,null,null,null,null,null,null,null,null,null,null,null,{"$f":"IF(X240=\"\",\"W\",IF(X240=\"tak\",\"OK\",\"B\"))","v":"W"}]
["OŚWIADCZENIE O POSIADANIU TYTUŁU PRAWNEGO DO NIERUCHOMOŚCI (obligatoryjnie)",null,null,null,null,null,null,null,null,null,null,null,null,null,null,null,null,null,null,null,null,null,null,null,null,null,null,null,null,null,{"$f":"A242","v":"OŚWIADCZENIE O POSIADANIU TYTUŁU PRAWNEGO DO NIERUCHOMOŚCI (obligatoryjnie)"}]
[null,"Wnioskodawca oświadcza, że posiada tytuł prawny do nieruchomości wskazanych w oświadczeniu o dysponowaniu nieruchomością na cele budowlane zgodnie z art. 3 Prawa budowlanego, tj. tytuł prawny wynikający z prawa własności, użytkowania wieczystego, zarządu, ograniczonego prawa rzeczowego albo stosunku zobowiązaniowego, przewidującego uprawnienia do wykonywania robót budowlanych, ponadto tytuł ten nie wynika z posiadania samoistnego/władania lub z mocy prawa na podst. art. 73 ustawy z dnia 13 października 1998 r. Przepisy wprowadzające ustawy reformujące administrację publiczną (dotyczy sytuacji gdy jst nie posiada decyzji potwierdzającej ten fakt).",null,null,null,null,null,null,null,null,null,null,null,null,null,null,null,null,null,null,null,null,null,null,null,null,null,null,null,null,{"$f":"IF(X242=\"\",\"Wybierz z listy rozwijanej czy wnioskodawca oświadcza, że posiada tytuł prawny do nieruchomości.\nPosiadanie tytułu prawnego do nieruchomości jest OBLIGATORYJNE.\",IF(X242=\"tak\",\"OK - wnioskodawca oświadcza, że posiada tytuł prawny do nieruchomości.\",IF(X242=\"nie\",\"Oświadczenie jest OBLIGATORYJNE\",\"Błąd danej - wprowadzono daną spoza listy rozwijanej\")))","v":"Wybierz z listy rozwijanej czy wnioskodawca oświadcza, że posiada tytuł prawny do nieruchomości.\nPosiadanie tytułu prawnego do nieruchomości jest OBLIGATORYJNE."},null,null,null,null,null,null,null,null,null,null,null,null,null,null,null,null,null,null,null,{"$f":"IF(X242=\"\",\"W\",IF(X242=\"tak\",\"OK\",\"B\"))","v":"W"}]
["OŚWIADCZENIE O ZGODNOŚCI Z PRZEPISAMI PRAWA (obligatoryjnie)",null,null,null,null,null,null,null,null,null,null,null,null,null,null,null,null,null,null,null,null,null,null,null,null,null,null,null,null,null,{"$f":"A244","v":"OŚWIADCZENIE O ZGODNOŚCI Z PRZEPISAMI PRAWA (obligatoryjnie)"}]
[null,"Wnioskodawca oświadcza, że realizacja zgłoszonego zadania odbędzie się z zachowaniem przepisów prawa budowlanego, w tym warunków techniczno-budowlanych dotyczących dróg, w szczególności z:",null,null,null,null,null,null,null,null,null,null,null,null,null,null,null,null,null,null,null,null,null,null,null,null,null,null,null,null,{"$f":"IF(X244=\"\",\"Wybierz z listy rozwijanej czy wnioskodawca oświadcza, że realizując zgłoszone we wniosku zadanie zostaną zachowane przepisy prawa budowlanego, w tym warunków techniczno-budowlanych dotyczących dróg.\"&\"\nPrzestrzeganie przepisów prawa budowlanego, w tym warunków-techniczno-budowlanych jest OBLIGATORYJNE.\",IF(X244=\"tak\",\"OK - wnioskodawca oświadcza, że realizując zgłoszone we wniosku zadanie zostaną zachowane przepisy prawa budowlanego, w tym warunków techniczno-budowlanych dotyczących dróg.\",IF(X244=\"nie\",\"Oświadczenie jest OBLIGATORYJNE.\",\"Błąd danej - wprowadzono daną spoza listy rozwijanej\")))","v":"Wybierz z listy rozwijanej czy wnioskodawca oświadcza, że realizując zgłoszone we wniosku zadanie zostaną zachowane przepisy prawa budowlanego, w tym warunków techniczno-budowlanych dotyczących dróg.\nPrzestrzeganie przepisów prawa budowlanego, w tym warunków-techniczno-budowlanych jest OBLIGATORYJNE."},null,null,null,null,null,null,null,null,null,null,null,null,null,null,null,null,null,null,null,{"$f":"IF(X244=\"\",\"W\",IF(X244=\"tak\",\"OK\",\"B\"))","v":"W"}]
[null,"•  ","ustawą z dnia 7 lipca 1994 r. prawo budowlane (t.j. Dz. U. z 2024 r. poz. 725.);"]
[null,"•  ","rozporządzeniem Ministra Infrastruktury z dnia 24 czerwca 2022 r. w sprawie przepisów techniczno-budowlanych dotyczących dróg publicznych (t.j. Dz. U. z 2022 r. poz. 1518);\nlub\nrozporządzeniem Ministra Transportu i Gospodarki Morskiej z dnia 2 marca 1999 r. w sprawie warunków technicznych, jakim powinny odpowiadać drogi publiczne i ich usytuowanie (t.j. Dz. U. z 2016 r. poz. 124 ze zm.) - w przypadku, gdy zgłoszenie/pozwolenie jest sprzed 2022 roku\n"]
[null,"•  ","ustawą z dnia 21 marca 1985 r. o drogach publicznych (t.j. Dz. U. z 2024 r. poz. 320.)."]
["OŚWIADCZENIE O DZIAŁANIACH INFORMACYJNYCH (obligatoryjnie)",null,null,null,null,null,null,null,null,null,null,null,null,null,null,null,null,null,null,null,null,null,null,null,null,null,null,null,null,null,{"$f":"A249","v":"OŚWIADCZENIE O DZIAŁANIACH INFORMACYJNYCH (obligatoryjnie)"}]
[null,"Wnioskodawca oświadcza, że realizując zgłoszone zadanie dopełni działań informacyjnych wynikających z art. 38 ustawy z dnia 23 października 2018 r. o Rządowym Funduszu Rozwoju Dróg (t.j. Dz. U. z 2023 r. poz. 1983).",null,null,null,null,null,null,null,null,null,null,null,null,null,null,null,null,null,null,null,null,null,null,null,null,null,null,null,null,{"$f":"IF(X249=\"\",\"Wybierz z listy rozwijanej czy wnioskodawca oświadcza, że realizując zgłoszone we wniosku zadanie dopełni działań informacyjnych wynikających z ustawy o RFRD.\nDopełnienie działań informacyjnych jest OBLIGATORYJNE.\",IF(X249=\"TAK\",\"OK - wnioskodawca oświadcza, że dopełni działań informacyjnych wynikających z ustawy o RFRD.\",IF(X249=\"nie\",\"Oświadczenie jest OBLIGATORYJNE.\",\"Błąd danej - wprowadzono daną spoza listy rozwijanej\")))","v":"Wybierz z listy rozwijanej czy wnioskodawca oświadcza, że realizując zgłoszone we wniosku zadanie dopełni działań informacyjnych wynikających z ustawy o RFRD.\nDopełnienie działań informacyjnych jest OBLIGATORYJNE."},null,null,null,null,null,null,null,null,null,null,null,null,null,null,null,null,null,null,null,{"$f":"IF(X249=\"\",\"W\",IF(X249=\"tak\",\"OK\",\"B\"))","v":"W"}]
["OŚWIADCZENIE O ODPOWIEDZIALNOŚCI KARNEJ (obligatoryjnie)",null,null,null,null,null,null,null,null,null,null,null,null,null,null,null,null,null,null,null,null,null,null,null,null,null,null,null,null,null,{"$f":"A251","v":"OŚWIADCZENIE O ODPOWIEDZIALNOŚCI KARNEJ (obligatoryjnie)"}]
[null,"Ja, niżej podpisana/y, oświadczam, że informacje zawarte we wniosku oraz przedłożonych załącznikach są zgodne z prawdą. Jestem świadomy odpowiedzialności karnej wynikającej z art. 271 Kodeksu Karnego, dotyczącego poświadczenia nieprawdy, co do okoliczności mającej znaczenie prawne.",null,null,null,null,null,null,null,null,null,null,null,null,null,null,null,null,null,null,null,null,null,null,null,null,null,null,null,null,{"$f":"IF(X251=\"\",\"Wybierz z listy rozwijanej czy wnioskodawca oświadcza, że informacje zawarte we wniosku i załącznikach są zgodne z prawdą. \nOświadczenie to jest OBLIGATORYJNE.\",IF(X251=\"TAK\",\"OK - wnioskodawca oświadcza, że informacje zawarte we wniosku i załącznikach są zgodne z prawdą.\",IF(X251=\"nie\",\"Oświadczenie jest OBLIGATORYJNE.\",\"Błąd danej - wprowadzono daną spoza listy rozwijanej\")))","v":"Wybierz z listy rozwijanej czy wnioskodawca oświadcza, że informacje zawarte we wniosku i załącznikach są zgodne z prawdą. \nOświadczenie to jest OBLIGATORYJNE."},null,null,null,null,null,null,null,null,null,null,null,null,null,null,null,null,null,null,null,{"$f":"IF(X251=\"\",\"W\",IF(X251=\"tak\",\"OK\",\"B\"))","v":"W"}]
["Podpisy i pieczątki osób upoważnionych z ramienia wnioskodawcy (ustawowego zarządcy drogi) \nwraz z podpisem Skarbnika/Głównego Księgowego",null,null,null,null,null,null,null,null,null,null,null,null,null,null,null,null,null,null,null,null,null,null,null,null,null,null,null,null,null,"Podpisy i pieczątki osób upoważnionych z ramienia wnioskodawcy (ustawowego zarządcy drogi)  wraz z podpisem Skarbnika/Głównego Księgowego"]
[null,null,null,null,null,null,null,null,null,null,null,null,null,null,null,null,null,null,null,null,null,null,null,null,null,null,null,null,null,null,"Jeśli wnioskodawcą (ustawowym zarządcą drogi) jest :\n - GMINA (samorząd gminy) - podpis i pieczątka wójta/burmistrza/prezydenta oraz skarbnika/głównego księgowego (łącznie 2 podpisy),\n - POWIAT (samorząd powiatu) - podpisy i pieczątki dwóch członków zarządu powiatu oraz skarbnika/głównego księgowego (łącznie 3 podpisy).\n\nW przypadku, gdy właściwa osoba nie może złożyć podpisu i pieczątki dopuszcza się, żeby w jej zastępstwie podpis i pieczątkę złożyła osoba upoważniona. Należy wtedy załączyć do wniosku kopię stosownego upoważnienia potwierdzoną za zgodność z oryginałem.\n"]

{"sheet":"Remont","index":1,"n_rows":254,"n_cols":59,"rows_kept":254,"cut":false,"hidden":false,"merged":[[86,30,86,47],[87,30,90,47],[106,30,106,47],[107,30,107,47],[108,30,108,47],[109,30,109,47],[110,30,110,47],[144,30,144,47],[145,30,145,47],[146,30,146,47],[111,30,111,47],[112,30,112,47],[38,30,38,47],[39,30,39,47],[40,30,40,47],[41,30,41,47],[45,30,45,47],[55,30,55,47],[42,30,42,47],[91,30,91,47],[43,30,44,47],[46,30,53,47],[76,30,76,47],[81,30,81,47],[68,30,68,47],[56,30,62,47],[64,30,67,47],[69,30,75,47],[77,30,80,47],[82,30,85,47],[63,30,63,47],[135,30,135,47],[136,30,136,47],[137,30,137,47],[138,30,138,47],[139,30,139,47],[140,30,140,47],[141,30,141,47],[142,30,142,47],[143,30,143,47],[93,30,93,47],[94,30,94,47],[184,30,184,47],[185,30,185,47],[181,30,181,47],[182,30,182,47],[135,1,135,25],[143,1,143,25],[166,30,166,47],[167,30,167,47],[163,30,163,47],[160,30,160,47],[161,30,161,47],[162,30,162,47],[158,30,158,47],[159,30,159,47],[154,30,154,47],[155,30,157,47],[129,30,129,47],[130,30,130,47],[131,30,131,47],[132,30,132,47],[133,30,133,47],[134,30,134,47],[6,0,6,12],[239,0,239,22],[239,23,239,25],[234,1,234,25],[235,1,235,25],[231,2,231,13],[231,22,231,25],[232,2,232,13],[232,22,232,25],[233,2,233,25],[228,1,228,25],[220,2,220,22],[220,23,220,25],[213,2,213,22],[213,23,215,25],[207,7,207,22],[204,2,204,22],[65,17,65,25],[66,17,66,25],[70,17,70,25],[71,17,71,25],[72,17,72,25],[229,1,229,25],[230,1,230,25],[240,30,240,47],[252,0,252,25],[252,30,252,47],[238,1,238,25],[238,30,238,47],[241,0,241,22],[241,23,241,25],[241,30,241,47],[242,1,242,25],[242,30,242,47],[245,2,245,25],[244,30,247,47],[236,1,236,25],[237,0,237,22],[237,23,237,25],[237,30,237,47],[253,0,253,25],[253,30,253,47],[249,1,249,25],[249,30,249,47],[250,0,250,22],[250,23,250,25],[250,30,250,47],[251,1,251,25],[251,30,251,47],[246,2,246,25],[247,2,247,25],[248,0,248,22],[248,23,248,25],[248,30,248,47],[243,0,243,22],[243,23,243,25],[243,30,243,47],[244,1,244,25],[239,30,239,47],[240,1,240,25],[227,1,227,25],[227,30,227,47],[220,30,220,47],[223,2,223,22],[223,23,224,25],[223,30,223,47],[224,2,224,22],[224,30,224,47],[235,30,235,47],[232,30,232,47],[228,30,228,47],[229,30,229,47],[230,30,230,47],[231,30,231,47],[221,2,221,22],[222,2,222,4],[222,5,222,22],[221,23,222,25],[216,2,216,22],[216,23,218,25],[217,2,217,6],[217,7,217,22],[218,2,218,6],[218,7,218,22],[225,1,225,25],[225,30,225,47],[226,0,226,25],[226,30,226,47],[219,2,219,22],[219,23,219,25],[221,30,222,47],[219,30,219,47],[213,30,215,47],[214,2,214,6],[214,7,214,22],[215,2,215,6],[215,7,215,22],[211,2,211,6],[211,7,211,22],[212,2,212,22],[212,23,212,25],[212,30,212,47],[204,23,204,25],[204,30,204,47],[205,2,205,22],[205,23,207,25],[206,2,206,6],[206,7,206,22],[207,2,207,6],[205,30,211,47],[208,2,208,22],[208,23,211,25],[209,2,209,22],[210,2,210,6],[210,7,210,22],[201,2,201,22],[201,23,203,25],[201,30,201,47],[202,2,202,6],[202,7,202,22],[202,30,202,47],[203,2,203,6],[203,7,203,22],[203,30,203,47],[198,30,198,47],[199,2,199,6],[199,7,199,22],[199,30,199,47],[200,2,200,22],[200,30,200,47],[195,2,195,6],[195,7,195,22],[195,30,195,47],[196,2,196,22],[196,30,196,47],[197,2,197,22],[197,30,197,47],[198,2,198,6],[198,7,198,22],[193,23,195,25],[197,23,199,25],[191,1,191,25],[191,30,191,47],[192,1,192,25],[192,30,192,47],[193,2,193,22],[193,30,193,47],[194,2,194,6],[194,7,194,22],[194,30,194,47],[189,14,189,18],[189,19,189,25],[190,1,190,7],[190,8,190,13],[190,14,190,18],[190,19,190,25],[186,1,186,25],[187,1,187,25],[187,30,187,47],[188,1,188,7],[188,8,188,13],[188,14,188,18],[188,19,188,25],[188,30,190,47],[189,1,189,7],[189,8,189,13],[183,1,183,4],[183,6,183,25],[183,30,183,47],[184,1,184,25],[185,1,185,2],[185,3,185,25],[180,1,180,4],[180,6,180,25],[180,30,180,47],[181,1,181,25],[182,1,182,2],[182,3,182,25],[176,1,176,2],[176,3,176,25],[177,1,177,25],[178,1,178,25],[179,1,179,2],[179,3,179,25],[171,1,171,25],[172,1,172,25],[173,1,173,2],[173,3,173,25],[174,1,174,25],[175,1,175,25],[168,1,168,4],[168,6,168,25],[168,30,168,47],[169,1,169,25],[170,1,170,2],[170,3,170,25],[164,1,164,2],[164,3,164,25],[165,1,165,25],[166,1,166,25],[167,1,167,2],[167,3,167,25],[164,30,164,47],[165,30,165,47],[159,2,159,25],[160,1,160,25],[161,1,161,2],[161,3,161,25],[162,1,162,25],[163,1,163,25],[154,1,154,25],[155,1,155,25],[156,1,156,3],[156,4,156,25],[157,1,157,25],[158,1,158,25],[150,24,150,25],[151,1,151,4],[151,6,151,25],[151,30,151,47],[152,1,152,25],[153,1,153,25],[146,0,150,0],[146,2,146,23],[146,24,146,25],[147,2,147,23],[147,24,147,25],[148,2,148,23],[148,24,148,25],[149,2,149,23],[149,24,149,25],[150,2,150,23],[150,30,150,47],[147,30,147,47],[148,30,148,47],[149,30,149,47],[152,30,152,47],[153,30,153,47],[144,1,144,25],[145,2,145,23],[145,24,145,25],[139,23,139,24],[140,3,140,20],[140,21,140,22],[140,23,140,24],[141,2,141,20],[141,21,141,22],[141,23,141,24],[137,0,142,0],[137,1,140,1],[137,3,137,20],[137,21,137,22],[137,23,137,24],[138,3,138,20],[138,21,138,22],[138,23,138,24],[139,3,139,20],[139,21,139,22],[142,2,142,20],[142,21,142,22],[142,23,142,24],[133,21,133,22],[133,23,133,24],[134,3,134,20],[134,21,134,22],[134,23,134,24],[136,1,136,25],[129,1,129,25],[130,0,134,0],[130,2,130,20],[130,21,130,22],[130,23,130,24],[131,2,131,25],[132,3,132,20],[132,21,132,22],[132,23,132,24],[133,3,133,20],[126,1,126,25],[127,1,127,4],[127,6,127,25],[127,30,127,47],[128,1,128,13],[128,14,128,25],[121,1,121,25],[122,1,122,12],[122,13,122,25],[123,1,123,25],[124,1,125,2],[124,3,124,10],[124,11,124,25],[125,3,125,10],[125,11,125,25],[128,30,128,47],[123,30,123,47],[124,30,126,47],[121,30,121,47],[122,30,122,47],[116,1,116,25],[117,1,117,25],[118,1,118,25],[119,1,119,2],[119,3,119,25],[120,1,120,25],[113,1,113,4],[113,6,113,25],[113,30,113,47],[114,1,114,25],[115,1,115,2],[115,3,115,25],[117,30,117,47],[120,30,120,47],[114,30,116,47],[118,30,119,47],[110,3,110,23],[110,24,110,25],[111,3,111,23],[111,24,111,25],[112,3,112,23],[112,24,112,25],[106,3,106,23],[106,24,106,25],[107,3,107,23],[107,24,107,25],[108,2,108,25],[109,3,109,23],[109,24,109,25],[94,5,94,25],[95,1,95,25],[95,30,95,47],[103,3,103,23],[103,24,103,25],[104,3,104,23],[104,24,104,25],[105,3,105,23],[105,24,105,25],[99,2,99,23],[99,24,99,25],[100,2,100,23],[100,24,100,25],[101,1,101,25],[102,2,102,25],[97,30,97,47],[99,30,99,47],[100,30,100,47],[101,30,101,47],[102,30,102,47],[103,30,103,47],[104,30,104,47],[105,30,105,47],[94,1,94,4],[88,17,88,25],[89,17,89,25],[90,17,90,25],[85,1,85,7],[85,9,85,10],[88,1,88,7],[88,9,88,10],[88,12,88,13],[88,14,88,15],[87,1,87,7],[87,8,87,16],[87,17,87,25],[90,1,90,7],[90,9,90,10],[85,17,85,25],[89,1,89,7],[89,9,89,10],[89,12,89,13],[89,14,89,15],[86,1,86,25],[84,1,84,7],[84,9,84,10],[84,12,84,13],[84,14,84,15],[80,1,80,7],[80,9,80,10],[83,1,83,7],[83,9,83,10],[83,12,83,13],[83,14,83,15],[82,1,82,7],[82,8,82,16],[81,1,81,25],[83,17,83,25],[72,9,72,10],[73,9,73,10],[77,8,77,16],[77,17,77,25],[73,12,73,13],[73,14,73,15],[74,9,74,10],[74,12,74,13],[73,17,73,25],[74,17,74,25],[75,17,75,25],[75,9,75,10],[76,1,76,25],[62,1,62,7],[62,8,62,24],[64,1,64,7],[64,8,64,16],[64,17,64,25],[65,1,65,7],[65,8,65,15],[63,1,63,25],[70,1,70,7],[70,9,70,10],[70,12,70,13],[70,14,70,15],[66,1,66,7],[66,8,66,15],[67,1,67,7],[67,8,67,16],[67,17,67,25],[69,1,69,7],[69,8,69,16],[69,17,69,25],[68,1,68,25],[59,1,59,7],[59,8,59,16],[59,17,59,25],[60,1,60,7],[60,8,60,25],[61,1,61,7],[61,8,61,25],[57,1,57,7],[57,8,57,16],[57,17,57,25],[58,1,58,7],[58,8,58,16],[58,17,58,25],[55,0,55,7],[55,8,55,16],[55,17,55,25],[56,1,56,7],[56,8,56,16],[56,17,56,25],[53,0,53,2],[53,3,53,12],[53,13,53,19],[53,20,53,25],[54,1,54,25],[50,0,50,2],[50,3,50,7],[50,8,50,12],[50,13,50,19],[50,20,50,25],[54,30,54,47],[51,0,51,2],[51,3,51,7],[51,8,51,12],[51,13,51,19],[51,20,51,25],[52,0,52,2],[52,3,52,7],[52,8,52,12],[52,13,52,19],[52,20,52,25],[48,0,48,2],[48,3,48,7],[48,8,48,12],[48,13,48,19],[48,20,48,25],[49,0,49,2],[49,3,49,7],[49,8,49,12],[49,13,49,19],[49,20,49,25],[46,0,46,2],[46,3,46,7],[46,8,46,12],[46,13,46,19],[46,20,46,25],[41,1,41,19],[41,20,41,25],[42,1,42,25],[47,0,47,2],[47,3,47,7],[47,8,47,12],[47,13,47,19],[47,20,47,25],[43,0,43,25],[44,0,45,2],[44,3,44,12],[44,13,45,19],[44,20,45,25],[45,3,45,7],[38,1,38,3],[38,4,38,25],[39,1,39,19],[39,20,39,25],[40,1,40,3],[40,4,40,25],[45,8,45,12],[36,1,36,3],[36,4,36,25],[36,30,36,47],[37,1,37,19],[37,20,37,25],[37,30,37,47],[33,0,33,9],[33,10,33,25],[33,30,33,47],[34,1,34,25],[34,30,34,47],[35,1,35,19],[35,20,35,25],[35,30,35,47],[31,1,31,9],[31,10,31,17],[31,18,31,25],[31,30,31,47],[32,0,32,9],[32,10,32,17],[32,18,32,25],[32,30,32,47],[29,1,29,9],[29,10,29,17],[29,18,29,25],[29,30,29,47],[30,1,30,9],[30,10,30,17],[30,18,30,25],[30,30,30,47],[27,1,27,9],[27,10,27,17],[27,18,27,25],[27,30,27,47],[28,1,28,9],[28,10,28,17],[28,18,28,25],[28,30,28,47],[25,30,25,47],[26,1,26,25],[26,30,26,47],[25,8,25,14],[25,16,25,24],[22,17,22,21],[22,22,22,25],[22,30,22,47],[23,1,23,25],[23,30,23,47],[24,30,24,47],[19,0,19,25],[19,30,19,47],[20,1,20,25],[20,30,20,47],[21,0,22,2],[21,3,22,11],[21,12,22,15],[21,17,21,21],[21,22,21,25],[21,30,21,47],[24,8,24,15],[24,16,24,25],[24,0,25,7],[18,1,18,3],[18,4,18,6],[18,7,18,10],[18,11,18,17],[18,18,18,25],[18,30,18,47],[16,1,16,25],[16,30,16,47],[17,1,17,3],[17,4,17,6],[17,7,17,10],[17,11,17,17],[17,18,17,25],[17,30,17,47],[14,1,14,25],[14,30,14,47],[15,0,15,25],[15,30,15,47],[12,13,12,15],[12,16,12,21],[12,22,12,25],[12,30,12,47],[13,13,13,15],[13,16,13,25],[13,30,13,47],[7,0,13,12],[10,13,10,15],[10,16,10,25],[10,30,10,47],[11,13,11,15],[11,16,11,25],[11,30,11,47],[6,13,6,25],[6,26,11,28],[6,30,7,47],[7,13,7,25],[8,13,8,25],[8,30,8,47],[9,13,9,15],[9,16,9,25],[9,30,9,47],[3,0,3,3],[3,4,3,25],[3,30,3,47],[4,0,4,25],[4,30,5,47],[5,0,5,25],[0,1,0,3],[0,4,0,25],[0,30,1,47],[1,1,1,3],[1,4,1,25],[2,4,2,25],[2,30,2,47],[91,1,91,25],[77,1,77,7],[74,14,74,15],[78,17,78,25],[79,17,79,25],[73,1,73,7],[74,1,74,7],[71,1,71,7],[71,9,71,10],[71,12,71,13],[71,14,71,15],[82,17,82,25],[84,17,84,25],[80,17,80,25],[79,1,79,7],[79,9,79,10],[79,12,79,13],[79,14,79,15],[72,1,72,7],[75,1,75,7],[78,1,78,7],[78,9,78,10],[78,12,78,13],[78,14,78,15],[178,30,178,47],[179,30,179,47],[92,1,92,4],[93,1,93,4],[216,30,218,47],[175,30,175,47],[176,30,176,47],[177,30,177,47],[174,30,174,47],[172,30,172,47],[173,30,173,47],[169,30,169,47],[170,30,170,47],[171,30,171,47],[92,5,92,25],[92,30,92,47],[96,1,96,4],[96,6,96,25],[96,30,96,47],[97,1,97,25],[98,2,98,23],[98,24,98,25],[98,30,98,47],[93,5,93,25]]}
["!"," UWAGA: ",null,null,"WNIOSEK NALEŻY ZŁOŻYĆ ZA PISMEM PRZEWODNIM.",null,null,null,null,null,null,null,null,null,null,null,null,null,null,null,null,null,null,null,null,null,null,null,null,null,"INSTRUKCJA WYPEŁNIANIA WNIOSKU",null,null,null,null,null,null,null,null,null,null,null,null,null,null,null,null,null,null,null,null,null,null,null,null,null,"OK"]
[null,null,null,null,"PRZED WYPEŁNIENIEM WNIOSKU NALEŻY ZAPOZNAĆ SIĘ Z INSTRUKCJĄ ",null,null,null,null,null,null,null,null,null,null,null,null,null,null,null,null,null,null,null,null,null,null,null,null,null,null,null,null,null,null,null,null,null,null,null,null,null,null,null,null,null,null,null,null,null,null,null,null,null,null,null,"Wprowadzono błędną daną - proszę wprowadzić poprawną daną wybierając ją z listy rozwijanej"]
[null,null,null,null,"WYPEŁNIAJĄC WNIOSEK NALEŻY KIEROWAĆ SIĘ INSTRUKCJĄ POMOCNICZĄ I WSKAZÓWKAMI  - (szare pola po prawej stronie wniosku oraz żółte pola pojawiające się po zaznaczeniu komórki).",null,null,null,null,null,null,null,null,null,null,null,null,null,null,null,null,null,null,null,null,null,null,null,null,null,"szare pola - NIE ZMIENIAJ"]
[null,null,null,null,"PLIK ZOSTAŁ ZABEZPIECZONY PRZED EDYTOWANIEM. \nPROSZĘ NIE USUWAĆ ZABEZPIECZEŃ I SAMODZIELNIE NIE EDYTOWAĆ PLIKU.",null,null,null,null,null,null,null,null,null,null,null,null,null,null,null,null,null,null,null,null,null,null,null,null,null,"żółte pola - WYBIERZ Z LISTY ROZWIJANEJ"]
["WNIOSEK O DOFINANSOWANIE W RAMACH RZĄDOWEGO FUNDUSZU ROZWOJU DRÓG",null,null,null,null,null,null,null,null,null,null,null,null,null,null,null,null,null,null,null,null,null,null,null,null,null,null,null,null,null,"białe pola - WPISZ"]
["REMONT"]
["PIECZĘĆ WPŁYWU DO URZĘDU WOJEWÓDZKIEGO",null,null,null,null,null,null,null,null,null,null,null,null,"NR EWIDENCYJNY \nWNIOSKU",null,null,null,null,null,null,null,null,null,null,null,null,"POLA POMOCNICZE - liczniki znaków użytych\nw komórkach",null,null,null,"PIECZĘĆ WPŁYWU DO URZĘDU WOJEWÓDZKIEGO oraz NR EWIDENCYJNY WNIOSKU uzupełniają pracownicy Świętokrzyskiego Urzędu Wojewódzkiego."]
[null,null,null,null,null,null,null,null,null,null,null,null,null,"/A /2025     "]
[null,null,null,null,null,null,null,null,null,null,null,null,null,"1. JEDNOSTKA SAMORZĄDU TERYTORIALNEGO",null,null,null,null,null,null,null,null,null,null,null,null,null,null,null,null,{"$f":"N9","v":"1. JEDNOSTKA SAMORZĄDU TERYTORIALNEGO"}]
[null,null,null,null,null,null,null,null,null,null,null,null,null,"JST  ",null,null,null,null,null,null,null,null,null,null,null,null,null,null,null,null,{"$f":"IF(Q10=\"\",\"Wybierz z listy rozwijanej jaka jednostka ubiega się o dofinansowanie (powiat czy gmina)\",IF(AND(Q10<>\"\",AY10<>\"B\"),\"OK\",\"Błąd danej - wprowadź poprawną daną wybierając ją z listy rozwijanej\"))","v":"Wybierz z listy rozwijanej jaka jednostka ubiega się o dofinansowanie (powiat czy gmina)"},null,null,null,null,null,null,null,null,null,null,null,null,null,null,null,null,null,null,{"$f":"IF(AE10=\"\",\"\",IF(AE10=\"OK\",\"OK\",IF(AE10=\"Wprowadzono błędną daną - wprowadź poprawną daną wybierając ją z listy rozwijanej\",\"B\",\"W\")))","v":"W"},{"$f":"IFERROR(IF(Q10=\"\",\"\",VLOOKUP(Q10,DANE!B8:B9,1,0)),\"B\")","v":""}]
[null,null,null,null,null,null,null,null,null,null,null,null,null,"POWIAT  ",null,null,null,null,null,null,null,null,null,null,null,null,null,null,null,null,{"$f":"IF(AND(Q10=\"\",Q11=\"\"),\"\",IF(AND(Q10=\"POWIAT\",Q11=\"\"),\"Wybierz z listy rozwijanej powiat\",IF(AND(Q10=\"\",Q11<>\"\"),\"Wybierz z listy rozwijanej JST (pole powyżej)\",IF(AND(Q10=\"GMINA\",Q11=\"\"),\"Wybierz z listy rozwijanej powiat, w którym znajduje się gmina\",IF(AY11=\"b\",\"Błąd danej - wprowadź poprawną daną wybierając ją z listy rozwijanej\",\"OK\")))))","v":""},null,null,null,null,null,null,null,null,null,null,null,null,null,null,null,null,null,null,{"$f":"IF(AE11=\"\",\"\",IF(AE11=\"OK\",\"OK\",IF(AE11=\"Wprowadzono błędną daną - wprowadź poprawną daną wybierając ją z listy rozwijanej\",\"B\",\"W\")))","v":""},{"$f":"IFERROR(IF(Q11=\"\",\"\",VLOOKUP(Q11,POWIAT[POWIAT],1,FALSE)),\"B\")","v":""}]
[null,null,null,null,null,null,null,null,null,null,null,null,null,{"$f":"IF(Q10=\"powiat\",\"\",\"GMINA  \")","v":"GMINA  "},null,null,null,null,null,null,null,null,null,null,null,null,null,null,null,null,{"$f":"IF(AND(Q10=\"POWIAT\",Q12=\"\"),\"\",IF(AND(Q10=\"POWIAT\",Q12<>\"\"),\"Błąd danej - błędnie wskazana JST lub GMINA\",IF(AND(Q10=\"GMINA\",Q11=\"\"),\"\",IF(AND(Q10=\"GMINA\",Q11<>\"\",Q12=\"\"),\"Wybierz z listy rozwijanej gminę\",IF(AND(Q10=\"\",Q11<>\"\",Q12<>\"\"),\"Wybierz z listy rozwijanej JST (dwa pola powyżej)\",IF(AND(Q10=\"\",Q11=\"\",Q12<>\"\"),\"Wybierz z listy rozwijanej JST (dwa pola powyżej) oraz POWIAT (pole powyżej)\",IF(AND(Q10=\"\",Q11=\"\",Q12=\"\"),\"\",IF(AND(Q10<>\"\",AX10=\"b\"),\"\",\"OK\"))))))))","v":""},null,null,null,null,null,null,null,null,null,null,null,null,null,null,null,null,null,null,{"$f":"IFERROR(IF(AE12=\"\",\"\",IF(AE12=\"OK\",\"OK\",IF(FIND(\"błąd danej\",AE12),\"B\",\"W\"))),\"W\")","v":""}]
[null,null,null,null,null,null,null,null,null,null,null,null,null,"NR TERC  ",null,null,{"$f":"IFERROR(IF(Q10=\"powiat\",VLOOKUP(Q11,DANE!$D$46:$H$58,4,0),IF(Q10=\"gmina\",VLOOKUP(Q12,DANE!$E$59:$H$159,3,0),\"\")),\"\")","v":""},null,null,null,null,null,{"$f":"IFERROR(IF(Q10=\"powiat\",VLOOKUP(Q11,DANE!$D$46:$H$58,5,0),IF(Q10=\"gmina\",VLOOKUP(Q12,DANE!$E$59:$H$159,4,0),\"\")),\"\")","v":""},null,null,null,null,"↓",null,null,{"$f":"IF(Q13=\"\",\"NR TERC ładuje się automatycznie po uzupełnieniu powyższych danych dotyczących jst\",IF(AND(Q10=\"POWIAT\",Q13<>\"\",AY13=4),\"OK - Załadowano NR TERC dla powiatu\",IF(AND(Q10=\"GMINA\",Q13<>\"\",AY13=7),\"OK - Załadowano NR TERC dla gminy\",IF(AND(Q10=\"POWIAT\",Q13<>\"\",AY13=7),\"Błąd danej - Załadowano NR TERC dla gminy\",IF(AND(Q10=\"GMINA\",Q13<>\"\",AY13=4),\"błąd danej - Załadowano NR TERC dla powiatu\",\"\")))))","v":"NR TERC ładuje się automatycznie po uzupełnieniu powyższych danych dotyczących jst"},null,null,null,null,null,null,null,null,null,null,null,null,null,null,null,null,null,null,{"$f":"IF(AE13=\"\",\"\",IF(AE13=\"NR TERC ładuje się automatycznie po uzupełnieniu powyższych danych dotyczących jst\",\"\",IFERROR(IF(FIND(\"OK\",AE13),\"OK\",\"\"),IF(FIND(\"Błąd danej\",AE13),\"B\",\"\"))))","v":""},{"$f":"LEN(Q13)","v":0}]
[null,null,null,null,null,null,null,null,null,null,null,null,null,"ADRES  ",null,null,null,null,null,null,null,null,null,null,null,null,{"$f":"LEN(Q14)","v":0},"z",120,null,{"$f":"IF(AA14=0,\"Wpisz adres jednostki samorządu terytorialnego ubiegającej się o dofinansowanie - [można użyć do 120 znaków]\",IF(AA14>120,\"błąd danej - Wprowadzono zbyt dużą ilość znków. Zmniejsz ilość wprowadzonych znaków\",\"Wprowadzono dane dotyczące adresu jednostki samorządu terytorialnego\"))","v":"Wpisz adres jednostki samorządu terytorialnego ubiegającej się o dofinansowanie - [można użyć do 120 znaków]"},null,null,null,null,null,null,null,null,null,null,null,null,null,null,null,null,null,null,{"$f":"IF(AE14=\"\",\"\",IF(AND(AA14>0,AE14=\"Wprowadzono dane dotyczące adresu jednostki samorządu terytorialnego\"),\"D\",IF(AND(AA14=0,AE14=\"Wpisz adres jednostki samorządu terytorialnego ubiegającej się o dofinansowanie - [można użyć do 120 znaków]\"),\"W\",IFERROR(IF(AE14=\"Wprowadzono zbyt dużą ilość znków. Zmniejsz ilość wprowadzonych znaków\",\"B\",\"\"),\"\"))))","v":"W"}]
["2. ","TYTUŁ ZADANIA (nazwa zadania)",null,null,null,null,null,null,null,null,null,null,null,null,null,null,null,null,null,null,null,null,null,null,null,null,null,null,null,null,{"$f":"_xlfn.CONCAT(A15,B15)","v":"2. TYTUŁ ZADANIA (nazwa zadania)"}]
[null,null,null,null,null,null,null,null,null,null,null,null,null,null,null,null,null,null,null,null,null,null,null,null,null,null,{"$f":"LEN(A16)","v":0},"z",300,null,"Wpisz tytuł zadania (nazwę zadania) - [można użyć do 300 wszystkich znaków]\nWAŻNE:\nTytuł powinien identyfikować zadanie (rodzaj robót i ich lokalizację: nazwa ulicy, nr drogi i lokalizacja drogi) oraz sugerować klasyfikację środków (budowa/przebudowa lub remont)"]
["3. \n","LOKALIZACJA ZADANIA (kategoria, numer i lokalizacja drogi, na której znajduje się realizowane zadanie)",null,null,null,null,null,null,null,null,null,null,null,null,null,null,null,null,null,null,null,null,null,null,null,null,null,null,null,null,{"$f":"_xlfn.CONCAT(A17,B17)","v":"3. \nLOKALIZACJA ZADANIA (kategoria, numer i lokalizacja drogi, na której znajduje się realizowane zadanie)"}]
["L.p.","KATEGORIA",null,null,"NR DROGI",null,null,"POWIAT ",null,null,null,"GMINA",null,null,null,null,null,null,"MIEJSCOWOŚĆ",null,null,null,null,null,null,null,null,null,null,null,"Wybierz z list rozwijanych kategorię drogi oraz powiat i gminę"]
[1,null,null,null,null,null,null,null,null,null,null,null,null,null,null,null,null,null,null,null,null,null,null,null,null,null,null,null,null,null,"Wpisz nr drogi, na której znajduje się zgłoszone zadanie oraz miejscowość"]
[null,null,null,null,null,null,null,null,null,null,null,null,null,null,null,null,null,null,null,null,null,null,null,null,null,null,{"$f":"LEN(A20)","v":0},"z",400,null,"(miejsce na dodatkowe informacje dotyczące rodzaju i lokalizacji zadania np., gdy droga biegnie przez więcej niż jedną gminę lub więcej niż jedną miejscowość)"]
["4. ","PRZEWIDYWANY OKRES REALIZACJI ZADANIA (rozpoczęcie i zakończenie realizacji zadania)",null,null,null,null,null,null,null,null,null,null,null,null,null,null,null,null,null,null,null,null,null,null,null,null,null,null,null,null,{"$f":"_xlfn.CONCAT(A21,B21)","v":"4. PRZEWIDYWANY OKRES REALIZACJI ZADANIA (rozpoczęcie i zakończenie realizacji zadania)"}]
["Zadanie ",null,null,{"$f":"IF(AND(R22=\"\",R23=\"\",W23=\"\"),\"\",IFERROR(IF(BG22=0,\"nie wybrano lub błędnie wybrano daty realizacji zadania\",IF(BG22<12,\"JEDNOROCZNE\",\"WIELOLETNIE\")),\"nie wybrano lub błędnie wybrano daty realizacji zadania\"))","v":""},null,null,null,null,null,null,null,null,"realizowane ",null,null,null,"od ",null,null,null,null,null,2025,null,null,null,null,null,null,null,"Wybierz z listy rozwijanej przewidywany miesiąc rozpoczęcia robót budowlanych",null,null,null,null,null,null,null,null,null,null,null,null,null,null,null,null,null,null,null,null,null,null,null,null,null,{"$f":"IF(R22=\"stycznia\",1,IF(R22=\"lutego\",2,IF(R22=\"marca\",3,IF(R22=\"kwietnia\",4,IF(R22=\"maja\",5,IF(R22=\"czerwca\",6,IF(R22=\"lipca\",7,IF(R22=\"sierpnia\",8,IF(R22=\"września\",9,IF(R22=\"października\",10,IF(R22=\"listopada\",11,IF(R22=\"grudnia\",12,\"\"))))))))))))","v":""},{"$f":"DATE(W22,BE22,1)","v":{"$error":"#VALUE!"}},{"$f":"DATEDIF(BF22,BF23,\"m\")","v":{"$error":"#VALUE!"}}]
[null,null,null,null,null,null,null,null,null,null,null,null,null,null,null,null,"do ",null,null,null,null,null,null,null,null,null,null,null,null,null,"Wybierz z listy rozwijanej przewidywany miesiąc i rok zakończenia robót budowlanych",null,null,null,null,null,null,null,null,null,null,null,null,null,null,null,null,null,null,null,null,null,null,null,null,null,{"$f":"IF(R23=\"stycznia\",1,IF(R23=\"lutego\",2,IF(R23=\"marca\",3,IF(R23=\"kwietnia\",4,IF(R23=\"maja\",5,IF(R23=\"czerwca\",6,IF(R23=\"lipca\",7,IF(R23=\"sierpnia\",8,IF(R23=\"września\",9,IF(R23=\"października\",10,IF(R23=\"listopada\",11,IF(R23=\"grudnia\",12,\"\"))))))))))))","v":""},{"$f":"DATE(W23,BE23,1)","v":{"$error":"#VALUE!"}},{"$f":"IFERROR(IF(BG22>0,\"OK\",\"BŁĄD\"),\"liczba\")","v":"liczba"}]
["5. ","DŁUGOŚĆ ODCINKÓW DRÓG OBJĘTYCH ZADANIEM, WG RODZAJU ROBÓT BUDOWLANYCH [km]",null,null,null,null,null,null,null,null,null,null,null,null,null,null,null,null,null,null,null,null,null,null,null,null,null,null,null,null,{"$f":"_xlfn.CONCAT(A24,B24)","v":"5. DŁUGOŚĆ ODCINKÓW DRÓG OBJĘTYCH ZADANIEM, WG RODZAJU ROBÓT BUDOWLANYCH [km]"}]
[null,null,null,null,null,null,null,null,"REMONT",null,null,null,null,null,null,null,"ŁĄCZNIE",null,null,null,null,null,null,null,null,null,null,null,null,null,"Wpisz długość odcinka objętego danym rodzajem robót budowlanych (długość podaj w metrach)",null,null,null,null,null,null,null,null,null,null,null,null,null,null,null,null,null,null,null,null,null,null,null,null,null,"funkcja do opracowania/zastanowienia"]
[null,null,null,null,null,null,null,null,null,null,null,null,null,null,null,"m",{"$f":"IF(I26=\"\",\"\",I26)","v":""},null,null,null,null,null,null,null,null,"m",null,null,null,null,"Łączna długość załaduje się automatycznie. Powinna być taka sama jak realizowana długość odcinka w pkt 9",null,null,null,null,null,null,null,null,null,null,null,null,null,null,null,null,null,null,null,null,null,null,null,null,null,{"$f":"IF(AND(A26=\"\",G26=\"\",M26=\"\"),\"\",IF(AND(A26<>\"\",G26=\"\",M26=\"\"),\"BUDOWA\",IF(AND(A26=\"\",G26<>\"\",M26=\"\"),\"ROZBUDOWA\",IF(AND(A26=\"\",G26=\"\",M26<>\"\"),\"PRZEBUDOWA\",IF(AND(A26<>\"\",G26<>\"\",M26=\"\",A26>G26),\"BUDOWA (rozbudowa)\",IF(AND(A26<>\"\",G26<>\"\",M26=\"\",A26<G26),\"ROZBUDOWA (budowa)\",IF(AND(A26<>\"\",G26=\"\",M26<>\"\",A26>M26),\"BUDOWA (przebudowa)\",IF(AND(A26<>\"\",G26=\"\",M26<>\"\",A26<M26),\"PRZEBUDOWA (budowa)\",IF(AND(A26=\"\",G26<>\"\",M26<>\"\",G26>M26),\"ROZBUDOWA (przebudowa)\",IF(AND(A26=\"\",G26<>\"\",M26<>\"\",G26<M26),\"PRZEBUDOWA (rozbudowa)\",IF(AND(A26<>\"\",G26<>\"\",M26<>\"\",A26>M26,A26>G26,G26>M26),\"BUDOWA (rozbudowa, przebudowa)\",IF(AND(A26<>\"\",G26<>\"\",M26<>\"\",A26>M26,A26>G26,G26<M26),\"BUDOWA (przebudowa, rozbudowa)\",IF(AND(A26<>\"\",G26<>\"\",M26<>\"\",G26>A26,G26>M26,A26>M26),\"ROZBUDOWA (budowa, przebudowa)\",IF(AND(A26<>\"\",G26<>\"\",M26<>\"\",G26>A26,G26>M26,A26<M26),\"ROZBUDOWA (przebudowa, budowa)\",IF(AND(A26<>\"\",G26<>\"\",M26<>\"\",M26>A26,M26>G26,A26>G26),\"PRZEBUDOWA (budowa, rozbudowa)\",IF(AND(A26<>\"\",G26<>\"\",M26<>\"\",M26>A26,M26>G26,A26<G26),\"PRZEBUDOWA (rozbudowa, budowa)\",\"\"))))))))))))))))","v":""}]
["6. ","PRZEWIDYWANY HARMONOGRAM RZECZOWO-FINANSOWY REALIZACJI ZADANIA (brutto)",null,null,null,null,null,null,null,null,null,null,null,null,null,null,null,null,null,null,null,null,null,null,null,null,null,null,null,null,{"$f":"_xlfn.CONCAT(A27,B27)","v":"6. PRZEWIDYWANY HARMONOGRAM RZECZOWO-FINANSOWY REALIZACJI ZADANIA (brutto)"}]
["Lp.","ELEMENTY I RODZAJE ROBÓT",null,null,null,null,null,null,null,null,"KOSZT KWALIFIKOWALNY [zł]",null,null,null,null,null,null,null,"KOSZT NIEKWALIFIKOWALNY [zł]"]
["1.","Roboty budowlane",null,null,null,null,null,null,null,null,null,null,null,null,null,null,null,null,null,null,null,null,null,null,null,null,null,null,null,null,"Wpisz koszt brutto robót budowlanych w podziale na wydatki kwalifikowalne i niekwalifikowalne"]
["2.","Nadzór inwestorski (wszystkie branże)",null,null,null,null,null,null,null,null,null,null,null,null,null,null,null,null,null,null,null,null,null,null,null,null,null,null,null,null,"Wpisz koszt brutto nadzoru inwestorskiego (wszystkie branże) w podziale na wydatki kwalifikowalne i niekwalifikowalne"]
["3.","Tablice informacyjne",null,null,null,null,null,null,null,null,null,null,null,null,null,null,null,null,null,null,null,null,null,null,null,null,null,null,null,null,"Wpisz koszt brutto tablic informacyjnych w podziale na wydatki kwalifikowalne i niekwalifikowalne"]
["4.","Dodatkowy obowiązek informacyjny\n(jeśli dotyczy na podst. art. 38 ust. 6 ustawy o RFRD)"]
["SUMA ",null,null,null,null,null,null,null,null,null,{"$f":"SUM(K29:R32)","v":0},null,null,null,null,null,null,null,{"$f":"SUM(S29:Z32)","v":0},null,null,null,null,null,null,null,null,null,null,null,"SUMY OBLICZĄ SIĘ AUTOMATYCZNIE"]
["OGÓŁEM ",null,null,null,null,null,null,null,null,null,{"$f":"SUM(K33,S33)","v":0},null,null,null,null,null,null,null,null,null,null,null,null,null,null,null,null,null,null,null,"KWOTA OGÓŁEM OBLICZY SIĘ AUTOMATYCZNIE"]
["7. ","PRZEWIDYWANE KOSZTY REALIZACJI ZADANIA BRUTTO - WYDATKI KWALIFIKOWALNE [zł]",null,null,null,null,null,null,null,null,null,null,null,null,null,null,null,null,null,null,null,null,null,null,null,null,null,null,null,null,{"$f":"_xlfn.CONCAT(A35,B35)","v":"7. PRZEWIDYWANE KOSZTY REALIZACJI ZADANIA BRUTTO - WYDATKI KWALIFIKOWALNE [zł]"}]
["A.","ŁĄCZNY KOSZT REALIZACJI ZADANIA [zł]",null,null,null,null,null,null,null,null,null,null,null,null,null,null,null,null,null,null,{"$f":"K33","v":0},null,null,null,null,null,null,null,null,null,"Koszty i kwoty słownie załadują się automatycznie po poprawnym wypełnieniu pkt 6 wniosku",null,null,null,null,null,null,null,null,null,null,null,null,null,null,null,null,null,null,null,null,null,null,null,null,null,{"$f":"IF(K33=U36,\"ok\",\"b\")","v":"ok"},null,{"$f":"IF(U36<0,\"b\",\"OK\")","v":"OK"}]
[null,"SŁOWNIE :",null,null,{"$f":"IF(OR(U36=0,U36=\"\"),\"\",Slownie(U36))","v":""}]
["B.","KWOTA WNIOSKOWANEGO DOFINANSOWANIA [zł]",null,null,null,null,null,null,null,null,null,null,null,null,null,null,null,null,null,null,{"$f":"IF(OR(U36=\"\",U42=\"\"),\"\",IF(ROUNDDOWN(U36*U42,0)>30000000,BF38,ROUNDDOWN((U36*U42),0)))","v":0},null,null,null,null,null,null,null,null,null,"Kwota dofinansowania nie może przekraczać 30 mln zł, jeśli przekracza, to wniosek ją automatycznie zmniejsza do kwoty maksymalnej",null,null,null,null,null,null,null,null,null,null,null,null,null,null,null,null,null,null,null,null,null,null,null,null,null,{"$f":"IF(U38>BF38,\"b\",\"ok\")","v":"ok"},30000000,{"$f":"IF(U38<0,\"b\",\"OK\")","v":"OK"}]
[null,"SŁOWNIE :",null,null,{"$f":"IF(OR(U38=0,U38=\"\"),\" \",Slownie(U38))","v":" "}]
["C.","KWOTA WKŁADU WŁASNEGO [zł]",null,null,null,null,null,null,null,null,null,null,null,null,null,null,null,null,null,null,{"$f":"IF(OR(U36=\"\",U42=\"\"),\"\",U36-U38)","v":0},null,null,null,null,null,null,null,null,null,null,null,null,null,null,null,null,null,null,null,null,null,null,null,null,null,null,null,null,null,null,null,null,null,null,null,null,null,{"$f":"IF(U40<0,\"b\",\"OK\")","v":"OK"}]
[null,"SŁOWNIE :",null,null,{"$f":"IF(OR(U40=0,U40=\"\"),\" \",Slownie(U40))","v":" "}]
["D.","UDZIAŁ DOFINANSOWANIA W KOSZTACH KWALIFIKOWALNYCH ZADANIA [%]",null,null,null,null,null,null,null,null,null,null,null,null,null,null,null,null,null,null,0.8,null,null,null,null,null,null,null,null,null,"Poziom dofinansowania nie może przekraczać 80,00%. Wprowadzono 80,00%, ale dana ta może ulec zmianie zgodnie z zatwierdzoną listą",null,null,null,null,null,null,null,null,null,null,null,null,null,null,null,null,null,null,null,null,null,null,null,null,null,null,{"$f":"U38/U36","v":{"$error":"#DIV/0!"}},{"$f":"IF(U42<0,\"b\",\"OK\")","v":"OK"}]
["8. ","PRZEWIDYWANY TERMIN DOKONYWANIA WYPŁAT NA RZECZ WYKONAWCY ZADANIA",null,null,null,null,null,null,null,null,null,null,null,null,null,null,null,null,null,null,null,null,null,null,null,null,null,null,null,null,{"$f":"_xlfn.CONCAT(A43,B43)","v":"8. PRZEWIDYWANY TERMIN DOKONYWANIA WYPŁAT NA RZECZ WYKONAWCY ZADANIA"}]
["KWOTA DO WYPŁATY W DANYM ROKU NA RZECZ WYKONAWCY ZADANIA ",null,null,null,null,null,null,null,null,null,null,null,null,null,null,null,null,null,null,null,null,null,null,null,null,null,null,null,null,null,"Uzupełnij dane dotyczące dokonywania wypłat na rzecz wykonawcy zadania w podziale na poszczególne lata oraz na wydatki kwalifikowalne i niekwalifikowalne. Wydatki kwalifikowalne należy podać w podziale na dofinansowanie i wkład własny."]
["ROK",null,null,"KWALIFIKOWALNE",null,null,null,null,null,null,null,null,null,"NIEKWALIFIKOWALNE",null,null,null,null,null,null,"OGÓŁEM"]
[null,null,null,"DOFINANSOWANIE",null,null,null,null,"WKŁAD WŁASNY"]
[2025,null,null,null,null,null,null,null,null,null,null,null,null,null,null,null,null,null,null,null,{"$f":"IF(AND(D47=\"\",I47=\"\",N47=\"\"),\"\",SUM(D47:T47))","v":""},null,null,null,null,null,null,null,null,null,"Jeśli dane nie będą wprowadzone poprawnie, to kwoty sum i łącznie wyświetlą się czerwoną czcionką. \nBędzie to miało miejsce w przypadku, gdy:\n - kwota dofinansowania (suma z wiersza 53), będzie się różnić od kwoty dofinansowania w pkt 7 lit. B (wiersz 38);\n - kwota wkładu własnego (suma z wiersza 53), będzie się różnić od kwoty wkładu własnego w pkt 7 lit. C (wiersz 40);\n - kwota środków kwalifikowalnych (łącznie z wiersza 54), będzie się różnić od kwoty łącznego kosztu realizacji zadania w pkt 7 lit. A (wiersz 36);\n - kwota środków niekwalifikowalnych (łącznie z wiersza 54), będzie się różnić od kwoty kosztów niekwalifikowalnych w pkt 6 (wiersz 33);\n - kwota środków ogółem (łącznie z wiersza 54), będzie się różnić od kwoty kosztów ogółem w pkt 6 (wiersz 34);\n\nNależy wtedy poprawić kwoty z wierszy 47-52 lub kwoty z pkt 6 (jeśli tam zostały wprowadzone błędnie)"]
[2026,null,null,null,null,null,null,null,null,null,null,null,null,null,null,null,null,null,null,null,{"$f":"IF(AND(D48=\"\",I48=\"\",N48=\"\"),\"\",SUM(D48:T48))","v":""}]
[2027,null,null,null,null,null,null,null,null,null,null,null,null,null,null,null,null,null,null,null,""]
[2028,null,null,null,null,null,null,null,null,null,null,null,null,null,null,null,null,null,null,null,""]
[2029,null,null,null,null,null,null,null,null,null,null,null,null,null,null,null,null,null,null,null,""]
[2030,null,null,null,null,null,null,null,null,null,null,null,null,null,null,null,null,null,null,null,""]
["SUMA",null,null,{"$f":"SUM(D47:H52)","v":0},null,null,null,null,{"$f":"SUM(I47:M52)","v":0},null,null,null,null,null,null,null,null,null,null,null,null,null,null,null,null,null,null,null,null,null,null,null,null,null,null,null,null,null,null,null,null,null,null,null,null,null,null,null,null,null,null,null,null,null,null,null,{"$f":"IF(U38=\"\",\"ok\",IF(D53<>U38,\"błąd\",\"ok\"))","v":"ok"},{"$f":"IF(U40=\"\",\"ok\",IF(I53<>U40,\"błąd\",\"ok\"))","v":"ok"}]
["ŁĄCZNIE",null,null,{"$f":"D53+I53","v":0},null,null,null,null,null,null,null,null,null,{"$f":"SUM(N47:T52)","v":0},null,null,null,null,null,null,{"$f":"SUM(U47:Z52)","v":0},null,null,null,null,null,null,null,null,null,null,null,null,null,null,null,null,null,null,null,null,null,null,null,null,null,null,null,null,null,null,null,null,null,null,null,{"$f":"IF(U36=\"\",\"ok\",IF(D54<>U36,\"błąd\",\"ok\"))","v":"ok"},{"$f":"IF(N54<>S33,\"błąd\",\"ok\")","v":"ok"},{"$f":"IF(U54<>K34,\"błąd\",\"ok\")","v":"ok"}]
["9.\n ","OPIS ZADANIA OBEJMUJĄCY STAN ISTNIEJĄCY ORAZ PROJEKTOWANY WRAZ Z UZASADNIENIEM REALIZACJI ZADANIA",null,null,null,null,null,null,null,null,null,null,null,null,null,null,null,null,null,null,null,null,null,null,null,null,null,null,null,null,{"$f":"_xlfn.CONCAT(A55,B55)","v":"9.\n OPIS ZADANIA OBEJMUJĄCY STAN ISTNIEJĄCY ORAZ PROJEKTOWANY WRAZ Z UZASADNIENIEM REALIZACJI ZADANIA"}]
["PARAMETRY ODCINKA",null,null,null,null,null,null,null,"STAN ISTNIEJĄCY \n(stan pierwotny, który będzie odtwarzany)",null,null,null,null,null,null,null,null,null,null,null,null,null,null,null,null,null,null,null,null,null,"Parametry odcinka dotyczą stanu istniejącego, czyli stanu odtwarzanego w wyniku remontu"]
[null,"kategoria drogi ",null,null,null,null,null,null,{"$f":"IF(B19=\"\",\"\",B19)","v":""},null,null,null,null,null,null,null,null,null,null,null,null,null,null,null,null,null,null,null,null,null,"Wpisz lub wybierz z list rozwijanych dane dotyczące kategorii drogi, numeru drogi, rodzaju drogi, rodzaju robót budowlanych, realizowanego kilometraża i długości odcinka"]
[null,"numer drogi "]
[null,"klasa drogi "]
[null,"rodzaj drogi "]
[null,"rodzaj robót budowlanych ",null,null,null,null,null,null,"REMONT"]
[null,"realizowany kilometraż "]
[null,"realizowana długość odcinka ",null,null,null,null,null,null,null,null,null,null,null,null,null,null,null,null,null,null,null,null,null,null,null,"m"]
[]
[null,"przekrój jezdni",null,null,null,null,null,null,null,null,null,null,null,null,null,null,null,null,null,null,null,null,null,null,null,null,null,null,null,null,"Wpisz dane dotyczące przekroju jezdni, szerokości jezdni i szerokości pasa ruchu."]
[null,"szerokość jezdni ",null,null,null,null,null,null,null,null,null,null,null,null,null,null,"m"]
[null,"szerokość pasa ruchu ",null,null,null,null,null,null,null,null,null,null,null,null,null,null,"m"]
[null,"zgoda na odstępstwo od przepisów",null,null,null,null,null,null,"NIE DOTYCZY"]
[]
[null,"pobocza",null,null,null,null,null,null,null,null,null,null,null,null,null,null,null,null,null,null,null,null,null,null,null,null,null,null,null,null,"Uzupełnij dane dotyczące poboczy przez wybranie z listy rozwijanej \"TAK/NIE\", czy odcinek posiada pobocza i czy będą one remontowane w ramach zadania.\nJeśli \"TAK\", to proszę wypełnić dane dotyczące długości i szerokości poboczy."]
[null,"o nawierzchni gruntowej \n(strona prawa)",null,null,null,null,null,null,"dł.",null,null,"m","szer.",null,null,null,"m"]
[null,"o nawierzchni gruntowej \n(strona lewa)",null,null,null,null,null,null,"dł.",null,null,"m","szer.",null,null,null,"m"]
[null,"o nawierzchni gruntowej",null,null,null,null,null,null,"dł.",{"$f":"IF(AND(J71=\"\",J72=\"\"),\"\",SUM(J71:K72))","v":""},null,"m"]
[null,"o nawierzchni twardej \n(strona prawa)",null,null,null,null,null,null,"dł.",null,null,"m","szer.",null,null,null,"m"]
[null,"o nawierzchni twardej \n(strona lewa)",null,null,null,null,null,null,"dł.",null,null,"m","szer.",null,null,null,"m"]
[null,"o nawierzchni twardej",null,null,null,null,null,null,"dł.",{"$f":"IF(AND(J74=\"\",J75=\"\"),\"\",SUM(J74:K75))","v":""},null,"m"]
[]
[null,"droga dla pieszych",null,null,null,null,null,null,null,null,null,null,null,null,null,null,null,null,null,null,null,null,null,null,null,null,null,null,null,null,"Uzupełnij dane dotyczące chodnika przez wybranie z listy rozwijanej \"TAK/NIE\", czy odcinek posiada chodnik i czy będzie on remontowany w ramach zadania.\nJeśli \"TAK\", to proszę wypełnić dane dotyczące długości i szerokości chodnika."]
[null,"droga dla pieszych\n(strona prawa)",null,null,null,null,null,null,"dł.",null,null,"m","szer.",null,null,null,"m"]
[null,"droga dla pieszych\n(strona lewa)",null,null,null,null,null,null,"dł.",null,null,"m","szer.",null,null,null,"m"]
[null,"łączna długość \ndrogi dla pieszych",null,null,null,null,null,null,"dł.",{"$f":"IF(AND(J79=\"\",J80=\"\"),\"\",SUM(J79:K80))","v":""},null,"m"]
[]
[null,"droga dla pieszych i rowerów",null,null,null,null,null,null,null,null,null,null,null,null,null,null,null,null,null,null,null,null,null,null,null,null,null,null,null,null,"Uzupełnij dane dotyczące drogi dla pieszych i rowerów przez wybranie z listy rozwijanej \"TAK/NIE\", czy odcinek posiada drogę dla pieszych i rowerów i czy będzie ona remontowana w ramach zadania.\nJeśli \"TAK\", to proszę wypełnić dane dotyczące długości i szerokości drogi dla pieszych i rowerów."]
[null,"droga dla pieszych i rowerów\n(strona prawa)",null,null,null,null,null,null,"dł.",null,null,"m","szer.",null,null,null,"m"]
[null,"droga dla pieszych i rowerów\n(strona lewa)",null,null,null,null,null,null,"dł.",null,null,"m","szer.",null,null,null,"m"]
[null,"łączna długość \ndrogi dla pieszych i rowerów",null,null,null,null,null,null,"dł.",{"$f":"IF(AND(J84=\"\",J85=\"\"),\"\",SUM(J84:K85))","v":""},null,"m"]
[]
[null,"droga dla rowerów",null,null,null,null,null,null,null,null,null,null,null,null,null,null,null,null,null,null,null,null,null,null,null,null,null,null,null,null,"Uzupełnij dane dotyczące drogi dla rowerów przez wybranie z listy rozwijanej \"TAK/NIE\", czy odcinek posiada drogę dla rowerów i czy będzie ona remontowana w ramach zadania.\nJeśli \"TAK\", to proszę wypełnić dane dotyczące długości i szerokości drogi dla rowerów."]
[null,"droga dla rowerów\n(strona prawa)",null,null,null,null,null,null,"dł.",null,null,"m","szer.",null,null,null,"m"]
[null,"droga dla pieszych\n(strona lewa)",null,null,null,null,null,null,"dł.",null,null,"m","szer.",null,null,null,"m"]
[null,"łączna długość \ndrogi dla rowerów",null,null,null,null,null,null,"dł.",{"$f":"IF(AND(J89=\"\",J90=\"\"),\"\",SUM(J89:K90))","v":""},null,"m"]
[]
[null,"stan istniejący",null,null,null,null,null,null,null,null,null,null,null,null,null,null,null,null,null,null,null,null,null,null,null,null,{"$f":"LEN(F93)","v":0},"z",800,null,"Opisz stan istniejący odcinka, czyli stan w jakim znajdują się elementy drogi"]
[null,"stan projektowany",null,null,null,null,null,null,null,null,null,null,null,null,null,null,null,null,null,null,null,null,null,null,null,null,{"$f":"LEN(F94)","v":0},"z",800,null,"Opisz stan jaki ma zostać osiągnięty w wyniku remontu."]
[null,"uzasadnienie",null,null,null,null,null,null,null,null,null,null,null,null,null,null,null,null,null,null,null,null,null,null,null,null,{"$f":"LEN(F95)","v":0},"z",800,null,"Uzasadnij realizację zadania"]
["10. ","CHARAKTERYSTYKA ZADANIA WEDŁUG KRYTERIÓW OCENY MERYTORYCZNEJ",null,null,null,null,null,null,null,null,null,null,null,null,null,null,null,null,null,null,null,null,null,null,null,null,null,null,null,null,{"$f":"_xlfn.CONCAT(A96,B96)","v":"10. CHARAKTERYSTYKA ZADANIA WEDŁUG KRYTERIÓW OCENY MERYTORYCZNEJ"}]
[null,"Kryterium nr 1",null,null,null,"-","Poprawa stanu bezpieczeństwa ruchu drogowego, ze szczególnym uwzględnieniem bezpieczeństwa ruchu drogowego niechronionych uczestników ruchu",null,null,null,null,null,null,null,null,null,null,null,null,null,null,null,null,null,null,null,null,null,null,null,{"$f":"_xlfn.CONCAT(A97,B97,\" \",F97,\" \",G97)","v":"Kryterium nr 1 - Poprawa stanu bezpieczeństwa ruchu drogowego, ze szczególnym uwzględnieniem bezpieczeństwa ruchu drogowego niechronionych uczestników ruchu"}]
["A. ","Ryzyko wypadków.\nOdcinek drogi przebiega przez gminę/powiat o dużym poziomie ryzyka społecznego pod względem:",null,null,null,null,null,null,null,null,null,null,null,null,null,null,null,null,null,null,null,null,null,null,null,null,null,null,null,null,"Dane ładują się automatycznie po poprawnym uzupełnieniu pkt 1 oraz 3 wniosku"]
[null,"1)","wypadków drogowych z udziałem pieszych ",null,null,null,null,null,null,null,null,null,null,null,null,null,null,null,null,null,null,null,null,null,{"$f":"IF($Q$10=\"\",\"\",IF($Q$10=\"powiat\",VLOOKUP($Q$11,DANE!$D$46:$K$58,6,0),VLOOKUP($Q$12,DANE!$E$59:$K$159,5,0)))","v":""}]
[null,"2)","wypadków drogowych ogółem",null,null,null,null,null,null,null,null,null,null,null,null,null,null,null,null,null,null,null,null,null,{"$f":"IF($Q$10=\"\",\"\",IF($Q$10=\"powiat\",VLOOKUP($Q$11,DANE!$D$46:$K$58,7,0),VLOOKUP($Q$12,DANE!$E$59:$K$159,6,0)))","v":""}]
[null,"3)","ofiar śmiertelnych w wypadkach drogowych",null,null,null,null,null,null,null,null,null,null,null,null,null,null,null,null,null,null,null,null,null,{"$f":"IF($Q$10=\"\",\"\",IF($Q$10=\"powiat\",VLOOKUP($Q$11,DANE!$D$46:$K$58,8,0),VLOOKUP($Q$12,DANE!$E$59:$K$159,7,0)))","v":""}]
["B. ","Bezpieczeństwo uczestników ruchu drogowego. \nRealizacja rozwiązań zwiększających bezpieczeństwo uczestników ruchu drogowego \n(poprzez remont):",null,null,null,null,null,null,null,null,null,null,null,null,null,null,null,null,null,null,null,null,null,null,null,null,null,null,null,null,"Wybierz z list rozwijanych \"TAK/NIE\", czy w ramach zadania będzie realizowany remont podanych (w pkt 1 lit. a-e oraz pkt 2 lit. a-d) rozwiązań zwiększających bezpieczeństwo uczestników ruchu drogowego"]
[null,"1)","przejścia dla pieszych lub/i przejazdu dla rowerów o podwyższonym standardzie bezpieczeństwa:"]
[null,null,"a)","z oświetleniem lub/i doświetleniem"]
[null,null,"b)","z wyspą dzielącą (tzw. azylem)"]
[null,null,"c)","wyniesionego przejścia dla pieszych lub/i przejazdu dla rowerów"]
[null,null,"d)","z sygnalizacją świetlną"]
[null,null,"e)","z oznakowaniem aktywnym lub sygnalizacją ostrzegawczą"]
[null,"2)","innego rozwiązania w zakresie bezpieczeństwa nie związanego z przejściem dla pieszych lub/i przejazdem dla rowerów:"]
[null,null,"a)","wyniesionego skrzyżowania"]
[null,null,"b)","wyspy dzielącej na jezdni wraz z odgięciem toru jazdy na wjeździe do miejscowości"]
[null,null,"c)","radaru ze znakiem/tablicą zmiennej treści (aktywną), informującym o prędkości ruchu pojazdu"]
[null,null,"d)","oznakowania aktywnego na dojeździe do przejazdu kolejowo-drogowego"]
[null,"Kryterium nr 2",null,null,null,"-","Zapewnienie spójności sieci dróg publicznych ",null,null,null,null,null,null,null,null,null,null,null,null,null,null,null,null,null,null,null,null,null,null,null,{"$f":"_xlfn.CONCAT(A114,B114,\" \",F114,\" \",G114)","v":"Kryterium nr 2 - Zapewnienie spójności sieci dróg publicznych "}]
["A.\n ","Połączenie z innymi drogami publicznymi. \nBezpośrednie połączenie odcinka drogi z inną drogą publiczną wyższego rzędu",null,null,null,null,null,null,null,null,null,null,null,null,null,null,null,null,null,null,null,null,null,null,null,null,null,null,null,null,"Wybierz z listy rozwijanej \"TAK/NIE\", czy odcinek drogi ma bezpośrednie połączenie z drogą wyższego rzędu.\nJeśli \"TAK\" podaj numer drogi wyższego rzędu stosując oznaczenia: DK – droga krajowa, DW – droga wojewódzka, DP – droga powiatowa, DG – droga gminna. Numer należy podać w formacie np. DP-1234T (można użyć do 100 wszystkich znaków). Zaznacz to połączenie na załączonej mapie poglądowej."]
[null,null,null,null,null,null,null,null,null,null,null,null,null,null,null,null,null,null,null,null,null,null,null,null,null,null,{"$f":"LEN(D116)","v":0},"z",100]
[null,"jeżeli wybrano odpowiedź TAK, należy wskazać to połączenie na załączonej mapie poglądowej"]
["B.\n ","Kontynuacja zadania. \nKontynuacja robót budowlanych* realizowanych na podstawie umowy dofinansowania w ramach RFRD oraz zakończonych w ciągu 3 lat przed datą złożenia wniosku o dofinansowanie"]
[null,"*kontynuacja robót budowlanych oznacza, że wcześniejsze roboty budowlane realizowane były na odcinku drogi bezpośrednio połączonym z odcinkiem drogi objętym wnioskowanym zadaniem ",null,null,null,null,null,null,null,null,null,null,null,null,null,null,null,null,null,null,null,null,null,null,null,null,null,null,null,null,"Wybierz z listy rozwijanej 'TAK/NIE\", czy odcinek stanowi kontynuację robót budowlanych (budowy, przebudowy lub remontu) w ramach wcześniej zawartych umów o dofinansowanie ze środków RFRD i zakończonych w ciągu 3 lat przed datą złożenia wniosku o dofinansowanie.\nJeśli \"TAK\" wpisz numer umowy z wojewodą i datę jej zawarcia (np. 175/RFRD/A/2023 z dnia 30.04.2023) (można użyć do 100 znaków) oraz zaznacz to połącznie na załączonej mapie poglądowej."]
[null,null,null,null,null,null,null,null,null,null,null,null,null,null,null,null,null,null,null,null,null,null,null,null,null,null,{"$f":"LEN(D120)","v":0},"z",100]
[null,"jeżeli wybrano odpowiedź TAK, należy wskazać to połączenie na załączonej mapie poglądowej"]
["C. \n","Peryferyjność. \nOdcinek drogi biegnie przez gminę, dla której wskaźnik peryferyjności czasowej jest mniejszy niż 30 min., mieści się w przedziale od 30 do 50 minut, jest większy niż 50 min.",null,null,null,null,null,null,null,null,null,null,null,null,null,null,null,null,null,null,null,null,null,null,null,null,null,null,null,null,"Dana ładuje się automatycznie, po poprawnym wypełnieniu pkt 3 wniosku"]
[null,"wskaźnik peryferyjności czasowej:",null,null,null,null,null,null,null,null,null,null,null,{"$f":"IF(L19=\"\",\"\",VLOOKUP(L19,DANE!E46:M159,9,0))","v":""}]
["D.\n ","Uszkodzenie w wyniku niekorzystnych zjawisk atmosferycznych. \nOdcinek drogi został uszkodzony w wyniku działania niekorzystnych zjawisk atmosferycznych w ciągu 3 lat przed datą złożenia wniosku o dofinansowanie i jest ujęty w protokole strat potwierdzonym przez Wojewodę Świętokrzyskiego"]
[null,null,null,"rodzaj i data zjawiska",null,null,null,null,null,null,null,null,null,null,null,null,null,null,null,null,null,null,null,null,null,null,{"$f":"LEN(L125)","v":0},"z",70,null,"Wybierz z listy rozwijanej \"TAK/NIE\", czy odcinek drogi został uszkodzony w wyniku działania niekorzystnych zjawisk atmosferycznych w ciągu 3 lat przed datą złożenia wniosku o dofinansowanie i jest ujęty w protokole strat potwierdzonym przez Wojewodę Świętokrzyskiego.\nJeśli \"TAK\", to wpisz rodzaj klęski i jej datę (można użyć do 70 wszystkich znaków) oraz numer i datę protokołu strat potwierdzonego przez Wojewodę Świętokrzyskiego (można  użyć do 70 wszystkich znaków) oraz załącz kopię protokołu strat potwierdzonego przez Wojewodę Świętokrzyskiego."]
[null,null,null,"protokół strat potwierdzony przez Wojewodę Świętokrzyskiego",null,null,null,null,null,null,null,null,null,null,null,null,null,null,null,null,null,null,null,null,null,null,{"$f":"LEN(L126)","v":0},"z",70]
[null,"jeżeli wybrano odpowiedź TAK, należy załączyć do wniosku kopię protokołu strat potwierdzonego przez Wojewodę"]
[null,"Kryterium nr 3\n",null,null,null,"-","Podnoszenie standardów technicznych dróg powiatowych i dróg gminnych, \nw szczególności dostosowanie ich do ruchu pojazdów o dopuszczalnym nacisku pojedynczej osi napędowej do 11,5 t, oraz zachowanie jednorodności sieci dróg powiatowych i dróg gminnych pod względem spełniania tych standardów ",null,null,null,null,null,null,null,null,null,null,null,null,null,null,null,null,null,null,null,null,null,null,null,{"$f":"_xlfn.CONCAT(A128,B128,\" \",F128,\" \",G128)","v":"Kryterium nr 3\n - Podnoszenie standardów technicznych dróg powiatowych i dróg gminnych, \nw szczególności dostosowanie ich do ruchu pojazdów o dopuszczalnym nacisku pojedynczej osi napędowej do 11,5 t, oraz zachowanie jednorodności sieci dróg powiatowych i dróg gminnych pod względem spełniania tych standardów "}]
["A. ","Rodzaj robót budowlanych",null,null,null,null,null,null,null,null,null,null,null,null,"REMONT",null,null,null,null,null,null,null,null,null,null,null,null,null,null,null,"REMONT - dana jest zablokowana",null,null,null,null,null,null,null,null,null,null,null,null,null,null,null,null,null,null,null,null,null,null,null,null,null,{"$f":"IF(O129=\"REMONT\",\"ok\",\"b\")","v":"ok"}]
["B. ","Skrzyżowania. \nRemont skrzyżowań:",null,null,null,null,null,null,null,null,null,null,null,null,null,null,null,null,null,null,null,null,null,null,null,null,null,null,null,null,"Wybierz z list rozwijanych „TAK/NIE”, czy w ramach zadania będzie realizowany remont podanych rodzajów skrzyżowań (lit. B pkt 1-2).\nJeśli \"TAK\" , to podaj ich ilości w sztukach oraz zaznacz te skrzyżowania na załączonej mapie poglądowej."]
[null,"1)","zwykłych z drogami publicznymi",null,null,null,null,null,null,null,null,null,null,null,null,null,null,null,null,null,null,null,null,null,null,"szt.",null,null,null,null,{"$f":"IF(BE131=\"b\",\"Błąd - wybrano NIE i podano ilość sztuk, lub wybrano TAK i nie podano ilości sztuk\",\"\")","v":""},null,null,null,null,null,null,null,null,null,null,null,null,null,null,null,null,null,null,null,null,null,null,null,null,null,{"$f":"IF(AND(V131=\"\",X131=\"\"),\"ok\",IF(AND(V131=\"tak\",X131>0),\"ok\",IF(AND(V131=\"nie\",X131=0),\"ok\",IF(AND(V131=\"nie\",X131>\"\"),\"ok\",\"b\"))))","v":"ok"}]
[null,"2)","innych:"]
[null,null,"•","skanalizowanych",null,null,null,null,null,null,null,null,null,null,null,null,null,null,null,null,null,null,null,null,null,"szt.",null,null,null,null,{"$f":"IF(BE133=\"b\",\"Błąd - wybrano NIE i podano ilość sztuk, lub wybrano TAK i nie podano ilości sztuk\",\"\")","v":""},null,null,null,null,null,null,null,null,null,null,null,null,null,null,null,null,null,null,null,null,null,null,null,null,null,{"$f":"IF(AND(V133=\"\",X133=\"\"),\"ok\",IF(AND(V133=\"tak\",X133>0),\"ok\",IF(AND(V133=\"nie\",X133=0),\"ok\",IF(AND(V133=\"nie\",X133>\"\"),\"ok\",\"b\"))))","v":"ok"}]
[null,null,"•","w formie ronda",null,null,null,null,null,null,null,null,null,null,null,null,null,null,null,null,null,null,null,null,null,"szt.",null,null,null,null,{"$f":"IF(BE134=\"b\",\"Błąd - wybrano NIE i podano ilość sztuk, lub wybrano TAK i nie podano ilości sztuk\",\"\")","v":""},null,null,null,null,null,null,null,null,null,null,null,null,null,null,null,null,null,null,null,null,null,null,null,null,null,"ok"]
[null,null,"•","innych podnoszących poziom bezpieczeństwa np. z sygnalizacją świetlną ",null,null,null,null,null,null,null,null,null,null,null,null,null,null,null,null,null,null,null,null,null,"szt.",null,null,null,null,{"$f":"IF(BE135=\"b\",\"Błąd - wybrano NIE i podano ilość sztuk, lub wybrano TAK i nie podano ilości sztuk\",\"\")","v":""},null,null,null,null,null,null,null,null,null,null,null,null,null,null,null,null,null,null,null,null,null,null,null,null,null,"ok"]
[null,"jeśli wybrano odpowiedź TAK, należy wskazać to skrzyżowanie na załączonej mapie poglądowej"]
["C. ","Drogowe obiekty inżynierskie. \nRemont drogowych obiektów inżynierskich:",null,null,null,null,null,null,null,null,null,null,null,null,null,null,null,null,null,null,null,null,null,null,null,null,null,null,null,null,"Wybierz z list rozwijanych „TAK/NIE”, czy w ramach zadania będzie realizowany remont podanych obiektów inżynierskich (lit. C pkt 1-3).\nJeśli \"TAK\" , to podaj ich ilości w sztukach oraz zaznacz te obiekty na załączonej mapie poglądowej."]
[null,"1)","•","mostów",null,null,null,null,null,null,null,null,null,null,null,null,null,null,null,null,null,null,null,null,null,"szt.",null,null,null,null,{"$f":"IF(BE138=\"b\",\"Błąd - wybrano NIE i podano ilość sztuk, lub wybrano TAK i nie podano ilości sztuk\",\"\")","v":""},null,null,null,null,null,null,null,null,null,null,null,null,null,null,null,null,null,null,null,null,null,null,null,null,null,{"$f":"IF(AND(V138=\"\",X138=\"\"),\"ok\",IF(AND(V138=\"tak\",X138>0),\"ok\",IF(AND(V138=\"nie\",X138=0),\"ok\",IF(AND(V138=\"nie\",X138>\"\"),\"ok\",\"b\"))))","v":"ok"}]
[null,null,"•","wiaduktów",null,null,null,null,null,null,null,null,null,null,null,null,null,null,null,null,null,null,null,null,null,"szt.",null,null,null,null,"",null,null,null,null,null,null,null,null,null,null,null,null,null,null,null,null,null,null,null,null,null,null,null,null,null,{"$f":"IF(AND(V139=\"\",X139=\"\"),\"ok\",IF(AND(V139=\"tak\",X139>0),\"ok\",IF(AND(V139=\"nie\",X139=0),\"ok\",IF(AND(V139=\"nie\",X139>\"\"),\"ok\",\"b\"))))","v":"ok"}]
[null,null,"•","estakad",null,null,null,null,null,null,null,null,null,null,null,null,null,null,null,null,null,null,null,null,null,"szt.",null,null,null,null,"",null,null,null,null,null,null,null,null,null,null,null,null,null,null,null,null,null,null,null,null,null,null,null,null,null,"ok"]
[null,null,"•","kładek dla pieszych",null,null,null,null,null,null,null,null,null,null,null,null,null,null,null,null,null,null,null,null,null,"szt.",null,null,null,null,"",null,null,null,null,null,null,null,null,null,null,null,null,null,null,null,null,null,null,null,null,null,null,null,null,null,"ok"]
[null,"2)","przepustów pod koroną drogi",null,null,null,null,null,null,null,null,null,null,null,null,null,null,null,null,null,null,null,null,null,null,"szt.",null,null,null,null,"",null,null,null,null,null,null,null,null,null,null,null,null,null,null,null,null,null,null,null,null,null,null,null,null,null,"ok"]
[null,"3)","konstrukcji oporowej",null,null,null,null,null,null,null,null,null,null,null,null,null,null,null,null,null,null,null,null,null,null,"szt.",null,null,null,null,"",null,null,null,null,null,null,null,null,null,null,null,null,null,null,null,null,null,null,null,null,null,null,null,null,null,"ok"]
[null,"jeśli wybrano odpowiedź TAK, należy wskazać ten obiekt na załączonej mapie poglądowej"]
["D.","Inne. \nRemont elementów w ramach wnioskowanego zadania:",null,null,null,null,null,null,null,null,null,null,null,null,null,null,null,null,null,null,null,null,null,null,null,null,null,null,null,null,"Wybierz z list rozwijanych „TAK/NIE”, czy w ramach zadania będzie realizowany remont podanych elementów (lit. D pkt 1-4)."]
[null,"1)","drogi dla pieszych lub rowerów "]
[null,"2)","drogi dla pieszych i rowerów (ciągu pieszo-rowerowego) "]
[null,"3)","oświetlenia ulicznego "]
[null,"4)","odwodnienia drogi (kanału deszczowego, rowu) "]
[null,"5)","przebudowy drogi wewnętrznej i zaliczenie jej do kategorii dróg ",null,null,null,null,null,null,null,null,null,null,null,null,null,null,null,null,null,null,null,null,null,"NIE",null,null,null,null,null,"NIE DOTYCZY REMONTU",null,null,null,null,null,null,null,null,null,null,null,null,null,null,null,null,null,null,null,null,null,null,null,null,null,{"$f":"IF(Y150=\"nie\",\"OK\",\"B\")","v":"OK"}]
[null,"6)","dostosowania drogi do ruchu pojazdów o dopuszczalnym nacisku pojedynczej osi napędowej do 11,5 t ",null,null,null,null,null,null,null,null,null,null,null,null,null,null,null,null,null,null,null,null,null,"NIE",null,null,null,null,null,"NIE DOTYCZY REMONTU",null,null,null,null,null,null,null,null,null,null,null,null,null,null,null,null,null,null,null,null,null,null,null,null,null,{"$f":"IF(Y151=\"nie\",\"OK\",\"B\")","v":"OK"}]
[null,"Kryterium nr 4",null,null,null,"-","Zwiększenie dostępności transportowej jednostek administracyjnych",null,null,null,null,null,null,null,null,null,null,null,null,null,null,null,null,null,null,null,null,null,null,null,{"$f":"_xlfn.CONCAT(A152,B152,\" \",F152,\" \",G152)","v":"Kryterium nr 4 - Zwiększenie dostępności transportowej jednostek administracyjnych"}]
["A.\n","Obszar wiejski. \nOdcinek drogi przebiega w całości lub w części na obszarze wiejskim (wykracza poza granice administracyjne miasta)",null,null,null,null,null,null,null,null,null,null,null,null,null,null,null,null,null,null,null,null,null,null,null,null,null,null,null,null,"Wybierz z listy rozwijanej \"TAK – odcinek przebiega W CAŁOŚCI na obszarze wiejskim/TAK – odcinek przebiega W CZĘŚCI na obszarze wiejskim/NIE – odcinek NIE PRZEBIEGA przez obszar wiejski\", czy odcinek drogi przebiega w całości lub w części na obszarze wiejskim (wykracza poza granice administracyjne miasta)"]
[]
["B.\n\n","Utrata funkcji społeczno-gospodarczych. \nOdcinek drogi przebiega w całości lub w części w granicach administracyjnych miast ujętych w pakiecie dla średnich miast uznanych za zagrożone utratą funkcji społeczno-gospodarczych (na podstawie Analizy Instytutu Geografii i Przestrzennego Zagospodarowania PAN)"]
[null,null,null,null,null,null,null,null,null,null,null,null,null,null,null,null,null,null,null,null,null,null,null,null,null,null,null,null,null,null,"Wybierz z listy rozwijanej „TAK - odcinek drogi PRZEBIEGA w granicach administracyjnych jednego z miast ujętych w Pakiecie dla średnich miast uznanych za zagrożone utratą funkcji społeczno-gospodarczych/NIE - odcinek drogi NIE PRZEBIEGA w granicach administracyjnych jednego z miast ujętych w Pakiecie dla średnich miast uznanych za zagrożone utratą funkcji społeczno-gospodarczych”, czy odcinek biegnie w całości lub w części w granicach administracyjnych jednego z miast ujętych w Pakiecie dla średnich miast uznanych za zagrożone utratą funkcji społeczno-gospodarczych. Jeśli \"TAK\", to wybierz z listy rozwijanej miasto, przez które przebiega odcinek."]
[null,{"$f":"IFERROR(IF(FIND(\"TAK\",B156)=1,\"miasto\",\"\"),\"\")","v":""}]
[null,"średnie miasta uznane za zagrożone utratą funkcji społeczno-gospodarczych w województwie świętokrzyskim – \nOstrowiec Świętokrzyski, Starachowice, Staszów, Jędrzejów, Końskie, Skarżysko-Kamienna, Sandomierz, Busko-Zdrój."]
["C.\n\n\n","Instytucje publiczne i miejsca zgromadzeń. \nOdcinek drogi zapewnia bezpośredni dojazd* do:\n"]
[null,"• \n\n• ","miejsc zgromadzeń ludności (np.: cmentarz, boisko, amfiteatr, obiekty zabytkowe, sakralne, turystyczne, itp.)\ninstytucji publicznych lub świadczących usługi publiczne (np.: urząd gminy, szkoła, ośrodek zdrowia, ośrodek pomocy społecznej, remiza OSP, świetlica wiejska, żłobek, przedszkole, klub seniora. itp.)"]
[null," *bezpośredni dojazd - położenie do 200 m od odcinka drogi"]
[null,null,null,null,null,null,null,null,null,null,null,null,null,null,null,null,null,null,null,null,null,null,null,null,null,null,{"$f":"LEN(D162)","v":0},"z",500,null,"Wybierz z listy rozwijanej \"TAK/NIE\", czy odcinek drogi zapewnia bezpośredni dojazd (do 200 m od odcinka) do miejsc zgromadzeń ludności, instytucji publicznych lub świadczących usługi publiczne.\nJeśli \"TAK\", to wymień do jakich miejsc zgromadzeń ludności, instytucji publicznych lub świadczących usługi publiczne odcinek zapewnia bezpośredni dojazd  (można użyć do 500 wszystkich znaków) oraz zaznacz te miejsca na załączonej mapie poglądowej mapie poglądowej."]
[null,"jeżeli wybrano odpowiedź TAK, należy wskazać te miejsca i instytucje na załączonej mapie poglądowej"]
["D.\n\n","Transport publiczny. \nNa odcinku drogi przebiega linia autobusowa objęta wsparciem z Funduszu Rozwoju Przewozów Autobusowych, realizowane są usługi transportu publicznego, uchwalono planowany przebieg linii użyteczności publicznej"]
[null,null,null,null,null,null,null,null,null,null,null,null,null,null,null,null,null,null,null,null,null,null,null,null,null,null,{"$f":"LEN(D165)","v":0},"z",300,null,"Wybierz z listy rozwijanej \"TAK/NIE\", czy na odcinku drogi przebiega linia autobusowa objęta wsparciem z Funduszu Rozwoju Przewozów Autobusowych, realizowane są usługi transportu publicznego, uchwalono planowany przebieg linii użyteczności publicznej.\nJeśli \"TAK\", to wpisz nr umowy z wojewodą i datę jej zawarcia oraz nr linii autobusowej lub usługi transportu publicznego lub numer i datę uchwały o planowanym przebiegu linii użyteczności publicznej (można użyć do 300 wszystkich znaków), zaznacz przebieg linii na załączonej mapie poglądowej oraz załącz do wniosku kopię odpowiedniego dokumentu."]
[null,"jeżeli wybrano odpowiedź TAK, należy załączyć do wniosku kopię odpowiedniego dokumentu oraz zaznaczyć przebieg linii na załączonej mapie poglądowej."]
["E.\n\n","Dostępność komunikacyjna. \nWpływ odcinka drogi na dostępność komunikacyjną obszaru, na którym znajduje się ta droga "]
[null,null,null,null,null,null,null,null,null,null,null,null,null,null,null,null,null,null,null,null,null,null,null,null,null,null,{"$f":"LEN(D168)","v":0},"z",500,null,"Wybierz z listy rozwijanej \"TAK/NIE\", czy odcinek drogi wpływa na dostępność komunikacyjną obszaru, na którym znajduje się ta droga.\nJeśli \"TAK\", to opisz wpływ odcinka drogi na dostępność komunikacyjną obszaru, na którym znajduje się ta droga (można użyć do 500 wszystkich znaków)."]
[null,"Kryterium nr 5",null,null,null,"-","Poprawa dostępności terenów inwestycyjnych i gospodarczych",null,null,null,null,null,null,null,null,null,null,null,null,null,null,null,null,null,null,null,null,null,null,null,{"$f":"_xlfn.CONCAT(A169,B169,\" \",F169,\" \",G169)","v":"Kryterium nr 5 - Poprawa dostępności terenów inwestycyjnych i gospodarczych"}]
["A.\n\n","Lokalne ośrodki gospodarcze. \nOdcinek drogi zapewnia bezpośredni dojazd* do lokalnych ośrodków gospodarczych np. do strefy ekonomicznej, podmiotów gospodarczych, lokalnego targowisk \n*bezpośredni dojazd - położenie do 200 m od odcinka drogi"]
[null,null,null,null,null,null,null,null,null,null,null,null,null,null,null,null,null,null,null,null,null,null,null,null,null,null,{"$f":"LEN(D171)","v":0},"z",400,null,"Wybierz z listy rozwijanej \"TAK/NIE\", czy odcinek drogi zapewnia bezpośredni dojazd (do 200 m od odcinka) do lokalnych ośrodków gospodarczych np. do strefy ekonomicznej, podmiotów gospodarczych, lokalnego targowiska.\nJeśli \"TAK\", to wymień do jakich lokalnych ośrodków gospodarczych odcinek stanowi bezpośredni dojazd (można użyć do 400 wszystkich znaków) oraz zaznacz te ośrodki na załączonej mapie poglądowej."]
[null,"jeżeli wybrano odpowiedź TAK, należy wskazać te ośrodki gospodarcze na załączonej mapie poglądowej"]
["B.\n\n\n","Tereny inwestycyjne. \nOdcinek drogi zapewnia bezpośredni dojazd* do terenów inwestycyjnych, rozumianych jako tereny przeznaczone pod działalność gospodarczą w studium uwarunkowań przestrzennych, miejscowym planie zagospodarowania, warunkach zabudowy lub decyzji lokalizacyjnej celu publicznego \n*bezpośredni dojazd - położenie do 200 m od odcinka drogi"]
[null,null,null,null,null,null,null,null,null,null,null,null,null,null,null,null,null,null,null,null,null,null,null,null,null,null,{"$f":"LEN(D174)","v":0},"z",400,null,"Wybierz z listy rozwijanej \"TAK/NIE\", czy odcinek drogi zapewnia bezpośredni dojazd (do 200 m od odcinka) do terenów inwestycyjnych, rozumianych jako tereny przeznaczone pod działalność gospodarczą w studium uwarunkowań przestrzennych, miejscowym planie zagospodarowania, warunkach zabudowy lub decyzji lokalizacyjnej celu publicznego.\nJeśli \"TAK\", to wymień do jakich terenów inwestycyjnych odcinek stanowi bezpośredni dojazd (można użyć do 400 wszystkich znaków) oraz zaznacz te tereny na załączonej mapie poglądowej."]
[null,"jeżeli wybrano odpowiedź TAK, należy wskazać te tereny inwestycyjne na załączonej mapie poglądowej"]
["C.\n\n\n","Tereny rolne. \nOdcinek drogi zapewnia bezpośredni dojazd do terenów, na których prowadzona jest produkcja rolna, sadownictwo, ogrodnictwo lub/i zlokalizowane są gospodarstwa agroturystyczne ważne ze względu na specyfikę obszaru \n*bezpośredni dojazd - położenie do 200 m od odcinka drogi"]
[null,null,null,null,null,null,null,null,null,null,null,null,null,null,null,null,null,null,null,null,null,null,null,null,null,null,{"$f":"LEN(D177)","v":0},"z",400,null,"Wybierz z listy rozwijanej \"TAK/NIE\", czy odcinek drogi zapewnia bezpośredni dojazd (do 200 m od odcinka) do terenów, na których prowadzona jest produkcja rolna, sadownictwo, ogrodnictwo lub/i zlokalizowane są gospodarstwa agroturystyczne ważne ze względu na specyfikę obszaru.\nJeśli \"TAK\", to wymień do jakich terenów rolnych odcinek stanowi bezpośredni dojazd (można użyć do 400 wszystkich znaków) oraz zaznacz te tereny na załączonej mapie poglądowej."]
[null,"jeżeli wybrano odpowiedź TAK, należy wskazać te tereny rolne na załączonej mapie poglądowej"]
["D.\n","Rozwój społeczno-gospodarczy. \nStrategiczne znaczenia odcinka drogi dla rozwoju społeczno-gospodarczego województwa"]
[null,null,null,null,null,null,null,null,null,null,null,null,null,null,null,null,null,null,null,null,null,null,null,null,null,null,{"$f":"LEN(D180)","v":0},"z",500,null,"Wybierz z listy rozwijanej \"TAK/NIE\", czy odcinek drogi ma strategiczne znaczenie dla rozwoju społeczno-gospodarczego województwa.\nJeśli \"TAK\", to opisz przewidywane znaczenie wnioskowanego odcinka drogi dla rozwoju społeczno-gospodarczego województwa (można użyć do 500 wszystkich znaków)."]
[null,"Kryterium nr 6",null,null,null,"-","Zwiększenie liczby obwodnic w ciągu dróg powiatowych i dróg gminnych",null,null,null,null,null,null,null,null,null,null,null,null,null,null,null,null,null,null,null,null,null,null,null,{"$f":"_xlfn.CONCAT(A181,B181,\" \",F181,\" \",G181)","v":"Kryterium nr 6 - Zwiększenie liczby obwodnic w ciągu dróg powiatowych i dróg gminnych"}]
[null,"Zwiększenie liczby obwodnic. \nOdcinek drogi przyczynia się do zwiększenia liczby dróg spełniających funkcję obwodnicy, która w rozumieniu art. 2 ust.1 pkt 2a ustawy o RFRD oznacza drogę omijającą miejscowość lub teren zwartej zabudowy miejscowości, planowaną do realizacji w większości w nowym przebiegu i mającą na celu wyprowadzenie części ruchu pojazdów z tej miejscowości"]
[null,"N/D",null,"NIE DOTYCZY",null,null,null,null,null,null,null,null,null,null,null,null,null,null,null,null,null,null,null,null,null,null,null,null,null,null,"NIE DOTYCZY REMONTU"]
[null,"Kryterium nr 7",null,null,null,"-","Poprawa dostępności terenów objętych przedsięwzięciami lub inwestycjami powiązanymi z przedsięwzięciem infrastrukturalnym",null,null,null,null,null,null,null,null,null,null,null,null,null,null,null,null,null,null,null,null,null,null,null,{"$f":"_xlfn.CONCAT(A184,B184,\" \",F184,\" \",G184)","v":"Kryterium nr 7 - Poprawa dostępności terenów objętych przedsięwzięciami lub inwestycjami powiązanymi z przedsięwzięciem infrastrukturalnym"}]
[null,"Tereny powiązane z przedsięwzięciem infrastrukturalnym. \nOdcinek drogi przyczynia się do poprawy dostępności terenów objętych przedsięwzięciami lub inwestycjami powiązanymi z przedsięwzięciem infrastrukturalnym, o których mowa w art. 5c ust. 1 ustawy z dnia 8 grudnia 2006 r. o finansowym wsparciu niektórych przedsięwzięć mieszkaniowych (Dz. U. z 2023 r. poz. 788 i 1463)"]
[null,null,null,null,null,null,null,null,null,null,null,null,null,null,null,null,null,null,null,null,null,null,null,null,null,null,{"$f":"LEN(D186)","v":0},"z",500,null,"Wybierz z listy rozwijanej \"TAK/NIE\", czy odcinek drogi przyczynia się do poprawy dostępności terenów objętych przedsięwzięciami lub inwestycjami powiązanymi z przedsięwzięciem infrastrukturalnym.\nJeśli \"TAK\" wymień te tereny i krótko opisz (można użyć do 500 wszystkich znaków)."]
[null,"jeżeli wybrano odpowiedź TAK, należy wskazać te tereny na załączonej mapie poglądowej"]
["11. ","OSOBY UPOWAŻNIONE DO UDZIELANIA WYJAŚNIEŃ KOMISJI",null,null,null,null,null,null,null,null,null,null,null,null,null,null,null,null,null,null,null,null,null,null,null,null,null,null,null,null,{"$f":"_xlfn.CONCAT(A188,B188)","v":"11. OSOBY UPOWAŻNIONE DO UDZIELANIA WYJAŚNIEŃ KOMISJI"}]
["Lp.","imię i nazwisko",null,null,null,null,null,null,"stanowisko służbowe",null,null,null,null,null,"nr telefonu",null,null,null,null,"e-mail",null,null,null,null,null,null,null,null,null,null,"Wskaż osobę/osoby do kontaktu przez podanie następujących danych:\n - imię i nazwisko, \n - zajmowane stanowisko służbowe, \n - nr telefonu (ze wskazaniem nr wewnętrznego - jeśli dotyczy), \n - adres e-mail."]
[1]
[2]
["12. ","ZŁĄCZNIKI",null,null,null,null,null,null,null,null,null,null,null,null,null,null,null,null,null,null,null,null,null,null,null,null,null,null,null,null,{"$f":"_xlfn.CONCAT(A192,B192)","v":"12. ZŁĄCZNIKI"}]
["1)","Do wniosku dołączone zostały załączniki:   ",null,null,null,null,null,null,null,null,null,null,null,null,null,null,null,null,null,null,null,null,null,null,null,null,null,null,null,null,"Wybierz z list rozwijanych, które z wymienionych załączników zostały dołączone do wniosku."]
[null,"a)","kopia prawomocnej decyzji o pozwoleniu na budowę - dotyczy robót realizowanych na podstawie pozwolenia na budowę (nie dotyczy),\n",null,null,null,null,null,null,null,null,null,null,null,null,null,null,null,null,null,null,null,null,"NIE DOTYCZY",null,null,null,null,null,null,"NIE DOTYCZY REMONTU"]
[null,null,"nr / znak dokumentu"]
[null,null,"data dokumentu"]
[null,null,"lub"]
[null,null,"kopia prawomocnej decyzji o zezwoleniu na realizację inwestycji drogowej - dotyczy robót realizowanych na podstawie ZRID (nie dotyczy), ",null,null,null,null,null,null,null,null,null,null,null,null,null,null,null,null,null,null,null,null,"NIE DOTYCZY",null,null,null,null,null,null,"NIE DOTYCZY REMONTU"]
[null,null,"nr / znak dokumentu"]
[null,null,"data dokumentu"]
[null,null,"lub"]
[null,null,"kopia zgłoszenia robót budowlanych z poświadczeniem o braku podstaw do wniesienia sprzeciwu na zgłoszenie wykonania robót budowlanych potwierdzonym:\n      - zaświadczeniem organu administracji architektoniczno-budowlanej \n        lub \n      - pieczęcią organu administracji architektoniczno-budowlanej \ndotyczy robót realizowanych na podstawie zgłoszenia (obligatoryjnie),",null,null,null,null,null,null,null,null,null,null,null,null,null,null,null,null,null,null,null,null,null,null,null,null,null,null,null,"Wybierz z listy rozwijanej \"TAK/NIE\", czy załączono kopię zgłoszenia robót budowlanych z poświadczeniem o braku podstaw do wniesienia sprzeciwu na zgłoszenie wykonania robót budowlanych.\nJeśli \"TAK\", to wpisz nr/znak dokumentu i jego datę (jeśli załączony dokument posiada te dane).\nZałącznik jest OBLIGATORYJNY."]
[null,null,"nr / znak dokumentu"]
[null,null,"data dokumentu"]
[null,"b)","zgodna ze stanem faktycznym, czytelna mapa poglądowa zawierająca: \n   - naniesioną skalę, \n   - zaznaczone miejsce/odcinek realizacji wnioskowanego zadania, \n   - obszar obrazujący odległość 200 m od odcinka drogi objętego zadaniem, \n   - zaznaczone elementy mające wpływ na ocenę merytoryczną wniosku - \n     dotyczy kryterium: nr 2 lit. A, B; nr 3 lit. B, C; nr 4 lit. C, D; nr 5 lit. A, B, C \n(obligatoryjnie),",null,null,null,null,null,null,null,null,null,null,null,null,null,null,null,null,null,null,null,null,null,null,null,null,null,null,null,"Wybierz z listy rozwijanej \"TAK/NIE\", czy załączono mapę poglądową.\nZałącznik jest OBLIGATORYJNY."]
[null,"c)","kopia strony projektu stałej organizacji ruchu, z której wynika, że projekt jest zatwierdzony (obligatoryjnie)\n",null,null,null,null,null,null,null,null,null,null,null,null,null,null,null,null,null,null,null,null,null,null,null,null,null,null,null,"Wybierz z listy rozwijanej \"TAK/NIE\", czy załączono kopię strony projektu stałej organizacji ruchu, z której wynika, że projekt jest zatwierdzony lub pismo organu uprawnionego do zatwierdzenia organizacji ruchu.\nJeśli \"TAK\", to wpisz nr/znak dokumentu i jego datę (jeśli załączony dokument posiada te dane).\nZałącznik jest OBLIGATORYJNY."]
[null,null,"nr / znak dokumentu"]
[null,null,"data dokumentu"]
[null,null,"lub"]
[null,null,"pismo organu uprawnionego do zatwierdzenia organizacji ruchu (obligatoryjnie)"]
[null,null,"nr / znak dokumentu"]
[null,null,"data dokumentu"]
[null,"d)","rysunki  z charakterystycznymi przekrojami poprzecznymi pasa drogowego w liniach rozgraniczających z wykazaniem wszystkich elementów drogi - przekroje normalne i przekroje konstrukcyjne lub normalno-konstrukcyjne (nie dotyczy)",null,null,null,null,null,null,null,null,null,null,null,null,null,null,null,null,null,null,null,null,"NIE DOTYCZY",null,null,null,null,null,null,"NIE DOTYCZY REMONTU"]
[null,"e)","kopia kosztorysu inwestorskiego (obligatoryjnie)",null,null,null,null,null,null,null,null,null,null,null,null,null,null,null,null,null,null,null,null,null,null,null,null,null,null,null,"Wybierz z listy rozwijanej \"TAK/NIE\", czy załączono kopię kosztorysu inwestorskiego ( aktualnego kosztorysu, czyli sporządzonego nie wcześniej niż 6 miesięcy przed złożeniem wniosku)\nJeśli \"TAK\", to wpisz nr/znak dokumentu i jego datę (jeśli załączony dokument posiada te dane).\nZałącznik jest OBLIGATORYJNY."]
[null,null,"nr / znak dokumentu"]
[null,null,"data dokumentu"]
[null,"f)","kopia zgody na odstępstwo od przepisów techniczno-budowlanych (nie dotyczy),",null,null,null,null,null,null,null,null,null,null,null,null,null,null,null,null,null,null,null,null,"NIE DOTYCZY",null,null,null,null,null,null,"NIE DOTYCZY REMONTU"]
[null,null,"nr / znak dokumentu"]
[null,null,"data dokumentu"]
[null,"g)","kopia protokołu strat potwierdzonego przez Wojewodę Świętokrzyskiego - dotyczy kryterium nr 2 lit. D (jeśli dotyczy),",null,null,null,null,null,null,null,null,null,null,null,null,null,null,null,null,null,null,null,null,null,null,null,null,null,null,null,"Wybierz z listy rozwijanej \"TAK/NIE\", czy załączono kopię protokołu strat potwierdzonego przez Wojewodę Świętokrzyskiego - jeśli dotyczy"]
[null,"h)","dokument potwierdzający przebieg linii autobusowej objętej wsparciem  z FRPA, linii użyteczności publicznej lub realizowanie usług transportu publicznego - dotyczy kryterium nr 4 lit. D (jeśli dotyczy),",null,null,null,null,null,null,null,null,null,null,null,null,null,null,null,null,null,null,null,null,null,null,null,null,null,null,null,"Wybierz z listy rozwijanej \"TAK/NIE\", czy załączono dokument potwierdzający przebieg linii autobusowej objętej wsparciem  z FRPA, linii użyteczności publicznej lub realizowanie usług transportu publicznego - jeśli dotyczy"]
[null,"i)","kopia uchwały o zaliczeniu drogi do odpowiedniej kategorii dróg publicznych (jeśli dotyczy)",null,null,null,null,null,null,null,null,null,null,null,null,null,null,null,null,null,null,null,null,null,null,null,null,null,null,null,"Wybierz z listy rozwijanej \"TAK/NIE\", czy załączono uchwałę o zaliczeniu drogi do odpowiedniej kategorii dróg publicznych - dotyczy dróg publicznych.\nJeśli \"TAK\", to wpisz dane uchwały (np. uchwała nr XXIX/2020 Rady Gminy XYZ z dnia 10.10.2020)"]
[null,null,"Uchwała",null,null,null,null,null,null,null,null,null,null,null,null,null,null,null,null,null,null,null,null,null,null,null,{"$f":"LEN(F223)","v":0},"z",200]
[null,"j)","dodatkowe załączniki (jeśli dotyczy),"]
[null,null,null,null,null,null,null,null,null,null,null,null,null,null,null,null,null,null,null,null,null,null,null,null,null,null,{"$f":"LEN(C225)","v":0},"z",500,null,"Wybierz z listy rozwijanej \"TAK/NIE\", czy załączono dodatkowe załączniki.\nJeśli \"TAK\", to wpisz jakie dodatkowe załączniki dołączono do wniosku."]
["13. ","OŚWIADCZENIA WNIOSKODAWCY (ustawowego zarządcy drogi)",null,null,null,null,null,null,null,null,null,null,null,null,null,null,null,null,null,null,null,null,null,null,null,null,null,null,null,null,{"$f":"_xlfn.CONCAT(A226,B226)","v":"13. OŚWIADCZENIA WNIOSKODAWCY (ustawowego zarządcy drogi)"}]
["Wnioskodawca oświadcza, że: "]
["1)","do wniosku dołączone zostały załączniki wskazane w pkt 12 wniosku;"]
["2)","dane i informacje zawarte we wniosku są prawidłowe i kompletne;"]
["3)","na dzień złożenia wniosku, zadanie obejmuje inwestycję wyłącznie na drodze dla której wnioskodawca pełni rolę ustawowego zarządcy;"]
["4)","na dzień złożenia wniosku, zadanie obejmuje inwestycję wyłącznie na drodze, która:",null,null,null,null,null,null,null,null,null,null,null,null,null,null,null,null,null,null,null,null,null,null,null,null,null,null,null,null,"Wybierz z listy rozwijanej, czy droga została zaliczona do odpowiedniej kategorii dróg publicznych"]
[null,"•","została zaliczona do kategorii dróg publicznych",null,null,null,null,null,null,null,null,null,null,null,null,null,null,null,null,null,null,null,null,null,null,null,null,null,null,null,{"$f":"IF(W232=\"\",\"Wybierz z listy rozwijanej, czy droga została zaliczona do odpowiedniej kategorii dróg\",IF(W232=\"nie\",\"Wnioskodawca oświadczył, że droga nie jest zaliczona do odpowiedniej kategorii dróg - NIE MOŻNA JEJ REMONTOWAĆ\",IF(W232=\"nie dotyczy\",\"Wnioskodawca oświadczył, że droga nie jest zaliczona do odpowiedniej kategorii dróg - NIE MOŻNA JEJ REMONTOWAĆ\",IF(W232=\"tak\",\"Wnioskodawca oświadczył, że droga jest zaliczona do odpowiedniej kategorii dróg\",IF(AND(#REF!<>\"\",W232=\"\"),\"Błąd danej - wprowadzono daną spoza listy rozwijanej\")))))","v":"Wybierz z listy rozwijanej, czy droga została zaliczona do odpowiedniej kategorii dróg"},null,null,null,null,null,null,null,null,null,null,null,null,null,null,null,null,null,null,null,{"$f":"IF(AND(W233=\"nie dotyczy\",W232=\"\"),\"W\",IF(AND(W233=\"nie dotyczy\",W232=\"nie dotyczy\"),\"B\",IF(AND(W233=\"nie dotyczy\",W232=\"NIE\"),\"B\",\"OK\")))","v":"W"}]
[null,"•","zostanie zaliczona do kategorii dróg publicznych*",null,null,null,null,null,null,null,null,null,null,null,null,null,null,null,null,null,null,null,"NIE DOTYCZY",null,null,null,null,null,null,null,"NIE DOTYCZY REMONTU"]
[null,null,"* uchwałą właściwego organu jst w sprawie zaliczenia drogi/dróg do odpowiedniej kategorii w terminie \n12 miesięcy od dnia zatwierdzenia rozliczenia; "]
["5)","zapewnione zostanie zabezpieczenie całości zadeklarowanego we wniosku wkładu własnego;"]
["6)","dopełnił lub dopełni wszelkich wymogów wynikających z przepisów prawa uprawniających do realizacji zadania;"]
["7)","przeprowadzi postępowanie o zamówienie publiczne zgodnie z obowiązującymi przepisami Prawa zamówień publicznych (t.j. Dz. U. z 2023 r. poz. 1605 ze zm.)."]
["OŚWIADCZENIE O REALIZACJI ZADANIA W PASIE DROGOWYM (obligatoryjnie)",null,null,null,null,null,null,null,null,null,null,null,null,null,null,null,null,null,null,null,null,null,null,null,null,null,null,null,null,null,{"$f":"A238","v":"OŚWIADCZENIE O REALIZACJI ZADANIA W PASIE DROGOWYM (obligatoryjnie)"}]
[null,"Wnioskodawca oświadcza, że planowane do realizacji elementy drogi mieszczą się w granicach pasa drogowego (nie zaplanowano ich na działkach stanowiących własność prywatną bądź na działkach niestanowiących pasa drogowego)",null,null,null,null,null,null,null,null,null,null,null,null,null,null,null,null,null,null,null,null,null,null,null,null,null,null,null,null,{"$f":"IF(X238=\"\",\"Wybierz z listy rozwijanej czy wnioskodawca oświadcza, że zadnie realizowane jest w pasie drogowym.\nRealizacja zadania w pasie drogowym jest OBLIGATORYJNA.\",IF(X238=\"tak\",\"OK - wnioskodawca oświadcza, że zadnie realizowane jest w pasie drogowym.\",IF(X238=\"nie\",\"Oświadczenie jest OBLIGATORYJNE\",\"Błąd danej - wprowadzono daną spoza listy rozwijanej\")))","v":"Wybierz z listy rozwijanej czy wnioskodawca oświadcza, że zadnie realizowane jest w pasie drogowym.\nRealizacja zadania w pasie drogowym jest OBLIGATORYJNA."},null,null,null,null,null,null,null,null,null,null,null,null,null,null,null,null,null,null,null,{"$f":"IF(X238=\"\",\"W\",IF(X238=\"tak\",\"OK\",\"B\"))","v":"W"}]
["OŚWIADCZENIE O PRZEKAZANIU DANYCH O SIECI DRÓG PUBLICZNYCH (obligatoryjnie)",null,null,null,null,null,null,null,null,null,null,null,null,null,null,null,null,null,null,null,null,null,null,null,null,null,null,null,null,null,{"$f":"A240","v":"OŚWIADCZENIE O PRZEKAZANIU DANYCH O SIECI DRÓG PUBLICZNYCH (obligatoryjnie)"}]
[null,"Wnioskodawca oświadcza, że zgodnie z zapisami § 2 rozporządzenia Ministra Infrastruktury z dnia 16 lutego 2005 r. w sprawie trybu sporządzania informacji oraz gromadzenia i udostępniania danych o sieci dróg publicznych, obiektach mostowych, tunelach oraz promach (Dz.U. 2005 nr 67 poz. 583) sporządzono oraz przekazano do Generalnego Dyrektora Dróg Krajowych i Autostrad informacje dla celów statystycznych o sieci dróg publicznych według stanu na dzień 31 grudnia 2023 r. ",null,null,null,null,null,null,null,null,null,null,null,null,null,null,null,null,null,null,null,null,null,null,null,null,null,null,null,null,{"$f":"IF(X240=\"\",\"Wybierz z listy rozwijanej czy wnioskodawca oświadcza, że sporządził i przekazał do Generalnego Dyrektora Dróg Krajowych i Autostrad informacje do celów statystycznych o sieci dróg publicznych.\nOświadczenie jest OBLIGATORYJNE.\",IF(X240=\"tak\",\"OK - wnioskodawca oświadcza, że sporządził i przekazał do Generalnego Dyrektora Dróg Krajowych i Autostrad informacje do celów statystycznych o sieci dróg publicznych.\",IF(X240=\"nie\",\"Oświadczenie jest OBLIGATORYJNE\",\"Błąd danej - wprowadzono daną spoza listy rozwijanej\")))","v":"Wybierz z listy rozwijanej czy wnioskodawca oświadcza, że sporządził i przekazał do Generalnego Dyrektora Dróg Krajowych i Autostrad informacje do celów statystycznych o sieci dróg publicznych.\nOświadczenie jest OBLIGATORYJNE."},null,null,null,null,null,null,null,null,null,null,null,null,null,null,null,null,null,null,null,{"$f":"IF(X240=\"\",\"W\",IF(X240=\"tak\",\"OK\",\"B\"))","v":"W"}]
["OŚWIADCZENIE O POSIADANIU TYTUŁU PRAWNEGO DO NIERUCHOMOŚCI (obligatoryjnie)",null,null,null,null,null,null,null,null,null,null,null,null,null,null,null,null,null,null,null,null,null,null,null,null,null,null,null,null,null,{"$f":"A242","v":"OŚWIADCZENIE O POSIADANIU TYTUŁU PRAWNEGO DO NIERUCHOMOŚCI (obligatoryjnie)"}]
[null,"Wnioskodawca oświadcza, że posiada tytuł prawny do nieruchomości wskazanych w oświadczeniu o dysponowaniu nieruchomością na cele budowlane zgodnie z art. 3 Prawa budowlanego, tj. tytuł prawny wynikający z prawa własności, użytkowania wieczystego, zarządu, ograniczonego prawa rzeczowego albo stosunku zobowiązaniowego, przewidującego uprawnienia do wykonywania robót budowlanych, ponadto tytuł ten nie wynika z posiadania samoistnego/władania lub z mocy prawa na podst. art. 73 ustawy z dnia 13 października 1998 r. Przepisy wprowadzające ustawy reformujące administrację publiczną (dotyczy sytuacji gdy jst nie posiada decyzji potwierdzającej ten fakt).",null,null,null,null,null,null,null,null,null,null,null,null,null,null,null,null,null,null,null,null,null,null,null,null,null,null,null,null,{"$f":"IF(X242=\"\",\"Wybierz z listy rozwijanej czy wnioskodawca oświadcza, że posiada tytuł prawny do nieruchomości.\nPosiadanie tytułu prawnego do nieruchomości jest OBLIGATORYJNE.\",IF(X242=\"tak\",\"OK - wnioskodawca oświadcza, że posiada tytuł prawny do nieruchomości.\",IF(X242=\"nie\",\"Oświadczenie jest OBLIGATORYJNE\",\"Błąd danej - wprowadzono daną spoza listy rozwijanej\")))","v":"Wybierz z listy rozwijanej czy wnioskodawca oświadcza, że posiada tytuł prawny do nieruchomości.\nPosiadanie tytułu prawnego do nieruchomości jest OBLIGATORYJNE."},null,null,null,null,null,null,null,null,null,null,null,null,null,null,null,null,null,null,null,{"$f":"IF(X242=\"\",\"W\",IF(X242=\"tak\",\"OK\",\"B\"))","v":"W"}]
["OŚWIADCZENIE O ZGODNOŚCI Z PRZEPISAMI PRAWA (obligatoryjnie)",null,null,null,null,null,null,null,null,null,null,null,null,null,null,null,null,null,null,null,null,null,null,null,null,null,null,null,null,null,{"$f":"A244","v":"OŚWIADCZENIE O ZGODNOŚCI Z PRZEPISAMI PRAWA (obligatoryjnie)"}]
[null,"Wnioskodawca oświadcza, że realizacja zgłoszonego zadania odbędzie się z zachowaniem przepisów prawa budowlanego, w tym warunków techniczno-budowlanych dotyczących dróg, w szczególności z:",null,null,null,null,null,null,null,null,null,null,null,null,null,null,null,null,null,null,null,null,null,null,null,null,null,null,null,null,{"$f":"IF(X244=\"\",\"Wybierz z listy rozwijanej czy wnioskodawca oświadcza, że realizując zgłoszone we wniosku zadanie zostaną zachowane przepisy prawa budowlanego, w tym warunków techniczno-budowlanych dotyczących dróg.\"&\"\nPrzestrzeganie przepisów prawa budowlanego, w tym warunków-techniczno-budowlanych jest OBLIGATORYJNE.\",IF(X244=\"tak\",\"OK - wnioskodawca oświadcza, że realizując zgłoszone we wniosku zadanie zostaną zachowane przepisy prawa budowlanego, w tym warunków techniczno-budowlanych dotyczących dróg.\",IF(X244=\"nie\",\"Oświadczenie jest OBLIGATORYJNE.\",\"Błąd danej - wprowadzono daną spoza listy rozwijanej\")))","v":"Wybierz z listy rozwijanej czy wnioskodawca oświadcza, że realizując zgłoszone we wniosku zadanie zostaną zachowane przepisy prawa budowlanego, w tym warunków techniczno-budowlanych dotyczących dróg.\nPrzestrzeganie przepisów prawa budowlanego, w tym warunków-techniczno-budowlanych jest OBLIGATORYJNE."},null,null,null,null,null,null,null,null,null,null,null,null,null,null,null,null,null,null,null,{"$f":"IF(X244=\"\",\"W\",IF(X244=\"tak\",\"OK\",\"B\"))","v":"W"}]
[null,"•  ","ustawą z dnia 7 lipca 1994 r. prawo budowlane (t.j. Dz. U. z 2024 r. poz. 725.);"]
[null,"•  ","rozporządzeniem Ministra Infrastruktury z dnia 24 czerwca 2022 r. w sprawie przepisów techniczno-budowlanych dotyczących dróg publicznych (t.j. Dz. U. z 2022 r. poz. 1518);\nlub\nrozporządzeniem Ministra Transportu i Gospodarki Morskiej z dnia 2 marca 1999 r. w sprawie warunków technicznych, jakim powinny odpowiadać drogi publiczne i ich usytuowanie (t.j. Dz. U. z 2016 r. poz. 124 ze zm.) - w przypadku, gdy zgłoszenie/pozwolenie jest sprzed 2022 roku\n"]
[null,"•  ","ustawą z dnia 21 marca 1985 r. o drogach publicznych (t.j. Dz. U. z 2024 r. poz. 320.)."]
["OŚWIADCZENIE O DZIAŁANIACH INFORMACYJNYCH (obligatoryjnie)",null,null,null,null,null,null,null,null,null,null,null,null,null,null,null,null,null,null,null,null,null,null,null,null,null,null,null,null,null,{"$f":"A249","v":"OŚWIADCZENIE O DZIAŁANIACH INFORMACYJNYCH (obligatoryjnie)"}]
[null,"Wnioskodawca oświadcza, że realizując zgłoszone zadanie dopełni działań informacyjnych wynikających z art. 38 ustawy z dnia 23 października 2018 r. o Rządowym Funduszu Rozwoju Dróg (t.j. Dz. U. z 2023 r. poz. 1983).",null,null,null,null,null,null,null,null,null,null,null,null,null,null,null,null,null,null,null,null,null,null,null,null,null,null,null,null,{"$f":"IF(X249=\"\",\"Wybierz z listy rozwijanej czy wnioskodawca oświadcza, że realizując zgłoszone we wniosku zadanie dopełni działań informacyjnych wynikających z ustawy o RFRD.\nDopełnienie działań informacyjnych jest OBLIGATORYJNE.\",IF(X249=\"TAK\",\"OK - wnioskodawca oświadcza, że dopełni działań informacyjnych wynikających z ustawy o RFRD.\",IF(X249=\"nie\",\"Oświadczenie jest OBLIGATORYJNE.\",\"Błąd danej - wprowadzono daną spoza listy rozwijanej\")))","v":"Wybierz z listy rozwijanej czy wnioskodawca oświadcza, że realizując zgłoszone we wniosku zadanie dopełni działań informacyjnych wynikających z ustawy o RFRD.\nDopełnienie działań informacyjnych jest OBLIGATORYJNE."},null,null,null,null,null,null,null,null,null,null,null,null,null,null,null,null,null,null,null,{"$f":"IF(X249=\"\",\"W\",IF(X249=\"tak\",\"OK\",\"B\"))","v":"W"}]
["OŚWIADCZENIE O ODPOWIEDZIALNOŚCI KARNEJ (obligatoryjnie)",null,null,null,null,null,null,null,null,null,null,null,null,null,null,null,null,null,null,null,null,null,null,null,null,null,null,null,null,null,{"$f":"A251","v":"OŚWIADCZENIE O ODPOWIEDZIALNOŚCI KARNEJ (obligatoryjnie)"}]
[null,"Ja, niżej podpisana/y, oświadczam, że informacje zawarte we wniosku oraz przedłożonych załącznikach są zgodne z prawdą. Jestem świadomy odpowiedzialności karnej wynikającej z art. 271 Kodeksu Karnego, dotyczącego poświadczenia nieprawdy, co do okoliczności mającej znaczenie prawne.",null,null,null,null,null,null,null,null,null,null,null,null,null,null,null,null,null,null,null,null,null,null,null,null,null,null,null,null,{"$f":"IF(X251=\"\",\"Wybierz z listy rozwijanej czy wnioskodawca oświadcza, że informacje zawarte we wniosku i załącznikach są zgodne z prawdą. \nOświadczenie to jest OBLIGATORYJNE.\",IF(X251=\"TAK\",\"OK - wnioskodawca oświadcza, że informacje zawarte we wniosku i załącznikach są zgodne z prawdą.\",IF(X251=\"nie\",\"Oświadczenie jest OBLIGATORYJNE.\",\"Błąd danej - wprowadzono daną spoza listy rozwijanej\")))","v":"Wybierz z listy rozwijanej czy wnioskodawca oświadcza, że informacje zawarte we wniosku i załącznikach są zgodne z prawdą. \nOświadczenie to jest OBLIGATORYJNE."},null,null,null,null,null,null,null,null,null,null,null,null,null,null,null,null,null,null,null,{"$f":"IF(X251=\"\",\"W\",IF(X251=\"tak\",\"OK\",\"B\"))","v":"W"}]
["Podpisy i pieczątki osób upoważnionych z ramienia wnioskodawcy (ustawowego zarządcy drogi) \nwraz z podpisem Skarbnika/Głównego Księgowego",null,null,null,null,null,null,null,null,null,null,null,null,null,null,null,null,null,null,null,null,null,null,null,null,null,null,null,null,null,"Podpisy i pieczątki osób upoważnionych z ramienia wnioskodawcy (ustawowego zarządcy drogi)  wraz z podpisem Skarbnika/Głównego Księgowego"]
[null,null,null,null,null,null,null,null,null,null,null,null,null,null,null,null,null,null,null,null,null,null,null,null,null,null,null,null,null,null,"Jeśli wnioskodawcą (ustawowym zarządcą drogi) jest :\n - GMINA (samorząd gminy) - podpis i pieczątka wójta/burmistrza/prezydenta oraz skarbnika/głównego księgowego (łącznie 2 podpisy),\n - POWIAT (samorząd powiatu) - podpisy i pieczątki dwóch członków zarządu powiatu oraz skarbnika/głównego księgowego (łącznie 3 podpisy).\n\nW przypadku, gdy właściwa osoba nie może złożyć podpisu i pieczątki dopuszcza się, żeby w jej zastępstwie podpis i pieczątkę złożyła osoba upoważniona. Należy wtedy załączyć do wniosku kopię stosownego upoważnienia potwierdzoną za zgodność z oryginałem.\n"]

{"sheet":"DANE","index":2,"n_rows":641,"n_cols":22,"rows_kept":641,"cut":false,"hidden":true,"merged":[[43,6,43,7],[43,8,43,10],[367,6,369,6],[367,7,369,7],[367,9,367,11],[369,9,369,11],[476,7,478,7],[476,8,476,9],[476,10,478,10],[476,11,476,12],[476,13,478,13],[477,8,478,8],[477,9,478,9],[477,11,478,11],[477,12,478,12],[477,15,478,15],[475,8,475,10],[475,11,475,13],[475,14,475,16],[475,17,478,17],[476,14,476,15],[476,16,478,16],[477,14,478,14]]}
[null,"DANE DO WNIOSKU - proszę nic nie zmieniać w tym arkuszu !!!"]
[]
[]
[]
[]
[]
[null,"JST",null,"GMINA","POWIAT","Buski","Jędrzejowski","Kazimierski","Kielecki","Konecki","Opatowski","Ostrowiecki","Pińczowski","Sandomierski","Skarżyski","Starachowicki","Staszowski","Włoszczowski"]
[null,"GMINA",null,"Buski","Buski","Busko-Zdrój","Imielno","Bejsce","Bieliny","Fałków","Baćkowice","Bałtów","Działoszyce","Dwikozy","Bliżyn","Brody","Bogoria","Kluczewsko"]
[null,"POWIAT",null,"Jędrzejowski","Jędrzejowski","Gnojno","Jędrzejów","Czarnocin","Bodzentyn","Gowarczów","Iwaniska","Bodzechów","Kije","Klimontów","Łączna","Mirzec","Łubnice","Krasocin"]
[null,null,null,"Kazimierski","Kazimierski","Nowy Korczyn","Małogoszcz","Kazimierza Wielka","Chęciny","Końskie","Lipnik","Ćmielów","Michałów","Koprzywnica","Skarżysko-Kamienna","Pawłów","Oleśnica","Moskorzew"]
[null,null,null,"Kielecki","Kielecki","Pacanów","Nagłowice","Opatowiec","Chmielnik","Radoszyce","Opatów","Kunów","Pińczów","Łoniów","Skarżysko Kościelne","Starachowice","Osiek","Radków"]
[null,null,null,"Konecki","Konecki","Solec-Zdrój","Oksa","Skalbmierz","Daleszyce","Ruda Maleniecka","Ożarów","Ostrowiec Świętokrzyski","Złota","Obrazów","Suchedniów","Wąchock","Połaniec","Secemin"]
[null,"RODZAJ ROBÓT",null,"Opatowski","Opatowski","Stopnica","Sędziszów",null,"Górno","Słupia Konecka","Sadowie","Waśniów",null,"Samborzec",null,null,"Rytwiany","Włoszczowa"]
[null,"BUDOWA",null,"Ostrowiecki","Ostrowiecki","Tuczępy","Słupia Jędrzejowska",null,"Kielce","Smyków","Tarłów",null,null,"Sandomierz",null,null,"Staszów"]
[null,"PRZEBUDOWA",null,"Pińczowski","Pińczowski","Wiślica","Sobków",null,"Łagów","Stąporków","Wojciechowice",null,null,"Wilczyce",null,null,"Szydłów"]
[null,"REMONT",null,"Sandomierski","Sandomierski",null,"Wodzisław",null,"Łopuszno",null,null,null,null,"Zawichost"]
[null,null,null,"Skarżyski","Skarżyski",null,null,null,"Masłów"]
[null,null,null,"Starachowicki","Starachowicki",null,null,null,"Miedziana Góra"]
[null,null,null,"Staszowski","Staszowski",null,null,null,"Mniów"]
[null,null,null,"Włoszczowski","Włoszczowski",null,null,null,"Morawica"]
[null,null,null,null,null,null,null,null,"Nowa Słupia"]
[null,null,null,null,null,null,null,null,"Nowiny"]
[null,null,null,null,null,null,null,null,"Piekoszów"]
[null,null,null,null,null,null,null,null,"Pierzchnica"]
[null,null,null,null,null,null,null,null,"Raków"]
[null,null,null,null,null,null,null,null,"Strawczyn"]
[null,null,null,null,null,null,null,null,"Zagnańsk"]
[]
[]
[null,null,null,"KLASA DROGI"]
[null,"Klasa drogi",null,"KATEGORIA \n(pkt 3 wniosku)","gminna","powiatowa","brak",null,"RODZAJ DROGI\n(pkt 9 wniosku)"]
[null,"D - dojazdowa",null,"gminna","D - dojazdowa","Z - zbiorcza","D - dojazdowa",null,"droga zamiejska"]
[null,"L - lokalna",null,"powiatowa","L - lokalna","G - główna","L - lokalna",null,"ulica"]
[null,"Z - zbiorcza",null,"brak","Z - zbiorcza","GP - główna ruchu przyspieszonego","Z - zbiorcza"]
[null,"G - główna",null,null,"G - główna","L - lokalna","G - główna"]
[null,"GP - główna ruchu przyspieszonego",null,null,"GP - główna ruchu przyspieszonego",null,"GP - główna ruchu przyspieszonego"]
[]
[]
[]
[]
[]
[]
[]
[null,null,null,null,null,null,2024,null,"RYZYKO WYPADKÓW",null,null,"PAN"]
[null,null,null,"powiat","gmina","JST","Teryt\nTERC","SKRÓT - typ JST","z udziałem pieszych","ogółem","ofiary śmiertelne","utrata funkcji","Peryferyjność"]
[null,null,null,"buski",null,"powiat buski",2601,"PZ",{"$f":"VLOOKUP($F46,'DANE - K1 lit.A'!$D$7:$M$120,4,0)","v":"NIE"},{"$f":"VLOOKUP($F46,'DANE - K1 lit.A'!$D$7:$M$120,5,0)","v":"NIE"},{"$f":"VLOOKUP($F46,'DANE - K1 lit.A'!$D$7:$M$120,6,0)","v":"NIE"},{"$f":"IF($E46=\"\",\"\",VLOOKUP($F46,'DANE - K4 lit.B'!$D$6:$E$107,2,0))","v":""},{"$f":"IF($E46=\"\",\"\",VLOOKUP($F46,'DANE - K2 lit.C'!$B$14:$I$114,8,0))","v":""},null,null,{"$f":"VLOOKUP($D46,POWIAT[POWIAT],1,0)","v":"Buski"}]
[null,null,null,"jędrzejowski",null,"powiat jędrzejowski",2602,"PZ",{"$f":"VLOOKUP($F47,'DANE - K1 lit.A'!$D$7:$M$120,4,0)","v":"TAK"},{"$f":"VLOOKUP($F47,'DANE - K1 lit.A'!$D$7:$M$120,5,0)","v":"TAK"},{"$f":"VLOOKUP($F47,'DANE - K1 lit.A'!$D$7:$M$120,6,0)","v":"NIE"},{"$f":"IF($E47=\"\",\"\",VLOOKUP($F47,'DANE - K4 lit.B'!$D$6:$E$107,2,0))","v":""},{"$f":"IF($E47=\"\",\"\",VLOOKUP($F47,'DANE - K2 lit.C'!$B$14:$I$114,8,0))","v":""},null,null,{"$f":"VLOOKUP($D47,POWIAT[POWIAT],1,0)","v":"Jędrzejowski"}]
[null,null,null,"kazimierski",null,"powiat kazimierski",2603,"PZ",{"$f":"VLOOKUP($F48,'DANE - K1 lit.A'!$D$7:$M$120,4,0)","v":"NIE"},{"$f":"VLOOKUP($F48,'DANE - K1 lit.A'!$D$7:$M$120,5,0)","v":"NIE"},{"$f":"VLOOKUP($F48,'DANE - K1 lit.A'!$D$7:$M$120,6,0)","v":"TAK"},{"$f":"IF($E48=\"\",\"\",VLOOKUP($F48,'DANE - K4 lit.B'!$D$6:$E$107,2,0))","v":""},{"$f":"IF($E48=\"\",\"\",VLOOKUP($F48,'DANE - K2 lit.C'!$B$14:$I$114,8,0))","v":""},null,null,{"$f":"VLOOKUP($D48,POWIAT[POWIAT],1,0)","v":"Kazimierski"}]
[null,null,null,"kielecki",null,"powiat kielecki",2604,"PZ",{"$f":"VLOOKUP($F49,'DANE - K1 lit.A'!$D$7:$M$120,4,0)","v":"TAK"},{"$f":"VLOOKUP($F49,'DANE - K1 lit.A'!$D$7:$M$120,5,0)","v":"TAK"},{"$f":"VLOOKUP($F49,'DANE - K1 lit.A'!$D$7:$M$120,6,0)","v":"TAK"},{"$f":"IF($E49=\"\",\"\",VLOOKUP($F49,'DANE - K4 lit.B'!$D$6:$E$107,2,0))","v":""},{"$f":"IF($E49=\"\",\"\",VLOOKUP($F49,'DANE - K2 lit.C'!$B$14:$I$114,8,0))","v":""},null,null,{"$f":"VLOOKUP($D49,POWIAT[POWIAT],1,0)","v":"Kielecki"}]
[null,null,null,"konecki",null,"powiat konecki",2605,"PZ",{"$f":"VLOOKUP($F50,'DANE - K1 lit.A'!$D$7:$M$120,4,0)","v":"TAK"},{"$f":"VLOOKUP($F50,'DANE - K1 lit.A'!$D$7:$M$120,5,0)","v":"NIE"},{"$f":"VLOOKUP($F50,'DANE - K1 lit.A'!$D$7:$M$120,6,0)","v":"NIE"},{"$f":"IF($E50=\"\",\"\",VLOOKUP($F50,'DANE - K4 lit.B'!$D$6:$E$107,2,0))","v":""},{"$f":"IF($E50=\"\",\"\",VLOOKUP($F50,'DANE - K2 lit.C'!$B$14:$I$114,8,0))","v":""},null,null,{"$f":"VLOOKUP($D50,POWIAT[POWIAT],1,0)","v":"Konecki"}]
[null,null,null,"opatowski",null,"powiat opatowski",2606,"PZ",{"$f":"VLOOKUP($F51,'DANE - K1 lit.A'!$D$7:$M$120,4,0)","v":"NIE"},{"$f":"VLOOKUP($F51,'DANE - K1 lit.A'!$D$7:$M$120,5,0)","v":"NIE"},{"$f":"VLOOKUP($F51,'DANE - K1 lit.A'!$D$7:$M$120,6,0)","v":"TAK"},{"$f":"IF($E51=\"\",\"\",VLOOKUP($F51,'DANE - K4 lit.B'!$D$6:$E$107,2,0))","v":""},{"$f":"IF($E51=\"\",\"\",VLOOKUP($F51,'DANE - K2 lit.C'!$B$14:$I$114,8,0))","v":""},null,null,{"$f":"VLOOKUP($D51,POWIAT[POWIAT],1,0)","v":"Opatowski"}]
[null,null,null,"ostrowiecki",null,"powiat ostrowiecki",2607,"PZ",{"$f":"VLOOKUP($F52,'DANE - K1 lit.A'!$D$7:$M$120,4,0)","v":"NIE"},{"$f":"VLOOKUP($F52,'DANE - K1 lit.A'!$D$7:$M$120,5,0)","v":"NIE"},{"$f":"VLOOKUP($F52,'DANE - K1 lit.A'!$D$7:$M$120,6,0)","v":"NIE"},{"$f":"IF($E52=\"\",\"\",VLOOKUP($F52,'DANE - K4 lit.B'!$D$6:$E$107,2,0))","v":""},{"$f":"IF($E52=\"\",\"\",VLOOKUP($F52,'DANE - K2 lit.C'!$B$14:$I$114,8,0))","v":""},null,null,{"$f":"VLOOKUP($D52,POWIAT[POWIAT],1,0)","v":"Ostrowiecki"}]
[null,null,null,"pińczowski",null,"powiat pińczowski",2608,"PZ",{"$f":"VLOOKUP($F53,'DANE - K1 lit.A'!$D$7:$M$120,4,0)","v":"NIE"},{"$f":"VLOOKUP($F53,'DANE - K1 lit.A'!$D$7:$M$120,5,0)","v":"TAK"},{"$f":"VLOOKUP($F53,'DANE - K1 lit.A'!$D$7:$M$120,6,0)","v":"TAK"},{"$f":"IF($E53=\"\",\"\",VLOOKUP($F53,'DANE - K4 lit.B'!$D$6:$E$107,2,0))","v":""},{"$f":"IF($E53=\"\",\"\",VLOOKUP($F53,'DANE - K2 lit.C'!$B$14:$I$114,8,0))","v":""},null,null,{"$f":"VLOOKUP($D53,POWIAT[POWIAT],1,0)","v":"Pińczowski"}]
[null,null,null,"sandomierski",null,"powiat sandomierski",2609,"PZ",{"$f":"VLOOKUP($F54,'DANE - K1 lit.A'!$D$7:$M$120,4,0)","v":"TAK"},{"$f":"VLOOKUP($F54,'DANE - K1 lit.A'!$D$7:$M$120,5,0)","v":"TAK"},{"$f":"VLOOKUP($F54,'DANE - K1 lit.A'!$D$7:$M$120,6,0)","v":"NIE"},{"$f":"IF($E54=\"\",\"\",VLOOKUP($F54,'DANE - K4 lit.B'!$D$6:$E$107,2,0))","v":""},{"$f":"IF($E54=\"\",\"\",VLOOKUP($F54,'DANE - K2 lit.C'!$B$14:$I$114,8,0))","v":""},null,null,{"$f":"VLOOKUP($D54,POWIAT[POWIAT],1,0)","v":"Sandomierski"}]
[null,null,null,"skarżyski",null,"powiat skarżyski",2610,"PZ",{"$f":"VLOOKUP($F55,'DANE - K1 lit.A'!$D$7:$M$120,4,0)","v":"TAK"},{"$f":"VLOOKUP($F55,'DANE - K1 lit.A'!$D$7:$M$120,5,0)","v":"TAK"},{"$f":"VLOOKUP($F55,'DANE - K1 lit.A'!$D$7:$M$120,6,0)","v":"NIE"},{"$f":"IF($E55=\"\",\"\",VLOOKUP($F55,'DANE - K4 lit.B'!$D$6:$E$107,2,0))","v":""},{"$f":"IF($E55=\"\",\"\",VLOOKUP($F55,'DANE - K2 lit.C'!$B$14:$I$114,8,0))","v":""},null,null,{"$f":"VLOOKUP($D55,POWIAT[POWIAT],1,0)","v":"Skarżyski"}]
[null,null,null,"starachowicki",null,"powiat starachowicki",2611,"PZ",{"$f":"VLOOKUP($F56,'DANE - K1 lit.A'!$D$7:$M$120,4,0)","v":"NIE"},{"$f":"VLOOKUP($F56,'DANE - K1 lit.A'!$D$7:$M$120,5,0)","v":"NIE"},{"$f":"VLOOKUP($F56,'DANE - K1 lit.A'!$D$7:$M$120,6,0)","v":"NIE"},{"$f":"IF($E56=\"\",\"\",VLOOKUP($F56,'DANE - K4 lit.B'!$D$6:$E$107,2,0))","v":""},{"$f":"IF($E56=\"\",\"\",VLOOKUP($F56,'DANE - K2 lit.C'!$B$14:$I$114,8,0))","v":""},null,null,{"$f":"VLOOKUP($D56,POWIAT[POWIAT],1,0)","v":"Starachowicki"}]
[null,null,null,"staszowski",null,"powiat staszowski",2612,"PZ",{"$f":"VLOOKUP($F57,'DANE - K1 lit.A'!$D$7:$M$120,4,0)","v":"TAK"},{"$f":"VLOOKUP($F57,'DANE - K1 lit.A'!$D$7:$M$120,5,0)","v":"NIE"},{"$f":"VLOOKUP($F57,'DANE - K1 lit.A'!$D$7:$M$120,6,0)","v":"TAK"},{"$f":"IF($E57=\"\",\"\",VLOOKUP($F57,'DANE - K4 lit.B'!$D$6:$E$107,2,0))","v":""},{"$f":"IF($E57=\"\",\"\",VLOOKUP($F57,'DANE - K2 lit.C'!$B$14:$I$114,8,0))","v":""},null,null,{"$f":"VLOOKUP($D57,POWIAT[POWIAT],1,0)","v":"Staszowski"}]
[null,null,null,"włoszczowski",null,"powiat włoszczowski",2613,"PZ",{"$f":"VLOOKUP($F58,'DANE - K1 lit.A'!$D$7:$M$120,4,0)","v":"NIE"},{"$f":"VLOOKUP($F58,'DANE - K1 lit.A'!$D$7:$M$120,5,0)","v":"TAK"},{"$f":"VLOOKUP($F58,'DANE - K1 lit.A'!$D$7:$M$120,6,0)","v":"TAK"},{"$f":"IF($E58=\"\",\"\",VLOOKUP($F58,'DANE - K4 lit.B'!$D$6:$E$107,2,0))","v":""},{"$f":"IF($E58=\"\",\"\",VLOOKUP($F58,'DANE - K2 lit.C'!$B$14:$I$114,8,0))","v":""},null,null,{"$f":"VLOOKUP($D58,POWIAT[POWIAT],1,0)","v":"Włoszczowski"}]
[null,null,null,"buski","Busko-Zdrój","gmina Busko-Zdrój",2601013,"GM-W",{"$f":"VLOOKUP($F59,'DANE - K1 lit.A'!$D$7:$M$120,4,0)","v":"TAK"},{"$f":"VLOOKUP($F59,'DANE - K1 lit.A'!$D$7:$M$120,5,0)","v":"NIE"},{"$f":"VLOOKUP($F59,'DANE - K1 lit.A'!$D$7:$M$120,6,0)","v":"TAK"},{"$f":"IF($E59=\"\",\"\",VLOOKUP($F59,'DANE - K4 lit.B'!$D$6:$E$107,2,0))","v":"TAK"},{"$f":"IF($E59=\"\",\"\",VLOOKUP($F59,'DANE - K2 lit.C'!$B$14:$I$114,8,0))","v":"w przedziale od 30 do 50 minut"},null,null,{"$f":"IF($D59=Buski[[#Headers],[Buski]],VLOOKUP($E59,Buski[Buski],1,0),IF($D59=Jędrzejowski[[#Headers],[Jędrzejowski]],VLOOKUP($E59,Jędrzejowski[Jędrzejowski],1,0),IF($D59=Kazimierski[[#Headers],[Kazimierski]],VLOOKUP($E59,Kazimierski[Kazimierski],1,0),IF($D59=Kielecki[[#Headers],[Kielecki]],VLOOKUP($E59,Kielecki[Kielecki],1,0),IF($D59=Konecki[[#Headers],[Konecki]],VLOOKUP($E59,Konecki[Konecki],1,0),IF($D59=Opatowski[[#Headers],[Opatowski]],VLOOKUP($E59,Opatowski[Opatowski],1,0),IF($D59=Ostrowiecki[[#Headers],[Ostrowiecki]],VLOOKUP($E59,Ostrowiecki[Ostrowiecki],1,0),IF($D59=Pińczowski[[#Headers],[Pińczowski]],VLOOKUP($E59,Pińczowski[Pińczowski],1,0),IF($D59=Sandomierski[[#Headers],[Sandomierski]],VLOOKUP($E59,Sandomierski[Sandomierski],1,0),IF($D59=Skarżyski[[#Headers],[Skarżyski]],VLOOKUP($E59,Skarżyski[Skarżyski],1,0),IF($D59=Starachowicki[[#Headers],[Starachowicki]],VLOOKUP($E59,Starachowicki[Starachowicki],1,0),IF($D59=Staszowski[[#Headers],[Staszowski]],VLOOKUP($E59,Staszowski[Staszowski],1,0),IF($D59=Włoszczowski[[#Headers],[Włoszczowski]],VLOOKUP($E59,Włoszczowski[Włoszczowski],1,0),\"\")))))))))))))","v":"Busko-Zdrój"}]
[null,null,null,"buski","Gnojno","gmina Gnojno",2601022,"GW",{"$f":"VLOOKUP($F60,'DANE - K1 lit.A'!$D$7:$M$120,4,0)","v":"NIE"},{"$f":"VLOOKUP($F60,'DANE - K1 lit.A'!$D$7:$M$120,5,0)","v":"NIE"},{"$f":"VLOOKUP($F60,'DANE - K1 lit.A'!$D$7:$M$120,6,0)","v":"NIE"},{"$f":"IF($E60=\"\",\"\",VLOOKUP($F60,'DANE - K4 lit.B'!$D$6:$E$107,2,0))","v":"NIE"},{"$f":"IF($E60=\"\",\"\",VLOOKUP($F60,'DANE - K2 lit.C'!$B$14:$I$114,8,0))","v":"w przedziale od 30 do 50 minut"},null,null,{"$f":"IF($D60=Buski[[#Headers],[Buski]],VLOOKUP($E60,Buski[Buski],1,0),IF($D60=Jędrzejowski[[#Headers],[Jędrzejowski]],VLOOKUP($E60,Jędrzejowski[Jędrzejowski],1,0),IF($D60=Kazimierski[[#Headers],[Kazimierski]],VLOOKUP($E60,Kazimierski[Kazimierski],1,0),IF($D60=Kielecki[[#Headers],[Kielecki]],VLOOKUP($E60,Kielecki[Kielecki],1,0),IF($D60=Konecki[[#Headers],[Konecki]],VLOOKUP($E60,Konecki[Konecki],1,0),IF($D60=Opatowski[[#Headers],[Opatowski]],VLOOKUP($E60,Opatowski[Opatowski],1,0),IF($D60=Ostrowiecki[[#Headers],[Ostrowiecki]],VLOOKUP($E60,Ostrowiecki[Ostrowiecki],1,0),IF($D60=Pińczowski[[#Headers],[Pińczowski]],VLOOKUP($E60,Pińczowski[Pińczowski],1,0),IF($D60=Sandomierski[[#Headers],[Sandomierski]],VLOOKUP($E60,Sandomierski[Sandomierski],1,0),IF($D60=Skarżyski[[#Headers],[Skarżyski]],VLOOKUP($E60,Skarżyski[Skarżyski],1,0),IF($D60=Starachowicki[[#Headers],[Starachowicki]],VLOOKUP($E60,Starachowicki[Starachowicki],1,0),IF($D60=Staszowski[[#Headers],[Staszowski]],VLOOKUP($E60,Staszowski[Staszowski],1,0),IF($D60=Włoszczowski[[#Headers],[Włoszczowski]],VLOOKUP($E60,Włoszczowski[Włoszczowski],1,0),\"\")))))))))))))","v":"Gnojno"}]
[null,null,null,"buski","Nowy Korczyn","gmina Nowy Korczyn",2601033,"GM-W",{"$f":"VLOOKUP($F61,'DANE - K1 lit.A'!$D$7:$M$120,4,0)","v":"NIE"},{"$f":"VLOOKUP($F61,'DANE - K1 lit.A'!$D$7:$M$120,5,0)","v":"NIE"},{"$f":"VLOOKUP($F61,'DANE - K1 lit.A'!$D$7:$M$120,6,0)","v":"NIE"},{"$f":"IF($E61=\"\",\"\",VLOOKUP($F61,'DANE - K4 lit.B'!$D$6:$E$107,2,0))","v":"NIE"},{"$f":"IF($E61=\"\",\"\",VLOOKUP($F61,'DANE - K2 lit.C'!$B$14:$I$114,8,0))","v":"większy niż 50 minut"},null,null,{"$f":"IF($D61=Buski[[#Headers],[Buski]],VLOOKUP($E61,Buski[Buski],1,0),IF($D61=Jędrzejowski[[#Headers],[Jędrzejowski]],VLOOKUP($E61,Jędrzejowski[Jędrzejowski],1,0),IF($D61=Kazimierski[[#Headers],[Kazimierski]],VLOOKUP($E61,Kazimierski[Kazimierski],1,0),IF($D61=Kielecki[[#Headers],[Kielecki]],VLOOKUP($E61,Kielecki[Kielecki],1,0),IF($D61=Konecki[[#Headers],[Konecki]],VLOOKUP($E61,Konecki[Konecki],1,0),IF($D61=Opatowski[[#Headers],[Opatowski]],VLOOKUP($E61,Opatowski[Opatowski],1,0),IF($D61=Ostrowiecki[[#Headers],[Ostrowiecki]],VLOOKUP($E61,Ostrowiecki[Ostrowiecki],1,0),IF($D61=Pińczowski[[#Headers],[Pińczowski]],VLOOKUP($E61,Pińczowski[Pińczowski],1,0),IF($D61=Sandomierski[[#Headers],[Sandomierski]],VLOOKUP($E61,Sandomierski[Sandomierski],1,0),IF($D61=Skarżyski[[#Headers],[Skarżyski]],VLOOKUP($E61,Skarżyski[Skarżyski],1,0),IF($D61=Starachowicki[[#Headers],[Starachowicki]],VLOOKUP($E61,Starachowicki[Starachowicki],1,0),IF($D61=Staszowski[[#Headers],[Staszowski]],VLOOKUP($E61,Staszowski[Staszowski],1,0),IF($D61=Włoszczowski[[#Headers],[Włoszczowski]],VLOOKUP($E61,Włoszczowski[Włoszczowski],1,0),\"\")))))))))))))","v":"Nowy Korczyn"}]
[null,null,null,"buski","Pacanów","gmina Pacanów",2601043,"GM-W",{"$f":"VLOOKUP($F62,'DANE - K1 lit.A'!$D$7:$M$120,4,0)","v":"TAK"},{"$f":"VLOOKUP($F62,'DANE - K1 lit.A'!$D$7:$M$120,5,0)","v":"NIE"},{"$f":"VLOOKUP($F62,'DANE - K1 lit.A'!$D$7:$M$120,6,0)","v":"NIE"},{"$f":"IF($E62=\"\",\"\",VLOOKUP($F62,'DANE - K4 lit.B'!$D$6:$E$107,2,0))","v":"NIE"},{"$f":"IF($E62=\"\",\"\",VLOOKUP($F62,'DANE - K2 lit.C'!$B$14:$I$114,8,0))","v":"większy niż 50 minut"},null,null,{"$f":"IF($D62=Buski[[#Headers],[Buski]],VLOOKUP($E62,Buski[Buski],1,0),IF($D62=Jędrzejowski[[#Headers],[Jędrzejowski]],VLOOKUP($E62,Jędrzejowski[Jędrzejowski],1,0),IF($D62=Kazimierski[[#Headers],[Kazimierski]],VLOOKUP($E62,Kazimierski[Kazimierski],1,0),IF($D62=Kielecki[[#Headers],[Kielecki]],VLOOKUP($E62,Kielecki[Kielecki],1,0),IF($D62=Konecki[[#Headers],[Konecki]],VLOOKUP($E62,Konecki[Konecki],1,0),IF($D62=Opatowski[[#Headers],[Opatowski]],VLOOKUP($E62,Opatowski[Opatowski],1,0),IF($D62=Ostrowiecki[[#Headers],[Ostrowiecki]],VLOOKUP($E62,Ostrowiecki[Ostrowiecki],1,0),IF($D62=Pińczowski[[#Headers],[Pińczowski]],VLOOKUP($E62,Pińczowski[Pińczowski],1,0),IF($D62=Sandomierski[[#Headers],[Sandomierski]],VLOOKUP($E62,Sandomierski[Sandomierski],1,0),IF($D62=Skarżyski[[#Headers],[Skarżyski]],VLOOKUP($E62,Skarżyski[Skarżyski],1,0),IF($D62=Starachowicki[[#Headers],[Starachowicki]],VLOOKUP($E62,Starachowicki[Starachowicki],1,0),IF($D62=Staszowski[[#Headers],[Staszowski]],VLOOKUP($E62,Staszowski[Staszowski],1,0),IF($D62=Włoszczowski[[#Headers],[Włoszczowski]],VLOOKUP($E62,Włoszczowski[Włoszczowski],1,0),\"\")))))))))))))","v":"Pacanów"}]
[null,null,null,"buski","Solec-Zdrój","gmina Solec-Zdrój",2601052,"GW",{"$f":"VLOOKUP($F63,'DANE - K1 lit.A'!$D$7:$M$120,4,0)","v":"TAK"},{"$f":"VLOOKUP($F63,'DANE - K1 lit.A'!$D$7:$M$120,5,0)","v":"TAK"},{"$f":"VLOOKUP($F63,'DANE - K1 lit.A'!$D$7:$M$120,6,0)","v":"NIE"},{"$f":"IF($E63=\"\",\"\",VLOOKUP($F63,'DANE - K4 lit.B'!$D$6:$E$107,2,0))","v":"NIE"},{"$f":"IF($E63=\"\",\"\",VLOOKUP($F63,'DANE - K2 lit.C'!$B$14:$I$114,8,0))","v":"większy niż 50 minut"},null,null,{"$f":"IF($D63=Buski[[#Headers],[Buski]],VLOOKUP($E63,Buski[Buski],1,0),IF($D63=Jędrzejowski[[#Headers],[Jędrzejowski]],VLOOKUP($E63,Jędrzejowski[Jędrzejowski],1,0),IF($D63=Kazimierski[[#Headers],[Kazimierski]],VLOOKUP($E63,Kazimierski[Kazimierski],1,0),IF($D63=Kielecki[[#Headers],[Kielecki]],VLOOKUP($E63,Kielecki[Kielecki],1,0),IF($D63=Konecki[[#Headers],[Konecki]],VLOOKUP($E63,Konecki[Konecki],1,0),IF($D63=Opatowski[[#Headers],[Opatowski]],VLOOKUP($E63,Opatowski[Opatowski],1,0),IF($D63=Ostrowiecki[[#Headers],[Ostrowiecki]],VLOOKUP($E63,Ostrowiecki[Ostrowiecki],1,0),IF($D63=Pińczowski[[#Headers],[Pińczowski]],VLOOKUP($E63,Pińczowski[Pińczowski],1,0),IF($D63=Sandomierski[[#Headers],[Sandomierski]],VLOOKUP($E63,Sandomierski[Sandomierski],1,0),IF($D63=Skarżyski[[#Headers],[Skarżyski]],VLOOKUP($E63,Skarżyski[Skarżyski],1,0),IF($D63=Starachowicki[[#Headers],[Starachowicki]],VLOOKUP($E63,Starachowicki[Starachowicki],1,0),IF($D63=Staszowski[[#Headers],[Staszowski]],VLOOKUP($E63,Staszowski[Staszowski],1,0),IF($D63=Włoszczowski[[#Headers],[Włoszczowski]],VLOOKUP($E63,Włoszczowski[Włoszczowski],1,0),\"\")))))))))))))","v":"Solec-Zdrój"}]
[null,null,null,"buski","Stopnica","gmina Stopnica",2601063,"GM-W",{"$f":"VLOOKUP($F64,'DANE - K1 lit.A'!$D$7:$M$120,4,0)","v":"TAK"},{"$f":"VLOOKUP($F64,'DANE - K1 lit.A'!$D$7:$M$120,5,0)","v":"TAK"},{"$f":"VLOOKUP($F64,'DANE - K1 lit.A'!$D$7:$M$120,6,0)","v":"NIE"},{"$f":"IF($E64=\"\",\"\",VLOOKUP($F64,'DANE - K4 lit.B'!$D$6:$E$107,2,0))","v":"NIE"},{"$f":"IF($E64=\"\",\"\",VLOOKUP($F64,'DANE - K2 lit.C'!$B$14:$I$114,8,0))","v":"w przedziale od 30 do 50 minut"},null,null,{"$f":"IF($D64=Buski[[#Headers],[Buski]],VLOOKUP($E64,Buski[Buski],1,0),IF($D64=Jędrzejowski[[#Headers],[Jędrzejowski]],VLOOKUP($E64,Jędrzejowski[Jędrzejowski],1,0),IF($D64=Kazimierski[[#Headers],[Kazimierski]],VLOOKUP($E64,Kazimierski[Kazimierski],1,0),IF($D64=Kielecki[[#Headers],[Kielecki]],VLOOKUP($E64,Kielecki[Kielecki],1,0),IF($D64=Konecki[[#Headers],[Konecki]],VLOOKUP($E64,Konecki[Konecki],1,0),IF($D64=Opatowski[[#Headers],[Opatowski]],VLOOKUP($E64,Opatowski[Opatowski],1,0),IF($D64=Ostrowiecki[[#Headers],[Ostrowiecki]],VLOOKUP($E64,Ostrowiecki[Ostrowiecki],1,0),IF($D64=Pińczowski[[#Headers],[Pińczowski]],VLOOKUP($E64,Pińczowski[Pińczowski],1,0),IF($D64=Sandomierski[[#Headers],[Sandomierski]],VLOOKUP($E64,Sandomierski[Sandomierski],1,0),IF($D64=Skarżyski[[#Headers],[Skarżyski]],VLOOKUP($E64,Skarżyski[Skarżyski],1,0),IF($D64=Starachowicki[[#Headers],[Starachowicki]],VLOOKUP($E64,Starachowicki[Starachowicki],1,0),IF($D64=Staszowski[[#Headers],[Staszowski]],VLOOKUP($E64,Staszowski[Staszowski],1,0),IF($D64=Włoszczowski[[#Headers],[Włoszczowski]],VLOOKUP($E64,Włoszczowski[Włoszczowski],1,0),\"\")))))))))))))","v":"Stopnica"}]
[null,null,null,"buski","Tuczępy","gmina Tuczępy",2601072,"GW",{"$f":"VLOOKUP($F65,'DANE - K1 lit.A'!$D$7:$M$120,4,0)","v":"NIE"},{"$f":"VLOOKUP($F65,'DANE - K1 lit.A'!$D$7:$M$120,5,0)","v":"NIE"},{"$f":"VLOOKUP($F65,'DANE - K1 lit.A'!$D$7:$M$120,6,0)","v":"NIE"},{"$f":"IF($E65=\"\",\"\",VLOOKUP($F65,'DANE - K4 lit.B'!$D$6:$E$107,2,0))","v":"NIE"},{"$f":"IF($E65=\"\",\"\",VLOOKUP($F65,'DANE - K2 lit.C'!$B$14:$I$114,8,0))","v":"w przedziale od 30 do 50 minut"},null,null,{"$f":"IF($D65=Buski[[#Headers],[Buski]],VLOOKUP($E65,Buski[Buski],1,0),IF($D65=Jędrzejowski[[#Headers],[Jędrzejowski]],VLOOKUP($E65,Jędrzejowski[Jędrzejowski],1,0),IF($D65=Kazimierski[[#Headers],[Kazimierski]],VLOOKUP($E65,Kazimierski[Kazimierski],1,0),IF($D65=Kielecki[[#Headers],[Kielecki]],VLOOKUP($E65,Kielecki[Kielecki],1,0),IF($D65=Konecki[[#Headers],[Konecki]],VLOOKUP($E65,Konecki[Konecki],1,0),IF($D65=Opatowski[[#Headers],[Opatowski]],VLOOKUP($E65,Opatowski[Opatowski],1,0),IF($D65=Ostrowiecki[[#Headers],[Ostrowiecki]],VLOOKUP($E65,Ostrowiecki[Ostrowiecki],1,0),IF($D65=Pińczowski[[#Headers],[Pińczowski]],VLOOKUP($E65,Pińczowski[Pińczowski],1,0),IF($D65=Sandomierski[[#Headers],[Sandomierski]],VLOOKUP($E65,Sandomierski[Sandomierski],1,0),IF($D65=Skarżyski[[#Headers],[Skarżyski]],VLOOKUP($E65,Skarżyski[Skarżyski],1,0),IF($D65=Starachowicki[[#Headers],[Starachowicki]],VLOOKUP($E65,Starachowicki[Starachowicki],1,0),IF($D65=Staszowski[[#Headers],[Staszowski]],VLOOKUP($E65,Staszowski[Staszowski],1,0),IF($D65=Włoszczowski[[#Headers],[Włoszczowski]],VLOOKUP($E65,Włoszczowski[Włoszczowski],1,0),\"\")))))))))))))","v":"Tuczępy"}]
[null,null,null,"buski","Wiślica","gmina Wiślica",2601083,"GM-W",{"$f":"VLOOKUP($F66,'DANE - K1 lit.A'!$D$7:$M$120,4,0)","v":"NIE"},{"$f":"VLOOKUP($F66,'DANE - K1 lit.A'!$D$7:$M$120,5,0)","v":"NIE"},{"$f":"VLOOKUP($F66,'DANE - K1 lit.A'!$D$7:$M$120,6,0)","v":"NIE"},{"$f":"IF($E66=\"\",\"\",VLOOKUP($F66,'DANE - K4 lit.B'!$D$6:$E$107,2,0))","v":"NIE"},{"$f":"IF($E66=\"\",\"\",VLOOKUP($F66,'DANE - K2 lit.C'!$B$14:$I$114,8,0))","v":"w przedziale od 30 do 50 minut"},null,null,{"$f":"IF($D66=Buski[[#Headers],[Buski]],VLOOKUP($E66,Buski[Buski],1,0),IF($D66=Jędrzejowski[[#Headers],[Jędrzejowski]],VLOOKUP($E66,Jędrzejowski[Jędrzejowski],1,0),IF($D66=Kazimierski[[#Headers],[Kazimierski]],VLOOKUP($E66,Kazimierski[Kazimierski],1,0),IF($D66=Kielecki[[#Headers],[Kielecki]],VLOOKUP($E66,Kielecki[Kielecki],1,0),IF($D66=Konecki[[#Headers],[Konecki]],VLOOKUP($E66,Konecki[Konecki],1,0),IF($D66=Opatowski[[#Headers],[Opatowski]],VLOOKUP($E66,Opatowski[Opatowski],1,0),IF($D66=Ostrowiecki[[#Headers],[Ostrowiecki]],VLOOKUP($E66,Ostrowiecki[Ostrowiecki],1,0),IF($D66=Pińczowski[[#Headers],[Pińczowski]],VLOOKUP($E66,Pińczowski[Pińczowski],1,0),IF($D66=Sandomierski[[#Headers],[Sandomierski]],VLOOKUP($E66,Sandomierski[Sandomierski],1,0),IF($D66=Skarżyski[[#Headers],[Skarżyski]],VLOOKUP($E66,Skarżyski[Skarżyski],1,0),IF($D66=Starachowicki[[#Headers],[Starachowicki]],VLOOKUP($E66,Starachowicki[Starachowicki],1,0),IF($D66=Staszowski[[#Headers],[Staszowski]],VLOOKUP($E66,Staszowski[Staszowski],1,0),IF($D66=Włoszczowski[[#Headers],[Włoszczowski]],VLOOKUP($E66,Włoszczowski[Włoszczowski],1,0),\"\")))))))))))))","v":"Wiślica"}]
[null,null,null,"jędrzejowski","Imielno","gmina Imielno",2602012,"GW",{"$f":"VLOOKUP($F67,'DANE - K1 lit.A'!$D$7:$M$120,4,0)","v":"NIE"},{"$f":"VLOOKUP($F67,'DANE - K1 lit.A'!$D$7:$M$120,5,0)","v":"NIE"},{"$f":"VLOOKUP($F67,'DANE - K1 lit.A'!$D$7:$M$120,6,0)","v":"NIE"},{"$f":"IF($E67=\"\",\"\",VLOOKUP($F67,'DANE - K4 lit.B'!$D$6:$E$107,2,0))","v":"NIE"},{"$f":"IF($E67=\"\",\"\",VLOOKUP($F67,'DANE - K2 lit.C'!$B$14:$I$114,8,0))","v":"w przedziale od 30 do 50 minut"},null,null,{"$f":"IF($D67=Buski[[#Headers],[Buski]],VLOOKUP($E67,Buski[Buski],1,0),IF($D67=Jędrzejowski[[#Headers],[Jędrzejowski]],VLOOKUP($E67,Jędrzejowski[Jędrzejowski],1,0),IF($D67=Kazimierski[[#Headers],[Kazimierski]],VLOOKUP($E67,Kazimierski[Kazimierski],1,0),IF($D67=Kielecki[[#Headers],[Kielecki]],VLOOKUP($E67,Kielecki[Kielecki],1,0),IF($D67=Konecki[[#Headers],[Konecki]],VLOOKUP($E67,Konecki[Konecki],1,0),IF($D67=Opatowski[[#Headers],[Opatowski]],VLOOKUP($E67,Opatowski[Opatowski],1,0),IF($D67=Ostrowiecki[[#Headers],[Ostrowiecki]],VLOOKUP($E67,Ostrowiecki[Ostrowiecki],1,0),IF($D67=Pińczowski[[#Headers],[Pińczowski]],VLOOKUP($E67,Pińczowski[Pińczowski],1,0),IF($D67=Sandomierski[[#Headers],[Sandomierski]],VLOOKUP($E67,Sandomierski[Sandomierski],1,0),IF($D67=Skarżyski[[#Headers],[Skarżyski]],VLOOKUP($E67,Skarżyski[Skarżyski],1,0),IF($D67=Starachowicki[[#Headers],[Starachowicki]],VLOOKUP($E67,Starachowicki[Starachowicki],1,0),IF($D67=Staszowski[[#Headers],[Staszowski]],VLOOKUP($E67,Staszowski[Staszowski],1,0),IF($D67=Włoszczowski[[#Headers],[Włoszczowski]],VLOOKUP($E67,Włoszczowski[Włoszczowski],1,0),\"\")))))))))))))","v":"Imielno"}]
[null,null,null,"jędrzejowski","Jędrzejów","gmina Jędrzejów",2602023,"GM-W",{"$f":"VLOOKUP($F68,'DANE - K1 lit.A'!$D$7:$M$120,4,0)","v":"TAK"},{"$f":"VLOOKUP($F68,'DANE - K1 lit.A'!$D$7:$M$120,5,0)","v":"TAK"},{"$f":"VLOOKUP($F68,'DANE - K1 lit.A'!$D$7:$M$120,6,0)","v":"TAK"},{"$f":"IF($E68=\"\",\"\",VLOOKUP($F68,'DANE - K4 lit.B'!$D$6:$E$107,2,0))","v":"TAK"},{"$f":"IF($E68=\"\",\"\",VLOOKUP($F68,'DANE - K2 lit.C'!$B$14:$I$114,8,0))","v":"w przedziale od 30 do 50 minut"},null,null,{"$f":"IF($D68=Buski[[#Headers],[Buski]],VLOOKUP($E68,Buski[Buski],1,0),IF($D68=Jędrzejowski[[#Headers],[Jędrzejowski]],VLOOKUP($E68,Jędrzejowski[Jędrzejowski],1,0),IF($D68=Kazimierski[[#Headers],[Kazimierski]],VLOOKUP($E68,Kazimierski[Kazimierski],1,0),IF($D68=Kielecki[[#Headers],[Kielecki]],VLOOKUP($E68,Kielecki[Kielecki],1,0),IF($D68=Konecki[[#Headers],[Konecki]],VLOOKUP($E68,Konecki[Konecki],1,0),IF($D68=Opatowski[[#Headers],[Opatowski]],VLOOKUP($E68,Opatowski[Opatowski],1,0),IF($D68=Ostrowiecki[[#Headers],[Ostrowiecki]],VLOOKUP($E68,Ostrowiecki[Ostrowiecki],1,0),IF($D68=Pińczowski[[#Headers],[Pińczowski]],VLOOKUP($E68,Pińczowski[Pińczowski],1,0),IF($D68=Sandomierski[[#Headers],[Sandomierski]],VLOOKUP($E68,Sandomierski[Sandomierski],1,0),IF($D68=Skarżyski[[#Headers],[Skarżyski]],VLOOKUP($E68,Skarżyski[Skarżyski],1,0),IF($D68=Starachowicki[[#Headers],[Starachowicki]],VLOOKUP($E68,Starachowicki[Starachowicki],1,0),IF($D68=Staszowski[[#Headers],[Staszowski]],VLOOKUP($E68,Staszowski[Staszowski],1,0),IF($D68=Włoszczowski[[#Headers],[Włoszczowski]],VLOOKUP($E68,Włoszczowski[Włoszczowski],1,0),\"\")))))))))))))","v":"Jędrzejów"}]
[null,null,null,"jędrzejowski","Małogoszcz","gmina Małogoszcz",2602033,"GM-W",{"$f":"VLOOKUP($F69,'DANE - K1 lit.A'!$D$7:$M$120,4,0)","v":"TAK"},{"$f":"VLOOKUP($F69,'DANE - K1 lit.A'!$D$7:$M$120,5,0)","v":"TAK"},{"$f":"VLOOKUP($F69,'DANE - K1 lit.A'!$D$7:$M$120,6,0)","v":"TAK"},{"$f":"IF($E69=\"\",\"\",VLOOKUP($F69,'DANE - K4 lit.B'!$D$6:$E$107,2,0))","v":"NIE"},{"$f":"IF($E69=\"\",\"\",VLOOKUP($F69,'DANE - K2 lit.C'!$B$14:$I$114,8,0))","v":"w przedziale od 30 do 50 minut"},null,null,{"$f":"IF($D69=Buski[[#Headers],[Buski]],VLOOKUP($E69,Buski[Buski],1,0),IF($D69=Jędrzejowski[[#Headers],[Jędrzejowski]],VLOOKUP($E69,Jędrzejowski[Jędrzejowski],1,0),IF($D69=Kazimierski[[#Headers],[Kazimierski]],VLOOKUP($E69,Kazimierski[Kazimierski],1,0),IF($D69=Kielecki[[#Headers],[Kielecki]],VLOOKUP($E69,Kielecki[Kielecki],1,0),IF($D69=Konecki[[#Headers],[Konecki]],VLOOKUP($E69,Konecki[Konecki],1,0),IF($D69=Opatowski[[#Headers],[Opatowski]],VLOOKUP($E69,Opatowski[Opatowski],1,0),IF($D69=Ostrowiecki[[#Headers],[Ostrowiecki]],VLOOKUP($E69,Ostrowiecki[Ostrowiecki],1,0),IF($D69=Pińczowski[[#Headers],[Pińczowski]],VLOOKUP($E69,Pińczowski[Pińczowski],1,0),IF($D69=Sandomierski[[#Headers],[Sandomierski]],VLOOKUP($E69,Sandomierski[Sandomierski],1,0),IF($D69=Skarżyski[[#Headers],[Skarżyski]],VLOOKUP($E69,Skarżyski[Skarżyski],1,0),IF($D69=Starachowicki[[#Headers],[Starachowicki]],VLOOKUP($E69,Starachowicki[Starachowicki],1,0),IF($D69=Staszowski[[#Headers],[Staszowski]],VLOOKUP($E69,Staszowski[Staszowski],1,0),IF($D69=Włoszczowski[[#Headers],[Włoszczowski]],VLOOKUP($E69,Włoszczowski[Włoszczowski],1,0),\"\")))))))))))))","v":"Małogoszcz"}]
[null,null,null,"jędrzejowski","Nagłowice","gmina Nagłowice",2602042,"GW",{"$f":"VLOOKUP($F70,'DANE - K1 lit.A'!$D$7:$M$120,4,0)","v":"NIE"},{"$f":"VLOOKUP($F70,'DANE - K1 lit.A'!$D$7:$M$120,5,0)","v":"TAK"},{"$f":"VLOOKUP($F70,'DANE - K1 lit.A'!$D$7:$M$120,6,0)","v":"NIE"},{"$f":"IF($E70=\"\",\"\",VLOOKUP($F70,'DANE - K4 lit.B'!$D$6:$E$107,2,0))","v":"NIE"},{"$f":"IF($E70=\"\",\"\",VLOOKUP($F70,'DANE - K2 lit.C'!$B$14:$I$114,8,0))","v":"w przedziale od 30 do 50 minut"},null,null,{"$f":"IF($D70=Buski[[#Headers],[Buski]],VLOOKUP($E70,Buski[Buski],1,0),IF($D70=Jędrzejowski[[#Headers],[Jędrzejowski]],VLOOKUP($E70,Jędrzejowski[Jędrzejowski],1,0),IF($D70=Kazimierski[[#Headers],[Kazimierski]],VLOOKUP($E70,Kazimierski[Kazimierski],1,0),IF($D70=Kielecki[[#Headers],[Kielecki]],VLOOKUP($E70,Kielecki[Kielecki],1,0),IF($D70=Konecki[[#Headers],[Konecki]],VLOOKUP($E70,Konecki[Konecki],1,0),IF($D70=Opatowski[[#Headers],[Opatowski]],VLOOKUP($E70,Opatowski[Opatowski],1,0),IF($D70=Ostrowiecki[[#Headers],[Ostrowiecki]],VLOOKUP($E70,Ostrowiecki[Ostrowiecki],1,0),IF($D70=Pińczowski[[#Headers],[Pińczowski]],VLOOKUP($E70,Pińczowski[Pińczowski],1,0),IF($D70=Sandomierski[[#Headers],[Sandomierski]],VLOOKUP($E70,Sandomierski[Sandomierski],1,0),IF($D70=Skarżyski[[#Headers],[Skarżyski]],VLOOKUP($E70,Skarżyski[Skarżyski],1,0),IF($D70=Starachowicki[[#Headers],[Starachowicki]],VLOOKUP($E70,Starachowicki[Starachowicki],1,0),IF($D70=Staszowski[[#Headers],[Staszowski]],VLOOKUP($E70,Staszowski[Staszowski],1,0),IF($D70=Włoszczowski[[#Headers],[Włoszczowski]],VLOOKUP($E70,Włoszczowski[Włoszczowski],1,0),\"\")))))))))))))","v":"Nagłowice"}]
[null,null,null,"jędrzejowski","Oksa","gmina Oksa",2602052,"GW",{"$f":"VLOOKUP($F71,'DANE - K1 lit.A'!$D$7:$M$120,4,0)","v":"NIE"},{"$f":"VLOOKUP($F71,'DANE - K1 lit.A'!$D$7:$M$120,5,0)","v":"NIE"},{"$f":"VLOOKUP($F71,'DANE - K1 lit.A'!$D$7:$M$120,6,0)","v":"NIE"},{"$f":"IF($E71=\"\",\"\",VLOOKUP($F71,'DANE - K4 lit.B'!$D$6:$E$107,2,0))","v":"NIE"},{"$f":"IF($E71=\"\",\"\",VLOOKUP($F71,'DANE - K2 lit.C'!$B$14:$I$114,8,0))","v":"w przedziale od 30 do 50 minut"},null,null,{"$f":"IF($D71=Buski[[#Headers],[Buski]],VLOOKUP($E71,Buski[Buski],1,0),IF($D71=Jędrzejowski[[#Headers],[Jędrzejowski]],VLOOKUP($E71,Jędrzejowski[Jędrzejowski],1,0),IF($D71=Kazimierski[[#Headers],[Kazimierski]],VLOOKUP($E71,Kazimierski[Kazimierski],1,0),IF($D71=Kielecki[[#Headers],[Kielecki]],VLOOKUP($E71,Kielecki[Kielecki],1,0),IF($D71=Konecki[[#Headers],[Konecki]],VLOOKUP($E71,Konecki[Konecki],1,0),IF($D71=Opatowski[[#Headers],[Opatowski]],VLOOKUP($E71,Opatowski[Opatowski],1,0),IF($D71=Ostrowiecki[[#Headers],[Ostrowiecki]],VLOOKUP($E71,Ostrowiecki[Ostrowiecki],1,0),IF($D71=Pińczowski[[#Headers],[Pińczowski]],VLOOKUP($E71,Pińczowski[Pińczowski],1,0),IF($D71=Sandomierski[[#Headers],[Sandomierski]],VLOOKUP($E71,Sandomierski[Sandomierski],1,0),IF($D71=Skarżyski[[#Headers],[Skarżyski]],VLOOKUP($E71,Skarżyski[Skarżyski],1,0),IF($D71=Starachowicki[[#Headers],[Starachowicki]],VLOOKUP($E71,Starachowicki[Starachowicki],1,0),IF($D71=Staszowski[[#Headers],[Staszowski]],VLOOKUP($E71,Staszowski[Staszowski],1,0),IF($D71=Włoszczowski[[#Headers],[Włoszczowski]],VLOOKUP($E71,Włoszczowski[Włoszczowski],1,0),\"\")))))))))))))","v":"Oksa"}]
[null,null,null,"jędrzejowski","Sędziszów","gmina Sędziszów",2602063,"GM-W",{"$f":"VLOOKUP($F72,'DANE - K1 lit.A'!$D$7:$M$120,4,0)","v":"TAK"},{"$f":"VLOOKUP($F72,'DANE - K1 lit.A'!$D$7:$M$120,5,0)","v":"TAK"},{"$f":"VLOOKUP($F72,'DANE - K1 lit.A'!$D$7:$M$120,6,0)","v":"TAK"},{"$f":"IF($E72=\"\",\"\",VLOOKUP($F72,'DANE - K4 lit.B'!$D$6:$E$107,2,0))","v":"NIE"},{"$f":"IF($E72=\"\",\"\",VLOOKUP($F72,'DANE - K2 lit.C'!$B$14:$I$114,8,0))","v":"większy niż 50 minut"},null,null,{"$f":"IF($D72=Buski[[#Headers],[Buski]],VLOOKUP($E72,Buski[Buski],1,0),IF($D72=Jędrzejowski[[#Headers],[Jędrzejowski]],VLOOKUP($E72,Jędrzejowski[Jędrzejowski],1,0),IF($D72=Kazimierski[[#Headers],[Kazimierski]],VLOOKUP($E72,Kazimierski[Kazimierski],1,0),IF($D72=Kielecki[[#Headers],[Kielecki]],VLOOKUP($E72,Kielecki[Kielecki],1,0),IF($D72=Konecki[[#Headers],[Konecki]],VLOOKUP($E72,Konecki[Konecki],1,0),IF($D72=Opatowski[[#Headers],[Opatowski]],VLOOKUP($E72,Opatowski[Opatowski],1,0),IF($D72=Ostrowiecki[[#Headers],[Ostrowiecki]],VLOOKUP($E72,Ostrowiecki[Ostrowiecki],1,0),IF($D72=Pińczowski[[#Headers],[Pińczowski]],VLOOKUP($E72,Pińczowski[Pińczowski],1,0),IF($D72=Sandomierski[[#Headers],[Sandomierski]],VLOOKUP($E72,Sandomierski[Sandomierski],1,0),IF($D72=Skarżyski[[#Headers],[Skarżyski]],VLOOKUP($E72,Skarżyski[Skarżyski],1,0),IF($D72=Starachowicki[[#Headers],[Starachowicki]],VLOOKUP($E72,Starachowicki[Starachowicki],1,0),IF($D72=Staszowski[[#Headers],[Staszowski]],VLOOKUP($E72,Staszowski[Staszowski],1,0),IF($D72=Włoszczowski[[#Headers],[Włoszczowski]],VLOOKUP($E72,Włoszczowski[Włoszczowski],1,0),\"\")))))))))))))","v":"Sędziszów"}]
[null,null,null,"jędrzejowski","Słupia Jędrzejowska","gmina Słupia Jędrzejowska",2602072,"GW",{"$f":"VLOOKUP($F73,'DANE - K1 lit.A'!$D$7:$M$120,4,0)","v":"NIE"},{"$f":"VLOOKUP($F73,'DANE - K1 lit.A'!$D$7:$M$120,5,0)","v":"NIE"},{"$f":"VLOOKUP($F73,'DANE - K1 lit.A'!$D$7:$M$120,6,0)","v":"NIE"},{"$f":"IF($E73=\"\",\"\",VLOOKUP($F73,'DANE - K4 lit.B'!$D$6:$E$107,2,0))","v":"NIE"},{"$f":"IF($E73=\"\",\"\",VLOOKUP($F73,'DANE - K2 lit.C'!$B$14:$I$114,8,0))","v":"większy niż 50 minut"},null,null,{"$f":"IF($D73=Buski[[#Headers],[Buski]],VLOOKUP($E73,Buski[Buski],1,0),IF($D73=Jędrzejowski[[#Headers],[Jędrzejowski]],VLOOKUP($E73,Jędrzejowski[Jędrzejowski],1,0),IF($D73=Kazimierski[[#Headers],[Kazimierski]],VLOOKUP($E73,Kazimierski[Kazimierski],1,0),IF($D73=Kielecki[[#Headers],[Kielecki]],VLOOKUP($E73,Kielecki[Kielecki],1,0),IF($D73=Konecki[[#Headers],[Konecki]],VLOOKUP($E73,Konecki[Konecki],1,0),IF($D73=Opatowski[[#Headers],[Opatowski]],VLOOKUP($E73,Opatowski[Opatowski],1,0),IF($D73=Ostrowiecki[[#Headers],[Ostrowiecki]],VLOOKUP($E73,Ostrowiecki[Ostrowiecki],1,0),IF($D73=Pińczowski[[#Headers],[Pińczowski]],VLOOKUP($E73,Pińczowski[Pińczowski],1,0),IF($D73=Sandomierski[[#Headers],[Sandomierski]],VLOOKUP($E73,Sandomierski[Sandomierski],1,0),IF($D73=Skarżyski[[#Headers],[Skarżyski]],VLOOKUP($E73,Skarżyski[Skarżyski],1,0),IF($D73=Starachowicki[[#Headers],[Starachowicki]],VLOOKUP($E73,Starachowicki[Starachowicki],1,0),IF($D73=Staszowski[[#Headers],[Staszowski]],VLOOKUP($E73,Staszowski[Staszowski],1,0),IF($D73=Włoszczowski[[#Headers],[Włoszczowski]],VLOOKUP($E73,Włoszczowski[Włoszczowski],1,0),\"\")))))))))))))","v":"Słupia Jędrzejowska"}]
[null,null,null,"jędrzejowski","Sobków","gmina Sobków",2602082,"GW",{"$f":"VLOOKUP($F74,'DANE - K1 lit.A'!$D$7:$M$120,4,0)","v":"NIE"},{"$f":"VLOOKUP($F74,'DANE - K1 lit.A'!$D$7:$M$120,5,0)","v":"TAK"},{"$f":"VLOOKUP($F74,'DANE - K1 lit.A'!$D$7:$M$120,6,0)","v":"NIE"},{"$f":"IF($E74=\"\",\"\",VLOOKUP($F74,'DANE - K4 lit.B'!$D$6:$E$107,2,0))","v":"NIE"},{"$f":"IF($E74=\"\",\"\",VLOOKUP($F74,'DANE - K2 lit.C'!$B$14:$I$114,8,0))","v":"mniejszy niż 30 minut"},null,null,{"$f":"IF($D74=Buski[[#Headers],[Buski]],VLOOKUP($E74,Buski[Buski],1,0),IF($D74=Jędrzejowski[[#Headers],[Jędrzejowski]],VLOOKUP($E74,Jędrzejowski[Jędrzejowski],1,0),IF($D74=Kazimierski[[#Headers],[Kazimierski]],VLOOKUP($E74,Kazimierski[Kazimierski],1,0),IF($D74=Kielecki[[#Headers],[Kielecki]],VLOOKUP($E74,Kielecki[Kielecki],1,0),IF($D74=Konecki[[#Headers],[Konecki]],VLOOKUP($E74,Konecki[Konecki],1,0),IF($D74=Opatowski[[#Headers],[Opatowski]],VLOOKUP($E74,Opatowski[Opatowski],1,0),IF($D74=Ostrowiecki[[#Headers],[Ostrowiecki]],VLOOKUP($E74,Ostrowiecki[Ostrowiecki],1,0),IF($D74=Pińczowski[[#Headers],[Pińczowski]],VLOOKUP($E74,Pińczowski[Pińczowski],1,0),IF($D74=Sandomierski[[#Headers],[Sandomierski]],VLOOKUP($E74,Sandomierski[Sandomierski],1,0),IF($D74=Skarżyski[[#Headers],[Skarżyski]],VLOOKUP($E74,Skarżyski[Skarżyski],1,0),IF($D74=Starachowicki[[#Headers],[Starachowicki]],VLOOKUP($E74,Starachowicki[Starachowicki],1,0),IF($D74=Staszowski[[#Headers],[Staszowski]],VLOOKUP($E74,Staszowski[Staszowski],1,0),IF($D74=Włoszczowski[[#Headers],[Włoszczowski]],VLOOKUP($E74,Włoszczowski[Włoszczowski],1,0),\"\")))))))))))))","v":"Sobków"}]
[null,null,null,"jędrzejowski","Wodzisław","gmina Wodzisław",2602093,"GM-W",{"$f":"VLOOKUP($F75,'DANE - K1 lit.A'!$D$7:$M$120,4,0)","v":"NIE"},{"$f":"VLOOKUP($F75,'DANE - K1 lit.A'!$D$7:$M$120,5,0)","v":"NIE"},{"$f":"VLOOKUP($F75,'DANE - K1 lit.A'!$D$7:$M$120,6,0)","v":"NIE"},{"$f":"IF($E75=\"\",\"\",VLOOKUP($F75,'DANE - K4 lit.B'!$D$6:$E$107,2,0))","v":"NIE"},{"$f":"IF($E75=\"\",\"\",VLOOKUP($F75,'DANE - K2 lit.C'!$B$14:$I$114,8,0))","v":"w przedziale od 30 do 50 minut"},null,null,{"$f":"IF($D75=Buski[[#Headers],[Buski]],VLOOKUP($E75,Buski[Buski],1,0),IF($D75=Jędrzejowski[[#Headers],[Jędrzejowski]],VLOOKUP($E75,Jędrzejowski[Jędrzejowski],1,0),IF($D75=Kazimierski[[#Headers],[Kazimierski]],VLOOKUP($E75,Kazimierski[Kazimierski],1,0),IF($D75=Kielecki[[#Headers],[Kielecki]],VLOOKUP($E75,Kielecki[Kielecki],1,0),IF($D75=Konecki[[#Headers],[Konecki]],VLOOKUP($E75,Konecki[Konecki],1,0),IF($D75=Opatowski[[#Headers],[Opatowski]],VLOOKUP($E75,Opatowski[Opatowski],1,0),IF($D75=Ostrowiecki[[#Headers],[Ostrowiecki]],VLOOKUP($E75,Ostrowiecki[Ostrowiecki],1,0),IF($D75=Pińczowski[[#Headers],[Pińczowski]],VLOOKUP($E75,Pińczowski[Pińczowski],1,0),IF($D75=Sandomierski[[#Headers],[Sandomierski]],VLOOKUP($E75,Sandomierski[Sandomierski],1,0),IF($D75=Skarżyski[[#Headers],[Skarżyski]],VLOOKUP($E75,Skarżyski[Skarżyski],1,0),IF($D75=Starachowicki[[#Headers],[Starachowicki]],VLOOKUP($E75,Starachowicki[Starachowicki],1,0),IF($D75=Staszowski[[#Headers],[Staszowski]],VLOOKUP($E75,Staszowski[Staszowski],1,0),IF($D75=Włoszczowski[[#Headers],[Włoszczowski]],VLOOKUP($E75,Włoszczowski[Włoszczowski],1,0),\"\")))))))))))))","v":"Wodzisław"}]
[null,null,null,"kazimierski","Bejsce","gmina Bejsce",2603012,"GW",{"$f":"VLOOKUP($F76,'DANE - K1 lit.A'!$D$7:$M$120,4,0)","v":"NIE"},{"$f":"VLOOKUP($F76,'DANE - K1 lit.A'!$D$7:$M$120,5,0)","v":"NIE"},{"$f":"VLOOKUP($F76,'DANE - K1 lit.A'!$D$7:$M$120,6,0)","v":"NIE"},{"$f":"IF($E76=\"\",\"\",VLOOKUP($F76,'DANE - K4 lit.B'!$D$6:$E$107,2,0))","v":"NIE"},{"$f":"IF($E76=\"\",\"\",VLOOKUP($F76,'DANE - K2 lit.C'!$B$14:$I$114,8,0))","v":"w przedziale od 30 do 50 minut"},null,null,{"$f":"IF($D76=Buski[[#Headers],[Buski]],VLOOKUP($E76,Buski[Buski],1,0),IF($D76=Jędrzejowski[[#Headers],[Jędrzejowski]],VLOOKUP($E76,Jędrzejowski[Jędrzejowski],1,0),IF($D76=Kazimierski[[#Headers],[Kazimierski]],VLOOKUP($E76,Kazimierski[Kazimierski],1,0),IF($D76=Kielecki[[#Headers],[Kielecki]],VLOOKUP($E76,Kielecki[Kielecki],1,0),IF($D76=Konecki[[#Headers],[Konecki]],VLOOKUP($E76,Konecki[Konecki],1,0),IF($D76=Opatowski[[#Headers],[Opatowski]],VLOOKUP($E76,Opatowski[Opatowski],1,0),IF($D76=Ostrowiecki[[#Headers],[Ostrowiecki]],VLOOKUP($E76,Ostrowiecki[Ostrowiecki],1,0),IF($D76=Pińczowski[[#Headers],[Pińczowski]],VLOOKUP($E76,Pińczowski[Pińczowski],1,0),IF($D76=Sandomierski[[#Headers],[Sandomierski]],VLOOKUP($E76,Sandomierski[Sandomierski],1,0),IF($D76=Skarżyski[[#Headers],[Skarżyski]],VLOOKUP($E76,Skarżyski[Skarżyski],1,0),IF($D76=Starachowicki[[#Headers],[Starachowicki]],VLOOKUP($E76,Starachowicki[Starachowicki],1,0),IF($D76=Staszowski[[#Headers],[Staszowski]],VLOOKUP($E76,Staszowski[Staszowski],1,0),IF($D76=Włoszczowski[[#Headers],[Włoszczowski]],VLOOKUP($E76,Włoszczowski[Włoszczowski],1,0),\"\")))))))))))))","v":"Bejsce"}]
[null,null,null,"kazimierski","Czarnocin","gmina Czarnocin",2603022,"GW",{"$f":"VLOOKUP($F77,'DANE - K1 lit.A'!$D$7:$M$120,4,0)","v":"NIE"},{"$f":"VLOOKUP($F77,'DANE - K1 lit.A'!$D$7:$M$120,5,0)","v":"NIE"},{"$f":"VLOOKUP($F77,'DANE - K1 lit.A'!$D$7:$M$120,6,0)","v":"NIE"},{"$f":"IF($E77=\"\",\"\",VLOOKUP($F77,'DANE - K4 lit.B'!$D$6:$E$107,2,0))","v":"NIE"},{"$f":"IF($E77=\"\",\"\",VLOOKUP($F77,'DANE - K2 lit.C'!$B$14:$I$114,8,0))","v":"większy niż 50 minut"},null,null,{"$f":"IF($D77=Buski[[#Headers],[Buski]],VLOOKUP($E77,Buski[Buski],1,0),IF($D77=Jędrzejowski[[#Headers],[Jędrzejowski]],VLOOKUP($E77,Jędrzejowski[Jędrzejowski],1,0),IF($D77=Kazimierski[[#Headers],[Kazimierski]],VLOOKUP($E77,Kazimierski[Kazimierski],1,0),IF($D77=Kielecki[[#Headers],[Kielecki]],VLOOKUP($E77,Kielecki[Kielecki],1,0),IF($D77=Konecki[[#Headers],[Konecki]],VLOOKUP($E77,Konecki[Konecki],1,0),IF($D77=Opatowski[[#Headers],[Opatowski]],VLOOKUP($E77,Opatowski[Opatowski],1,0),IF($D77=Ostrowiecki[[#Headers],[Ostrowiecki]],VLOOKUP($E77,Ostrowiecki[Ostrowiecki],1,0),IF($D77=Pińczowski[[#Headers],[Pińczowski]],VLOOKUP($E77,Pińczowski[Pińczowski],1,0),IF($D77=Sandomierski[[#Headers],[Sandomierski]],VLOOKUP($E77,Sandomierski[Sandomierski],1,0),IF($D77=Skarżyski[[#Headers],[Skarżyski]],VLOOKUP($E77,Skarżyski[Skarżyski],1,0),IF($D77=Starachowicki[[#Headers],[Starachowicki]],VLOOKUP($E77,Starachowicki[Starachowicki],1,0),IF($D77=Staszowski[[#Headers],[Staszowski]],VLOOKUP($E77,Staszowski[Staszowski],1,0),IF($D77=Włoszczowski[[#Headers],[Włoszczowski]],VLOOKUP($E77,Włoszczowski[Włoszczowski],1,0),\"\")))))))))))))","v":"Czarnocin"}]
[null,null,null,"kazimierski","Kazimierza Wielka","gmina Kazimierza Wielka",2603033,"GM-W",{"$f":"VLOOKUP($F78,'DANE - K1 lit.A'!$D$7:$M$120,4,0)","v":"TAK"},{"$f":"VLOOKUP($F78,'DANE - K1 lit.A'!$D$7:$M$120,5,0)","v":"TAK"},{"$f":"VLOOKUP($F78,'DANE - K1 lit.A'!$D$7:$M$120,6,0)","v":"NIE"},{"$f":"IF($E78=\"\",\"\",VLOOKUP($F78,'DANE - K4 lit.B'!$D$6:$E$107,2,0))","v":"NIE"},{"$f":"IF($E78=\"\",\"\",VLOOKUP($F78,'DANE - K2 lit.C'!$B$14:$I$114,8,0))","v":"w przedziale od 30 do 50 minut"},null,null,{"$f":"IF($D78=Buski[[#Headers],[Buski]],VLOOKUP($E78,Buski[Buski],1,0),IF($D78=Jędrzejowski[[#Headers],[Jędrzejowski]],VLOOKUP($E78,Jędrzejowski[Jędrzejowski],1,0),IF($D78=Kazimierski[[#Headers],[Kazimierski]],VLOOKUP($E78,Kazimierski[Kazimierski],1,0),IF($D78=Kielecki[[#Headers],[Kielecki]],VLOOKUP($E78,Kielecki[Kielecki],1,0),IF($D78=Konecki[[#Headers],[Konecki]],VLOOKUP($E78,Konecki[Konecki],1,0),IF($D78=Opatowski[[#Headers],[Opatowski]],VLOOKUP($E78,Opatowski[Opatowski],1,0),IF($D78=Ostrowiecki[[#Headers],[Ostrowiecki]],VLOOKUP($E78,Ostrowiecki[Ostrowiecki],1,0),IF($D78=Pińczowski[[#Headers],[Pińczowski]],VLOOKUP($E78,Pińczowski[Pińczowski],1,0),IF($D78=Sandomierski[[#Headers],[Sandomierski]],VLOOKUP($E78,Sandomierski[Sandomierski],1,0),IF($D78=Skarżyski[[#Headers],[Skarżyski]],VLOOKUP($E78,Skarżyski[Skarżyski],1,0),IF($D78=Starachowicki[[#Headers],[Starachowicki]],VLOOKUP($E78,Starachowicki[Starachowicki],1,0),IF($D78=Staszowski[[#Headers],[Staszowski]],VLOOKUP($E78,Staszowski[Staszowski],1,0),IF($D78=Włoszczowski[[#Headers],[Włoszczowski]],VLOOKUP($E78,Włoszczowski[Włoszczowski],1,0),\"\")))))))))))))","v":"Kazimierza Wielka"}]
[null,null,null,"kazimierski","Opatowiec","gmina Opatowiec",2603043,"GM-W",{"$f":"VLOOKUP($F79,'DANE - K1 lit.A'!$D$7:$M$120,4,0)","v":"NIE"},{"$f":"VLOOKUP($F79,'DANE - K1 lit.A'!$D$7:$M$120,5,0)","v":"NIE"},{"$f":"VLOOKUP($F79,'DANE - K1 lit.A'!$D$7:$M$120,6,0)","v":"NIE"},{"$f":"IF($E79=\"\",\"\",VLOOKUP($F79,'DANE - K4 lit.B'!$D$6:$E$107,2,0))","v":"NIE"},{"$f":"IF($E79=\"\",\"\",VLOOKUP($F79,'DANE - K2 lit.C'!$B$14:$I$114,8,0))","v":"większy niż 50 minut"},null,null,{"$f":"IF($D79=Buski[[#Headers],[Buski]],VLOOKUP($E79,Buski[Buski],1,0),IF($D79=Jędrzejowski[[#Headers],[Jędrzejowski]],VLOOKUP($E79,Jędrzejowski[Jędrzejowski],1,0),IF($D79=Kazimierski[[#Headers],[Kazimierski]],VLOOKUP($E79,Kazimierski[Kazimierski],1,0),IF($D79=Kielecki[[#Headers],[Kielecki]],VLOOKUP($E79,Kielecki[Kielecki],1,0),IF($D79=Konecki[[#Headers],[Konecki]],VLOOKUP($E79,Konecki[Konecki],1,0),IF($D79=Opatowski[[#Headers],[Opatowski]],VLOOKUP($E79,Opatowski[Opatowski],1,0),IF($D79=Ostrowiecki[[#Headers],[Ostrowiecki]],VLOOKUP($E79,Ostrowiecki[Ostrowiecki],1,0),IF($D79=Pińczowski[[#Headers],[Pińczowski]],VLOOKUP($E79,Pińczowski[Pińczowski],1,0),IF($D79=Sandomierski[[#Headers],[Sandomierski]],VLOOKUP($E79,Sandomierski[Sandomierski],1,0),IF($D79=Skarżyski[[#Headers],[Skarżyski]],VLOOKUP($E79,Skarżyski[Skarżyski],1,0),IF($D79=Starachowicki[[#Headers],[Starachowicki]],VLOOKUP($E79,Starachowicki[Starachowicki],1,0),IF($D79=Staszowski[[#Headers],[Staszowski]],VLOOKUP($E79,Staszowski[Staszowski],1,0),IF($D79=Włoszczowski[[#Headers],[Włoszczowski]],VLOOKUP($E79,Włoszczowski[Włoszczowski],1,0),\"\")))))))))))))","v":"Opatowiec"}]
[null,null,null,"kazimierski","Skalbmierz","gmina Skalbmierz",2603053,"GM-W",{"$f":"VLOOKUP($F80,'DANE - K1 lit.A'!$D$7:$M$120,4,0)","v":"NIE"},{"$f":"VLOOKUP($F80,'DANE - K1 lit.A'!$D$7:$M$120,5,0)","v":"NIE"},{"$f":"VLOOKUP($F80,'DANE - K1 lit.A'!$D$7:$M$120,6,0)","v":"NIE"},{"$f":"IF($E80=\"\",\"\",VLOOKUP($F80,'DANE - K4 lit.B'!$D$6:$E$107,2,0))","v":"NIE"},{"$f":"IF($E80=\"\",\"\",VLOOKUP($F80,'DANE - K2 lit.C'!$B$14:$I$114,8,0))","v":"w przedziale od 30 do 50 minut"},null,null,{"$f":"IF($D80=Buski[[#Headers],[Buski]],VLOOKUP($E80,Buski[Buski],1,0),IF($D80=Jędrzejowski[[#Headers],[Jędrzejowski]],VLOOKUP($E80,Jędrzejowski[Jędrzejowski],1,0),IF($D80=Kazimierski[[#Headers],[Kazimierski]],VLOOKUP($E80,Kazimierski[Kazimierski],1,0),IF($D80=Kielecki[[#Headers],[Kielecki]],VLOOKUP($E80,Kielecki[Kielecki],1,0),IF($D80=Konecki[[#Headers],[Konecki]],VLOOKUP($E80,Konecki[Konecki],1,0),IF($D80=Opatowski[[#Headers],[Opatowski]],VLOOKUP($E80,Opatowski[Opatowski],1,0),IF($D80=Ostrowiecki[[#Headers],[Ostrowiecki]],VLOOKUP($E80,Ostrowiecki[Ostrowiecki],1,0),IF($D80=Pińczowski[[#Headers],[Pińczowski]],VLOOKUP($E80,Pińczowski[Pińczowski],1,0),IF($D80=Sandomierski[[#Headers],[Sandomierski]],VLOOKUP($E80,Sandomierski[Sandomierski],1,0),IF($D80=Skarżyski[[#Headers],[Skarżyski]],VLOOKUP($E80,Skarżyski[Skarżyski],1,0),IF($D80=Starachowicki[[#Headers],[Starachowicki]],VLOOKUP($E80,Starachowicki[Starachowicki],1,0),IF($D80=Staszowski[[#Headers],[Staszowski]],VLOOKUP($E80,Staszowski[Staszowski],1,0),IF($D80=Włoszczowski[[#Headers],[Włoszczowski]],VLOOKUP($E80,Włoszczowski[Włoszczowski],1,0),\"\")))))))))))))","v":"Skalbmierz"}]
[null,null,null,"kielecki","Bieliny","gmina Bieliny",2604012,"GW",{"$f":"VLOOKUP($F81,'DANE - K1 lit.A'!$D$7:$M$120,4,0)","v":"NIE"},{"$f":"VLOOKUP($F81,'DANE - K1 lit.A'!$D$7:$M$120,5,0)","v":"TAK"},{"$f":"VLOOKUP($F81,'DANE - K1 lit.A'!$D$7:$M$120,6,0)","v":"NIE"},{"$f":"IF($E81=\"\",\"\",VLOOKUP($F81,'DANE - K4 lit.B'!$D$6:$E$107,2,0))","v":"NIE"},{"$f":"IF($E81=\"\",\"\",VLOOKUP($F81,'DANE - K2 lit.C'!$B$14:$I$114,8,0))","v":"w przedziale od 30 do 50 minut"},null,null,{"$f":"IF($D81=Buski[[#Headers],[Buski]],VLOOKUP($E81,Buski[Buski],1,0),IF($D81=Jędrzejowski[[#Headers],[Jędrzejowski]],VLOOKUP($E81,Jędrzejowski[Jędrzejowski],1,0),IF($D81=Kazimierski[[#Headers],[Kazimierski]],VLOOKUP($E81,Kazimierski[Kazimierski],1,0),IF($D81=Kielecki[[#Headers],[Kielecki]],VLOOKUP($E81,Kielecki[Kielecki],1,0),IF($D81=Konecki[[#Headers],[Konecki]],VLOOKUP($E81,Konecki[Konecki],1,0),IF($D81=Opatowski[[#Headers],[Opatowski]],VLOOKUP($E81,Opatowski[Opatowski],1,0),IF($D81=Ostrowiecki[[#Headers],[Ostrowiecki]],VLOOKUP($E81,Ostrowiecki[Ostrowiecki],1,0),IF($D81=Pińczowski[[#Headers],[Pińczowski]],VLOOKUP($E81,Pińczowski[Pińczowski],1,0),IF($D81=Sandomierski[[#Headers],[Sandomierski]],VLOOKUP($E81,Sandomierski[Sandomierski],1,0),IF($D81=Skarżyski[[#Headers],[Skarżyski]],VLOOKUP($E81,Skarżyski[Skarżyski],1,0),IF($D81=Starachowicki[[#Headers],[Starachowicki]],VLOOKUP($E81,Starachowicki[Starachowicki],1,0),IF($D81=Staszowski[[#Headers],[Staszowski]],VLOOKUP($E81,Staszowski[Staszowski],1,0),IF($D81=Włoszczowski[[#Headers],[Włoszczowski]],VLOOKUP($E81,Włoszczowski[Włoszczowski],1,0),\"\")))))))))))))","v":"Bieliny"}]
[null,null,null,"kielecki","Bodzentyn","gmina Bodzentyn",2604023,"GM-W",{"$f":"VLOOKUP($F82,'DANE - K1 lit.A'!$D$7:$M$120,4,0)","v":"NIE"},{"$f":"VLOOKUP($F82,'DANE - K1 lit.A'!$D$7:$M$120,5,0)","v":"TAK"},{"$f":"VLOOKUP($F82,'DANE - K1 lit.A'!$D$7:$M$120,6,0)","v":"TAK"},{"$f":"IF($E82=\"\",\"\",VLOOKUP($F82,'DANE - K4 lit.B'!$D$6:$E$107,2,0))","v":"NIE"},{"$f":"IF($E82=\"\",\"\",VLOOKUP($F82,'DANE - K2 lit.C'!$B$14:$I$114,8,0))","v":"w przedziale od 30 do 50 minut"},null,null,{"$f":"IF($D82=Buski[[#Headers],[Buski]],VLOOKUP($E82,Buski[Buski],1,0),IF($D82=Jędrzejowski[[#Headers],[Jędrzejowski]],VLOOKUP($E82,Jędrzejowski[Jędrzejowski],1,0),IF($D82=Kazimierski[[#Headers],[Kazimierski]],VLOOKUP($E82,Kazimierski[Kazimierski],1,0),IF($D82=Kielecki[[#Headers],[Kielecki]],VLOOKUP($E82,Kielecki[Kielecki],1,0),IF($D82=Konecki[[#Headers],[Konecki]],VLOOKUP($E82,Konecki[Konecki],1,0),IF($D82=Opatowski[[#Headers],[Opatowski]],VLOOKUP($E82,Opatowski[Opatowski],1,0),IF($D82=Ostrowiecki[[#Headers],[Ostrowiecki]],VLOOKUP($E82,Ostrowiecki[Ostrowiecki],1,0),IF($D82=Pińczowski[[#Headers],[Pińczowski]],VLOOKUP($E82,Pińczowski[Pińczowski],1,0),IF($D82=Sandomierski[[#Headers],[Sandomierski]],VLOOKUP($E82,Sandomierski[Sandomierski],1,0),IF($D82=Skarżyski[[#Headers],[Skarżyski]],VLOOKUP($E82,Skarżyski[Skarżyski],1,0),IF($D82=Starachowicki[[#Headers],[Starachowicki]],VLOOKUP($E82,Starachowicki[Starachowicki],1,0),IF($D82=Staszowski[[#Headers],[Staszowski]],VLOOKUP($E82,Staszowski[Staszowski],1,0),IF($D82=Włoszczowski[[#Headers],[Włoszczowski]],VLOOKUP($E82,Włoszczowski[Włoszczowski],1,0),\"\")))))))))))))","v":"Bodzentyn"}]
[null,null,null,"kielecki","Chęciny","gmina Chęciny",2604033,"GM-W",{"$f":"VLOOKUP($F83,'DANE - K1 lit.A'!$D$7:$M$120,4,0)","v":"TAK"},{"$f":"VLOOKUP($F83,'DANE - K1 lit.A'!$D$7:$M$120,5,0)","v":"TAK"},{"$f":"VLOOKUP($F83,'DANE - K1 lit.A'!$D$7:$M$120,6,0)","v":"NIE"},{"$f":"IF($E83=\"\",\"\",VLOOKUP($F83,'DANE - K4 lit.B'!$D$6:$E$107,2,0))","v":"NIE"},{"$f":"IF($E83=\"\",\"\",VLOOKUP($F83,'DANE - K2 lit.C'!$B$14:$I$114,8,0))","v":"mniejszy niż 30 minut"},null,null,{"$f":"IF($D83=Buski[[#Headers],[Buski]],VLOOKUP($E83,Buski[Buski],1,0),IF($D83=Jędrzejowski[[#Headers],[Jędrzejowski]],VLOOKUP($E83,Jędrzejowski[Jędrzejowski],1,0),IF($D83=Kazimierski[[#Headers],[Kazimierski]],VLOOKUP($E83,Kazimierski[Kazimierski],1,0),IF($D83=Kielecki[[#Headers],[Kielecki]],VLOOKUP($E83,Kielecki[Kielecki],1,0),IF($D83=Konecki[[#Headers],[Konecki]],VLOOKUP($E83,Konecki[Konecki],1,0),IF($D83=Opatowski[[#Headers],[Opatowski]],VLOOKUP($E83,Opatowski[Opatowski],1,0),IF($D83=Ostrowiecki[[#Headers],[Ostrowiecki]],VLOOKUP($E83,Ostrowiecki[Ostrowiecki],1,0),IF($D83=Pińczowski[[#Headers],[Pińczowski]],VLOOKUP($E83,Pińczowski[Pińczowski],1,0),IF($D83=Sandomierski[[#Headers],[Sandomierski]],VLOOKUP($E83,Sandomierski[Sandomierski],1,0),IF($D83=Skarżyski[[#Headers],[Skarżyski]],VLOOKUP($E83,Skarżyski[Skarżyski],1,0),IF($D83=Starachowicki[[#Headers],[Starachowicki]],VLOOKUP($E83,Starachowicki[Starachowicki],1,0),IF($D83=Staszowski[[#Headers],[Staszowski]],VLOOKUP($E83,Staszowski[Staszowski],1,0),IF($D83=Włoszczowski[[#Headers],[Włoszczowski]],VLOOKUP($E83,Włoszczowski[Włoszczowski],1,0),\"\")))))))))))))","v":"Chęciny"}]
[null,null,null,"kielecki","Chmielnik","gmina Chmielnik",2604043,"GM-W",{"$f":"VLOOKUP($F84,'DANE - K1 lit.A'!$D$7:$M$120,4,0)","v":"NIE"},{"$f":"VLOOKUP($F84,'DANE - K1 lit.A'!$D$7:$M$120,5,0)","v":"TAK"},{"$f":"VLOOKUP($F84,'DANE - K1 lit.A'!$D$7:$M$120,6,0)","v":"TAK"},{"$f":"IF($E84=\"\",\"\",VLOOKUP($F84,'DANE - K4 lit.B'!$D$6:$E$107,2,0))","v":"NIE"},{"$f":"IF($E84=\"\",\"\",VLOOKUP($F84,'DANE - K2 lit.C'!$B$14:$I$114,8,0))","v":"w przedziale od 30 do 50 minut"},null,null,{"$f":"IF($D84=Buski[[#Headers],[Buski]],VLOOKUP($E84,Buski[Buski],1,0),IF($D84=Jędrzejowski[[#Headers],[Jędrzejowski]],VLOOKUP($E84,Jędrzejowski[Jędrzejowski],1,0),IF($D84=Kazimierski[[#Headers],[Kazimierski]],VLOOKUP($E84,Kazimierski[Kazimierski],1,0),IF($D84=Kielecki[[#Headers],[Kielecki]],VLOOKUP($E84,Kielecki[Kielecki],1,0),IF($D84=Konecki[[#Headers],[Konecki]],VLOOKUP($E84,Konecki[Konecki],1,0),IF($D84=Opatowski[[#Headers],[Opatowski]],VLOOKUP($E84,Opatowski[Opatowski],1,0),IF($D84=Ostrowiecki[[#Headers],[Ostrowiecki]],VLOOKUP($E84,Ostrowiecki[Ostrowiecki],1,0),IF($D84=Pińczowski[[#Headers],[Pińczowski]],VLOOKUP($E84,Pińczowski[Pińczowski],1,0),IF($D84=Sandomierski[[#Headers],[Sandomierski]],VLOOKUP($E84,Sandomierski[Sandomierski],1,0),IF($D84=Skarżyski[[#Headers],[Skarżyski]],VLOOKUP($E84,Skarżyski[Skarżyski],1,0),IF($D84=Starachowicki[[#Headers],[Starachowicki]],VLOOKUP($E84,Starachowicki[Starachowicki],1,0),IF($D84=Staszowski[[#Headers],[Staszowski]],VLOOKUP($E84,Staszowski[Staszowski],1,0),IF($D84=Włoszczowski[[#Headers],[Włoszczowski]],VLOOKUP($E84,Włoszczowski[Włoszczowski],1,0),\"\")))))))))))))","v":"Chmielnik"}]
[null,null,null,"kielecki","Daleszyce","gmina Daleszyce",2604053,"GM-W",{"$f":"VLOOKUP($F85,'DANE - K1 lit.A'!$D$7:$M$120,4,0)","v":"NIE"},{"$f":"VLOOKUP($F85,'DANE - K1 lit.A'!$D$7:$M$120,5,0)","v":"TAK"},{"$f":"VLOOKUP($F85,'DANE - K1 lit.A'!$D$7:$M$120,6,0)","v":"NIE"},{"$f":"IF($E85=\"\",\"\",VLOOKUP($F85,'DANE - K4 lit.B'!$D$6:$E$107,2,0))","v":"NIE"},{"$f":"IF($E85=\"\",\"\",VLOOKUP($F85,'DANE - K2 lit.C'!$B$14:$I$114,8,0))","v":"w przedziale od 30 do 50 minut"},null,null,{"$f":"IF($D85=Buski[[#Headers],[Buski]],VLOOKUP($E85,Buski[Buski],1,0),IF($D85=Jędrzejowski[[#Headers],[Jędrzejowski]],VLOOKUP($E85,Jędrzejowski[Jędrzejowski],1,0),IF($D85=Kazimierski[[#Headers],[Kazimierski]],VLOOKUP($E85,Kazimierski[Kazimierski],1,0),IF($D85=Kielecki[[#Headers],[Kielecki]],VLOOKUP($E85,Kielecki[Kielecki],1,0),IF($D85=Konecki[[#Headers],[Konecki]],VLOOKUP($E85,Konecki[Konecki],1,0),IF($D85=Opatowski[[#Headers],[Opatowski]],VLOOKUP($E85,Opatowski[Opatowski],1,0),IF($D85=Ostrowiecki[[#Headers],[Ostrowiecki]],VLOOKUP($E85,Ostrowiecki[Ostrowiecki],1,0),IF($D85=Pińczowski[[#Headers],[Pińczowski]],VLOOKUP($E85,Pińczowski[Pińczowski],1,0),IF($D85=Sandomierski[[#Headers],[Sandomierski]],VLOOKUP($E85,Sandomierski[Sandomierski],1,0),IF($D85=Skarżyski[[#Headers],[Skarżyski]],VLOOKUP($E85,Skarżyski[Skarżyski],1,0),IF($D85=Starachowicki[[#Headers],[Starachowicki]],VLOOKUP($E85,Starachowicki[Starachowicki],1,0),IF($D85=Staszowski[[#Headers],[Staszowski]],VLOOKUP($E85,Staszowski[Staszowski],1,0),IF($D85=Włoszczowski[[#Headers],[Włoszczowski]],VLOOKUP($E85,Włoszczowski[Włoszczowski],1,0),\"\")))))))))))))","v":"Daleszyce"}]
[null,null,null,"kielecki","Górno","gmina Górno",2604062,"GW",{"$f":"VLOOKUP($F86,'DANE - K1 lit.A'!$D$7:$M$120,4,0)","v":"NIE"},{"$f":"VLOOKUP($F86,'DANE - K1 lit.A'!$D$7:$M$120,5,0)","v":"TAK"},{"$f":"VLOOKUP($F86,'DANE - K1 lit.A'!$D$7:$M$120,6,0)","v":"NIE"},{"$f":"IF($E86=\"\",\"\",VLOOKUP($F86,'DANE - K4 lit.B'!$D$6:$E$107,2,0))","v":"NIE"},{"$f":"IF($E86=\"\",\"\",VLOOKUP($F86,'DANE - K2 lit.C'!$B$14:$I$114,8,0))","v":"mniejszy niż 30 minut"},null,null,{"$f":"IF($D86=Buski[[#Headers],[Buski]],VLOOKUP($E86,Buski[Buski],1,0),IF($D86=Jędrzejowski[[#Headers],[Jędrzejowski]],VLOOKUP($E86,Jędrzejowski[Jędrzejowski],1,0),IF($D86=Kazimierski[[#Headers],[Kazimierski]],VLOOKUP($E86,Kazimierski[Kazimierski],1,0),IF($D86=Kielecki[[#Headers],[Kielecki]],VLOOKUP($E86,Kielecki[Kielecki],1,0),IF($D86=Konecki[[#Headers],[Konecki]],VLOOKUP($E86,Konecki[Konecki],1,0),IF($D86=Opatowski[[#Headers],[Opatowski]],VLOOKUP($E86,Opatowski[Opatowski],1,0),IF($D86=Ostrowiecki[[#Headers],[Ostrowiecki]],VLOOKUP($E86,Ostrowiecki[Ostrowiecki],1,0),IF($D86=Pińczowski[[#Headers],[Pińczowski]],VLOOKUP($E86,Pińczowski[Pińczowski],1,0),IF($D86=Sandomierski[[#Headers],[Sandomierski]],VLOOKUP($E86,Sandomierski[Sandomierski],1,0),IF($D86=Skarżyski[[#Headers],[Skarżyski]],VLOOKUP($E86,Skarżyski[Skarżyski],1,0),IF($D86=Starachowicki[[#Headers],[Starachowicki]],VLOOKUP($E86,Starachowicki[Starachowicki],1,0),IF($D86=Staszowski[[#Headers],[Staszowski]],VLOOKUP($E86,Staszowski[Staszowski],1,0),IF($D86=Włoszczowski[[#Headers],[Włoszczowski]],VLOOKUP($E86,Włoszczowski[Włoszczowski],1,0),\"\")))))))))))))","v":"Górno"}]
[null,null,null,"kielecki","Łagów","gmina Łagów",2604073,"GM-W",{"$f":"VLOOKUP($F87,'DANE - K1 lit.A'!$D$7:$M$120,4,0)","v":"NIE"},{"$f":"VLOOKUP($F87,'DANE - K1 lit.A'!$D$7:$M$120,5,0)","v":"NIE"},{"$f":"VLOOKUP($F87,'DANE - K1 lit.A'!$D$7:$M$120,6,0)","v":"NIE"},{"$f":"IF($E87=\"\",\"\",VLOOKUP($F87,'DANE - K4 lit.B'!$D$6:$E$107,2,0))","v":"NIE"},{"$f":"IF($E87=\"\",\"\",VLOOKUP($F87,'DANE - K2 lit.C'!$B$14:$I$114,8,0))","v":"w przedziale od 30 do 50 minut"},null,null,{"$f":"IF($D87=Buski[[#Headers],[Buski]],VLOOKUP($E87,Buski[Buski],1,0),IF($D87=Jędrzejowski[[#Headers],[Jędrzejowski]],VLOOKUP($E87,Jędrzejowski[Jędrzejowski],1,0),IF($D87=Kazimierski[[#Headers],[Kazimierski]],VLOOKUP($E87,Kazimierski[Kazimierski],1,0),IF($D87=Kielecki[[#Headers],[Kielecki]],VLOOKUP($E87,Kielecki[Kielecki],1,0),IF($D87=Konecki[[#Headers],[Konecki]],VLOOKUP($E87,Konecki[Konecki],1,0),IF($D87=Opatowski[[#Headers],[Opatowski]],VLOOKUP($E87,Opatowski[Opatowski],1,0),IF($D87=Ostrowiecki[[#Headers],[Ostrowiecki]],VLOOKUP($E87,Ostrowiecki[Ostrowiecki],1,0),IF($D87=Pińczowski[[#Headers],[Pińczowski]],VLOOKUP($E87,Pińczowski[Pińczowski],1,0),IF($D87=Sandomierski[[#Headers],[Sandomierski]],VLOOKUP($E87,Sandomierski[Sandomierski],1,0),IF($D87=Skarżyski[[#Headers],[Skarżyski]],VLOOKUP($E87,Skarżyski[Skarżyski],1,0),IF($D87=Starachowicki[[#Headers],[Starachowicki]],VLOOKUP($E87,Starachowicki[Starachowicki],1,0),IF($D87=Staszowski[[#Headers],[Staszowski]],VLOOKUP($E87,Staszowski[Staszowski],1,0),IF($D87=Włoszczowski[[#Headers],[Włoszczowski]],VLOOKUP($E87,Włoszczowski[Włoszczowski],1,0),\"\")))))))))))))","v":"Łagów"}]
[null,null,null,"kielecki","Łopuszno","gmina Łopuszno",2604083,"GM-W",{"$f":"VLOOKUP($F88,'DANE - K1 lit.A'!$D$7:$M$120,4,0)","v":"NIE"},{"$f":"VLOOKUP($F88,'DANE - K1 lit.A'!$D$7:$M$120,5,0)","v":"NIE"},{"$f":"VLOOKUP($F88,'DANE - K1 lit.A'!$D$7:$M$120,6,0)","v":"NIE"},{"$f":"IF($E88=\"\",\"\",VLOOKUP($F88,'DANE - K4 lit.B'!$D$6:$E$107,2,0))","v":"NIE"},{"$f":"IF($E88=\"\",\"\",VLOOKUP($F88,'DANE - K2 lit.C'!$B$14:$I$114,8,0))","v":"w przedziale od 30 do 50 minut"},null,null,{"$f":"IF($D88=Buski[[#Headers],[Buski]],VLOOKUP($E88,Buski[Buski],1,0),IF($D88=Jędrzejowski[[#Headers],[Jędrzejowski]],VLOOKUP($E88,Jędrzejowski[Jędrzejowski],1,0),IF($D88=Kazimierski[[#Headers],[Kazimierski]],VLOOKUP($E88,Kazimierski[Kazimierski],1,0),IF($D88=Kielecki[[#Headers],[Kielecki]],VLOOKUP($E88,Kielecki[Kielecki],1,0),IF($D88=Konecki[[#Headers],[Konecki]],VLOOKUP($E88,Konecki[Konecki],1,0),IF($D88=Opatowski[[#Headers],[Opatowski]],VLOOKUP($E88,Opatowski[Opatowski],1,0),IF($D88=Ostrowiecki[[#Headers],[Ostrowiecki]],VLOOKUP($E88,Ostrowiecki[Ostrowiecki],1,0),IF($D88=Pińczowski[[#Headers],[Pińczowski]],VLOOKUP($E88,Pińczowski[Pińczowski],1,0),IF($D88=Sandomierski[[#Headers],[Sandomierski]],VLOOKUP($E88,Sandomierski[Sandomierski],1,0),IF($D88=Skarżyski[[#Headers],[Skarżyski]],VLOOKUP($E88,Skarżyski[Skarżyski],1,0),IF($D88=Starachowicki[[#Headers],[Starachowicki]],VLOOKUP($E88,Starachowicki[Starachowicki],1,0),IF($D88=Staszowski[[#Headers],[Staszowski]],VLOOKUP($E88,Staszowski[Staszowski],1,0),IF($D88=Włoszczowski[[#Headers],[Włoszczowski]],VLOOKUP($E88,Włoszczowski[Włoszczowski],1,0),\"\")))))))))))))","v":"Łopuszno"}]
[null,null,null,"kielecki","Masłów","gmina Masłów",2604092,"GW",{"$f":"VLOOKUP($F89,'DANE - K1 lit.A'!$D$7:$M$120,4,0)","v":"NIE"},{"$f":"VLOOKUP($F89,'DANE - K1 lit.A'!$D$7:$M$120,5,0)","v":"TAK"},{"$f":"VLOOKUP($F89,'DANE - K1 lit.A'!$D$7:$M$120,6,0)","v":"NIE"},{"$f":"IF($E89=\"\",\"\",VLOOKUP($F89,'DANE - K4 lit.B'!$D$6:$E$107,2,0))","v":"NIE"},{"$f":"IF($E89=\"\",\"\",VLOOKUP($F89,'DANE - K2 lit.C'!$B$14:$I$114,8,0))","v":"mniejszy niż 30 minut"},null,null,{"$f":"IF($D89=Buski[[#Headers],[Buski]],VLOOKUP($E89,Buski[Buski],1,0),IF($D89=Jędrzejowski[[#Headers],[Jędrzejowski]],VLOOKUP($E89,Jędrzejowski[Jędrzejowski],1,0),IF($D89=Kazimierski[[#Headers],[Kazimierski]],VLOOKUP($E89,Kazimierski[Kazimierski],1,0),IF($D89=Kielecki[[#Headers],[Kielecki]],VLOOKUP($E89,Kielecki[Kielecki],1,0),IF($D89=Konecki[[#Headers],[Konecki]],VLOOKUP($E89,Konecki[Konecki],1,0),IF($D89=Opatowski[[#Headers],[Opatowski]],VLOOKUP($E89,Opatowski[Opatowski],1,0),IF($D89=Ostrowiecki[[#Headers],[Ostrowiecki]],VLOOKUP($E89,Ostrowiecki[Ostrowiecki],1,0),IF($D89=Pińczowski[[#Headers],[Pińczowski]],VLOOKUP($E89,Pińczowski[Pińczowski],1,0),IF($D89=Sandomierski[[#Headers],[Sandomierski]],VLOOKUP($E89,Sandomierski[Sandomierski],1,0),IF($D89=Skarżyski[[#Headers],[Skarżyski]],VLOOKUP($E89,Skarżyski[Skarżyski],1,0),IF($D89=Starachowicki[[#Headers],[Starachowicki]],VLOOKUP($E89,Starachowicki[Starachowicki],1,0),IF($D89=Staszowski[[#Headers],[Staszowski]],VLOOKUP($E89,Staszowski[Staszowski],1,0),IF($D89=Włoszczowski[[#Headers],[Włoszczowski]],VLOOKUP($E89,Włoszczowski[Włoszczowski],1,0),\"\")))))))))))))","v":"Masłów"}]
[null,null,null,"kielecki","Miedziana Góra","gmina Miedziana Góra",2604102,"GW",{"$f":"VLOOKUP($F90,'DANE - K1 lit.A'!$D$7:$M$120,4,0)","v":"NIE"},{"$f":"VLOOKUP($F90,'DANE - K1 lit.A'!$D$7:$M$120,5,0)","v":"NIE"},{"$f":"VLOOKUP($F90,'DANE - K1 lit.A'!$D$7:$M$120,6,0)","v":"NIE"},{"$f":"IF($E90=\"\",\"\",VLOOKUP($F90,'DANE - K4 lit.B'!$D$6:$E$107,2,0))","v":"NIE"},{"$f":"IF($E90=\"\",\"\",VLOOKUP($F90,'DANE - K2 lit.C'!$B$14:$I$114,8,0))","v":"mniejszy niż 30 minut"},null,null,{"$f":"IF($D90=Buski[[#Headers],[Buski]],VLOOKUP($E90,Buski[Buski],1,0),IF($D90=Jędrzejowski[[#Headers],[Jędrzejowski]],VLOOKUP($E90,Jędrzejowski[Jędrzejowski],1,0),IF($D90=Kazimierski[[#Headers],[Kazimierski]],VLOOKUP($E90,Kazimierski[Kazimierski],1,0),IF($D90=Kielecki[[#Headers],[Kielecki]],VLOOKUP($E90,Kielecki[Kielecki],1,0),IF($D90=Konecki[[#Headers],[Konecki]],VLOOKUP($E90,Konecki[Konecki],1,0),IF($D90=Opatowski[[#Headers],[Opatowski]],VLOOKUP($E90,Opatowski[Opatowski],1,0),IF($D90=Ostrowiecki[[#Headers],[Ostrowiecki]],VLOOKUP($E90,Ostrowiecki[Ostrowiecki],1,0),IF($D90=Pińczowski[[#Headers],[Pińczowski]],VLOOKUP($E90,Pińczowski[Pińczowski],1,0),IF($D90=Sandomierski[[#Headers],[Sandomierski]],VLOOKUP($E90,Sandomierski[Sandomierski],1,0),IF($D90=Skarżyski[[#Headers],[Skarżyski]],VLOOKUP($E90,Skarżyski[Skarżyski],1,0),IF($D90=Starachowicki[[#Headers],[Starachowicki]],VLOOKUP($E90,Starachowicki[Starachowicki],1,0),IF($D90=Staszowski[[#Headers],[Staszowski]],VLOOKUP($E90,Staszowski[Staszowski],1,0),IF($D90=Włoszczowski[[#Headers],[Włoszczowski]],VLOOKUP($E90,Włoszczowski[Włoszczowski],1,0),\"\")))))))))))))","v":"Miedziana Góra"}]
[null,null,null,"kielecki","Mniów","gmina Mniów",2604112,"GW",{"$f":"VLOOKUP($F91,'DANE - K1 lit.A'!$D$7:$M$120,4,0)","v":"NIE"},{"$f":"VLOOKUP($F91,'DANE - K1 lit.A'!$D$7:$M$120,5,0)","v":"NIE"},{"$f":"VLOOKUP($F91,'DANE - K1 lit.A'!$D$7:$M$120,6,0)","v":"NIE"},{"$f":"IF($E91=\"\",\"\",VLOOKUP($F91,'DANE - K4 lit.B'!$D$6:$E$107,2,0))","v":"NIE"},{"$f":"IF($E91=\"\",\"\",VLOOKUP($F91,'DANE - K2 lit.C'!$B$14:$I$114,8,0))","v":"w przedziale od 30 do 50 minut"},null,null,{"$f":"IF($D91=Buski[[#Headers],[Buski]],VLOOKUP($E91,Buski[Buski],1,0),IF($D91=Jędrzejowski[[#Headers],[Jędrzejowski]],VLOOKUP($E91,Jędrzejowski[Jędrzejowski],1,0),IF($D91=Kazimierski[[#Headers],[Kazimierski]],VLOOKUP($E91,Kazimierski[Kazimierski],1,0),IF($D91=Kielecki[[#Headers],[Kielecki]],VLOOKUP($E91,Kielecki[Kielecki],1,0),IF($D91=Konecki[[#Headers],[Konecki]],VLOOKUP($E91,Konecki[Konecki],1,0),IF($D91=Opatowski[[#Headers],[Opatowski]],VLOOKUP($E91,Opatowski[Opatowski],1,0),IF($D91=Ostrowiecki[[#Headers],[Ostrowiecki]],VLOOKUP($E91,Ostrowiecki[Ostrowiecki],1,0),IF($D91=Pińczowski[[#Headers],[Pińczowski]],VLOOKUP($E91,Pińczowski[Pińczowski],1,0),IF($D91=Sandomierski[[#Headers],[Sandomierski]],VLOOKUP($E91,Sandomierski[Sandomierski],1,0),IF($D91=Skarżyski[[#Headers],[Skarżyski]],VLOOKUP($E91,Skarżyski[Skarżyski],1,0),IF($D91=Starachowicki[[#Headers],[Starachowicki]],VLOOKUP($E91,Starachowicki[Starachowicki],1,0),IF($D91=Staszowski[[#Headers],[Staszowski]],VLOOKUP($E91,Staszowski[Staszowski],1,0),IF($D91=Włoszczowski[[#Headers],[Włoszczowski]],VLOOKUP($E91,Włoszczowski[Włoszczowski],1,0),\"\")))))))))))))","v":"Mniów"}]
[null,null,null,"kielecki","Morawica","gmina Morawica",2604123,"GM-W",{"$f":"VLOOKUP($F92,'DANE - K1 lit.A'!$D$7:$M$120,4,0)","v":"TAK"},{"$f":"VLOOKUP($F92,'DANE - K1 lit.A'!$D$7:$M$120,5,0)","v":"TAK"},{"$f":"VLOOKUP($F92,'DANE - K1 lit.A'!$D$7:$M$120,6,0)","v":"NIE"},{"$f":"IF($E92=\"\",\"\",VLOOKUP($F92,'DANE - K4 lit.B'!$D$6:$E$107,2,0))","v":"NIE"},{"$f":"IF($E92=\"\",\"\",VLOOKUP($F92,'DANE - K2 lit.C'!$B$14:$I$114,8,0))","v":"mniejszy niż 30 minut"},null,null,{"$f":"IF($D92=Buski[[#Headers],[Buski]],VLOOKUP($E92,Buski[Buski],1,0),IF($D92=Jędrzejowski[[#Headers],[Jędrzejowski]],VLOOKUP($E92,Jędrzejowski[Jędrzejowski],1,0),IF($D92=Kazimierski[[#Headers],[Kazimierski]],VLOOKUP($E92,Kazimierski[Kazimierski],1,0),IF($D92=Kielecki[[#Headers],[Kielecki]],VLOOKUP($E92,Kielecki[Kielecki],1,0),IF($D92=Konecki[[#Headers],[Konecki]],VLOOKUP($E92,Konecki[Konecki],1,0),IF($D92=Opatowski[[#Headers],[Opatowski]],VLOOKUP($E92,Opatowski[Opatowski],1,0),IF($D92=Ostrowiecki[[#Headers],[Ostrowiecki]],VLOOKUP($E92,Ostrowiecki[Ostrowiecki],1,0),IF($D92=Pińczowski[[#Headers],[Pińczowski]],VLOOKUP($E92,Pińczowski[Pińczowski],1,0),IF($D92=Sandomierski[[#Headers],[Sandomierski]],VLOOKUP($E92,Sandomierski[Sandomierski],1,0),IF($D92=Skarżyski[[#Headers],[Skarżyski]],VLOOKUP($E92,Skarżyski[Skarżyski],1,0),IF($D92=Starachowicki[[#Headers],[Starachowicki]],VLOOKUP($E92,Starachowicki[Starachowicki],1,0),IF($D92=Staszowski[[#Headers],[Staszowski]],VLOOKUP($E92,Staszowski[Staszowski],1,0),IF($D92=Włoszczowski[[#Headers],[Włoszczowski]],VLOOKUP($E92,Włoszczowski[Włoszczowski],1,0),\"\")))))))))))))","v":"Morawica"}]
[null,null,null,"kielecki","Nowa Słupia","gmina Nowa Słupia",2604133,"GM-W",{"$f":"VLOOKUP($F93,'DANE - K1 lit.A'!$D$7:$M$120,4,0)","v":"NIE"},{"$f":"VLOOKUP($F93,'DANE - K1 lit.A'!$D$7:$M$120,5,0)","v":"TAK"},{"$f":"VLOOKUP($F93,'DANE - K1 lit.A'!$D$7:$M$120,6,0)","v":"TAK"},{"$f":"IF($E93=\"\",\"\",VLOOKUP($F93,'DANE - K4 lit.B'!$D$6:$E$107,2,0))","v":"NIE"},{"$f":"IF($E93=\"\",\"\",VLOOKUP($F93,'DANE - K2 lit.C'!$B$14:$I$114,8,0))","v":"w przedziale od 30 do 50 minut"},null,null,{"$f":"IF($D93=Buski[[#Headers],[Buski]],VLOOKUP($E93,Buski[Buski],1,0),IF($D93=Jędrzejowski[[#Headers],[Jędrzejowski]],VLOOKUP($E93,Jędrzejowski[Jędrzejowski],1,0),IF($D93=Kazimierski[[#Headers],[Kazimierski]],VLOOKUP($E93,Kazimierski[Kazimierski],1,0),IF($D93=Kielecki[[#Headers],[Kielecki]],VLOOKUP($E93,Kielecki[Kielecki],1,0),IF($D93=Konecki[[#Headers],[Konecki]],VLOOKUP($E93,Konecki[Konecki],1,0),IF($D93=Opatowski[[#Headers],[Opatowski]],VLOOKUP($E93,Opatowski[Opatowski],1,0),IF($D93=Ostrowiecki[[#Headers],[Ostrowiecki]],VLOOKUP($E93,Ostrowiecki[Ostrowiecki],1,0),IF($D93=Pińczowski[[#Headers],[Pińczowski]],VLOOKUP($E93,Pińczowski[Pińczowski],1,0),IF($D93=Sandomierski[[#Headers],[Sandomierski]],VLOOKUP($E93,Sandomierski[Sandomierski],1,0),IF($D93=Skarżyski[[#Headers],[Skarżyski]],VLOOKUP($E93,Skarżyski[Skarżyski],1,0),IF($D93=Starachowicki[[#Headers],[Starachowicki]],VLOOKUP($E93,Starachowicki[Starachowicki],1,0),IF($D93=Staszowski[[#Headers],[Staszowski]],VLOOKUP($E93,Staszowski[Staszowski],1,0),IF($D93=Włoszczowski[[#Headers],[Włoszczowski]],VLOOKUP($E93,Włoszczowski[Włoszczowski],1,0),\"\")))))))))))))","v":"Nowa Słupia"}]
[null,null,null,"kielecki","Nowiny","gmina Nowiny",2604172,"GW",{"$f":"VLOOKUP($F94,'DANE - K1 lit.A'!$D$7:$M$120,4,0)","v":"TAK"},{"$f":"VLOOKUP($F94,'DANE - K1 lit.A'!$D$7:$M$120,5,0)","v":"TAK"},{"$f":"VLOOKUP($F94,'DANE - K1 lit.A'!$D$7:$M$120,6,0)","v":"NIE"},{"$f":"IF($E94=\"\",\"\",VLOOKUP($F94,'DANE - K4 lit.B'!$D$6:$E$107,2,0))","v":"NIE"},{"$f":"IF($E94=\"\",\"\",VLOOKUP($F94,'DANE - K2 lit.C'!$B$14:$I$114,8,0))","v":"mniejszy niż 30 minut"},null,null,{"$f":"IF($D94=Buski[[#Headers],[Buski]],VLOOKUP($E94,Buski[Buski],1,0),IF($D94=Jędrzejowski[[#Headers],[Jędrzejowski]],VLOOKUP($E94,Jędrzejowski[Jędrzejowski],1,0),IF($D94=Kazimierski[[#Headers],[Kazimierski]],VLOOKUP($E94,Kazimierski[Kazimierski],1,0),IF($D94=Kielecki[[#Headers],[Kielecki]],VLOOKUP($E94,Kielecki[Kielecki],1,0),IF($D94=Konecki[[#Headers],[Konecki]],VLOOKUP($E94,Konecki[Konecki],1,0),IF($D94=Opatowski[[#Headers],[Opatowski]],VLOOKUP($E94,Opatowski[Opatowski],1,0),IF($D94=Ostrowiecki[[#Headers],[Ostrowiecki]],VLOOKUP($E94,Ostrowiecki[Ostrowiecki],1,0),IF($D94=Pińczowski[[#Headers],[Pińczowski]],VLOOKUP($E94,Pińczowski[Pińczowski],1,0),IF($D94=Sandomierski[[#Headers],[Sandomierski]],VLOOKUP($E94,Sandomierski[Sandomierski],1,0),IF($D94=Skarżyski[[#Headers],[Skarżyski]],VLOOKUP($E94,Skarżyski[Skarżyski],1,0),IF($D94=Starachowicki[[#Headers],[Starachowicki]],VLOOKUP($E94,Starachowicki[Starachowicki],1,0),IF($D94=Staszowski[[#Headers],[Staszowski]],VLOOKUP($E94,Staszowski[Staszowski],1,0),IF($D94=Włoszczowski[[#Headers],[Włoszczowski]],VLOOKUP($E94,Włoszczowski[Włoszczowski],1,0),\"\")))))))))))))","v":"Nowiny"}]
[null,null,null,"kielecki","Piekoszów","gmina Piekoszów",2604143,"GM-W",{"$f":"VLOOKUP($F95,'DANE - K1 lit.A'!$D$7:$M$120,4,0)","v":"NIE"},{"$f":"VLOOKUP($F95,'DANE - K1 lit.A'!$D$7:$M$120,5,0)","v":"TAK"},{"$f":"VLOOKUP($F95,'DANE - K1 lit.A'!$D$7:$M$120,6,0)","v":"NIE"},{"$f":"IF($E95=\"\",\"\",VLOOKUP($F95,'DANE - K4 lit.B'!$D$6:$E$107,2,0))","v":"NIE"},{"$f":"IF($E95=\"\",\"\",VLOOKUP($F95,'DANE - K2 lit.C'!$B$14:$I$114,8,0))","v":"mniejszy niż 30 minut"},null,null,{"$f":"IF($D95=Buski[[#Headers],[Buski]],VLOOKUP($E95,Buski[Buski],1,0),IF($D95=Jędrzejowski[[#Headers],[Jędrzejowski]],VLOOKUP($E95,Jędrzejowski[Jędrzejowski],1,0),IF($D95=Kazimierski[[#Headers],[Kazimierski]],VLOOKUP($E95,Kazimierski[Kazimierski],1,0),IF($D95=Kielecki[[#Headers],[Kielecki]],VLOOKUP($E95,Kielecki[Kielecki],1,0),IF($D95=Konecki[[#Headers],[Konecki]],VLOOKUP($E95,Konecki[Konecki],1,0),IF($D95=Opatowski[[#Headers],[Opatowski]],VLOOKUP($E95,Opatowski[Opatowski],1,0),IF($D95=Ostrowiecki[[#Headers],[Ostrowiecki]],VLOOKUP($E95,Ostrowiecki[Ostrowiecki],1,0),IF($D95=Pińczowski[[#Headers],[Pińczowski]],VLOOKUP($E95,Pińczowski[Pińczowski],1,0),IF($D95=Sandomierski[[#Headers],[Sandomierski]],VLOOKUP($E95,Sandomierski[Sandomierski],1,0),IF($D95=Skarżyski[[#Headers],[Skarżyski]],VLOOKUP($E95,Skarżyski[Skarżyski],1,0),IF($D95=Starachowicki[[#Headers],[Starachowicki]],VLOOKUP($E95,Starachowicki[Starachowicki],1,0),IF($D95=Staszowski[[#Headers],[Staszowski]],VLOOKUP($E95,Staszowski[Staszowski],1,0),IF($D95=Włoszczowski[[#Headers],[Włoszczowski]],VLOOKUP($E95,Włoszczowski[Włoszczowski],1,0),\"\")))))))))))))","v":"Piekoszów"}]
[null,null,null,"kielecki","Pierzchnica","gmina Pierzchnica",2604153,"GM-W",{"$f":"VLOOKUP($F96,'DANE - K1 lit.A'!$D$7:$M$120,4,0)","v":"NIE"},{"$f":"VLOOKUP($F96,'DANE - K1 lit.A'!$D$7:$M$120,5,0)","v":"TAK"},{"$f":"VLOOKUP($F96,'DANE - K1 lit.A'!$D$7:$M$120,6,0)","v":"NIE"},{"$f":"IF($E96=\"\",\"\",VLOOKUP($F96,'DANE - K4 lit.B'!$D$6:$E$107,2,0))","v":"NIE"},{"$f":"IF($E96=\"\",\"\",VLOOKUP($F96,'DANE - K2 lit.C'!$B$14:$I$114,8,0))","v":"w przedziale od 30 do 50 minut"},null,null,{"$f":"IF($D96=Buski[[#Headers],[Buski]],VLOOKUP($E96,Buski[Buski],1,0),IF($D96=Jędrzejowski[[#Headers],[Jędrzejowski]],VLOOKUP($E96,Jędrzejowski[Jędrzejowski],1,0),IF($D96=Kazimierski[[#Headers],[Kazimierski]],VLOOKUP($E96,Kazimierski[Kazimierski],1,0),IF($D96=Kielecki[[#Headers],[Kielecki]],VLOOKUP($E96,Kielecki[Kielecki],1,0),IF($D96=Konecki[[#Headers],[Konecki]],VLOOKUP($E96,Konecki[Konecki],1,0),IF($D96=Opatowski[[#Headers],[Opatowski]],VLOOKUP($E96,Opatowski[Opatowski],1,0),IF($D96=Ostrowiecki[[#Headers],[Ostrowiecki]],VLOOKUP($E96,Ostrowiecki[Ostrowiecki],1,0),IF($D96=Pińczowski[[#Headers],[Pińczowski]],VLOOKUP($E96,Pińczowski[Pińczowski],1,0),IF($D96=Sandomierski[[#Headers],[Sandomierski]],VLOOKUP($E96,Sandomierski[Sandomierski],1,0),IF($D96=Skarżyski[[#Headers],[Skarżyski]],VLOOKUP($E96,Skarżyski[Skarżyski],1,0),IF($D96=Starachowicki[[#Headers],[Starachowicki]],VLOOKUP($E96,Starachowicki[Starachowicki],1,0),IF($D96=Staszowski[[#Headers],[Staszowski]],VLOOKUP($E96,Staszowski[Staszowski],1,0),IF($D96=Włoszczowski[[#Headers],[Włoszczowski]],VLOOKUP($E96,Włoszczowski[Włoszczowski],1,0),\"\")))))))))))))","v":"Pierzchnica"}]
[null,null,null,"kielecki","Raków","gmina Raków",2604162,"GW",{"$f":"VLOOKUP($F97,'DANE - K1 lit.A'!$D$7:$M$120,4,0)","v":"NIE"},{"$f":"VLOOKUP($F97,'DANE - K1 lit.A'!$D$7:$M$120,5,0)","v":"NIE"},{"$f":"VLOOKUP($F97,'DANE - K1 lit.A'!$D$7:$M$120,6,0)","v":"NIE"},{"$f":"IF($E97=\"\",\"\",VLOOKUP($F97,'DANE - K4 lit.B'!$D$6:$E$107,2,0))","v":"NIE"},{"$f":"IF($E97=\"\",\"\",VLOOKUP($F97,'DANE - K2 lit.C'!$B$14:$I$114,8,0))","v":"w przedziale od 30 do 50 minut"},null,null,{"$f":"IF($D97=Buski[[#Headers],[Buski]],VLOOKUP($E97,Buski[Buski],1,0),IF($D97=Jędrzejowski[[#Headers],[Jędrzejowski]],VLOOKUP($E97,Jędrzejowski[Jędrzejowski],1,0),IF($D97=Kazimierski[[#Headers],[Kazimierski]],VLOOKUP($E97,Kazimierski[Kazimierski],1,0),IF($D97=Kielecki[[#Headers],[Kielecki]],VLOOKUP($E97,Kielecki[Kielecki],1,0),IF($D97=Konecki[[#Headers],[Konecki]],VLOOKUP($E97,Konecki[Konecki],1,0),IF($D97=Opatowski[[#Headers],[Opatowski]],VLOOKUP($E97,Opatowski[Opatowski],1,0),IF($D97=Ostrowiecki[[#Headers],[Ostrowiecki]],VLOOKUP($E97,Ostrowiecki[Ostrowiecki],1,0),IF($D97=Pińczowski[[#Headers],[Pińczowski]],VLOOKUP($E97,Pińczowski[Pińczowski],1,0),IF($D97=Sandomierski[[#Headers],[Sandomierski]],VLOOKUP($E97,Sandomierski[Sandomierski],1,0),IF($D97=Skarżyski[[#Headers],[Skarżyski]],VLOOKUP($E97,Skarżyski[Skarżyski],1,0),IF($D97=Starachowicki[[#Headers],[Starachowicki]],VLOOKUP($E97,Starachowicki[Starachowicki],1,0),IF($D97=Staszowski[[#Headers],[Staszowski]],VLOOKUP($E97,Staszowski[Staszowski],1,0),IF($D97=Włoszczowski[[#Headers],[Włoszczowski]],VLOOKUP($E97,Włoszczowski[Włoszczowski],1,0),\"\")))))))))))))","v":"Raków"}]
[null,null,null,"kielecki","Strawczyn","gmina Strawczyn",2604182,"GW",{"$f":"VLOOKUP($F98,'DANE - K1 lit.A'!$D$7:$M$120,4,0)","v":"NIE"},{"$f":"VLOOKUP($F98,'DANE - K1 lit.A'!$D$7:$M$120,5,0)","v":"NIE"},{"$f":"VLOOKUP($F98,'DANE - K1 lit.A'!$D$7:$M$120,6,0)","v":"NIE"},{"$f":"IF($E98=\"\",\"\",VLOOKUP($F98,'DANE - K4 lit.B'!$D$6:$E$107,2,0))","v":"NIE"},{"$f":"IF($E98=\"\",\"\",VLOOKUP($F98,'DANE - K2 lit.C'!$B$14:$I$114,8,0))","v":"w przedziale od 30 do 50 minut"},null,null,{"$f":"IF($D98=Buski[[#Headers],[Buski]],VLOOKUP($E98,Buski[Buski],1,0),IF($D98=Jędrzejowski[[#Headers],[Jędrzejowski]],VLOOKUP($E98,Jędrzejowski[Jędrzejowski],1,0),IF($D98=Kazimierski[[#Headers],[Kazimierski]],VLOOKUP($E98,Kazimierski[Kazimierski],1,0),IF($D98=Kielecki[[#Headers],[Kielecki]],VLOOKUP($E98,Kielecki[Kielecki],1,0),IF($D98=Konecki[[#Headers],[Konecki]],VLOOKUP($E98,Konecki[Konecki],1,0),IF($D98=Opatowski[[#Headers],[Opatowski]],VLOOKUP($E98,Opatowski[Opatowski],1,0),IF($D98=Ostrowiecki[[#Headers],[Ostrowiecki]],VLOOKUP($E98,Ostrowiecki[Ostrowiecki],1,0),IF($D98=Pińczowski[[#Headers],[Pińczowski]],VLOOKUP($E98,Pińczowski[Pińczowski],1,0),IF($D98=Sandomierski[[#Headers],[Sandomierski]],VLOOKUP($E98,Sandomierski[Sandomierski],1,0),IF($D98=Skarżyski[[#Headers],[Skarżyski]],VLOOKUP($E98,Skarżyski[Skarżyski],1,0),IF($D98=Starachowicki[[#Headers],[Starachowicki]],VLOOKUP($E98,Starachowicki[Starachowicki],1,0),IF($D98=Staszowski[[#Headers],[Staszowski]],VLOOKUP($E98,Staszowski[Staszowski],1,0),IF($D98=Włoszczowski[[#Headers],[Włoszczowski]],VLOOKUP($E98,Włoszczowski[Włoszczowski],1,0),\"\")))))))))))))","v":"Strawczyn"}]
[null,null,null,"kielecki","Zagnańsk","gmina Zagnańsk",2604192,"GW",{"$f":"VLOOKUP($F99,'DANE - K1 lit.A'!$D$7:$M$120,4,0)","v":"NIE"},{"$f":"VLOOKUP($F99,'DANE - K1 lit.A'!$D$7:$M$120,5,0)","v":"TAK"},{"$f":"VLOOKUP($F99,'DANE - K1 lit.A'!$D$7:$M$120,6,0)","v":"NIE"},{"$f":"IF($E99=\"\",\"\",VLOOKUP($F99,'DANE - K4 lit.B'!$D$6:$E$107,2,0))","v":"NIE"},{"$f":"IF($E99=\"\",\"\",VLOOKUP($F99,'DANE - K2 lit.C'!$B$14:$I$114,8,0))","v":"mniejszy niż 30 minut"},null,null,{"$f":"IF($D99=Buski[[#Headers],[Buski]],VLOOKUP($E99,Buski[Buski],1,0),IF($D99=Jędrzejowski[[#Headers],[Jędrzejowski]],VLOOKUP($E99,Jędrzejowski[Jędrzejowski],1,0),IF($D99=Kazimierski[[#Headers],[Kazimierski]],VLOOKUP($E99,Kazimierski[Kazimierski],1,0),IF($D99=Kielecki[[#Headers],[Kielecki]],VLOOKUP($E99,Kielecki[Kielecki],1,0),IF($D99=Konecki[[#Headers],[Konecki]],VLOOKUP($E99,Konecki[Konecki],1,0),IF($D99=Opatowski[[#Headers],[Opatowski]],VLOOKUP($E99,Opatowski[Opatowski],1,0),IF($D99=Ostrowiecki[[#Headers],[Ostrowiecki]],VLOOKUP($E99,Ostrowiecki[Ostrowiecki],1,0),IF($D99=Pińczowski[[#Headers],[Pińczowski]],VLOOKUP($E99,Pińczowski[Pińczowski],1,0),IF($D99=Sandomierski[[#Headers],[Sandomierski]],VLOOKUP($E99,Sandomierski[Sandomierski],1,0),IF($D99=Skarżyski[[#Headers],[Skarżyski]],VLOOKUP($E99,Skarżyski[Skarżyski],1,0),IF($D99=Starachowicki[[#Headers],[Starachowicki]],VLOOKUP($E99,Starachowicki[Starachowicki],1,0),IF($D99=Staszowski[[#Headers],[Staszowski]],VLOOKUP($E99,Staszowski[Staszowski],1,0),IF($D99=Włoszczowski[[#Headers],[Włoszczowski]],VLOOKUP($E99,Włoszczowski[Włoszczowski],1,0),\"\")))))))))))))","v":"Zagnańsk"}]
[null,null,null,"konecki","Fałków","gmina Fałków",2605012,"GW",{"$f":"VLOOKUP($F100,'DANE - K1 lit.A'!$D$7:$M$120,4,0)","v":"NIE"},{"$f":"VLOOKUP($F100,'DANE - K1 lit.A'!$D$7:$M$120,5,0)","v":"NIE"},{"$f":"VLOOKUP($F100,'DANE - K1 lit.A'!$D$7:$M$120,6,0)","v":"NIE"},{"$f":"IF($E100=\"\",\"\",VLOOKUP($F100,'DANE - K4 lit.B'!$D$6:$E$107,2,0))","v":"NIE"},{"$f":"IF($E100=\"\",\"\",VLOOKUP($F100,'DANE - K2 lit.C'!$B$14:$I$114,8,0))","v":"w przedziale od 30 do 50 minut"},null,null,{"$f":"IF($D100=Buski[[#Headers],[Buski]],VLOOKUP($E100,Buski[Buski],1,0),IF($D100=Jędrzejowski[[#Headers],[Jędrzejowski]],VLOOKUP($E100,Jędrzejowski[Jędrzejowski],1,0),IF($D100=Kazimierski[[#Headers],[Kazimierski]],VLOOKUP($E100,Kazimierski[Kazimierski],1,0),IF($D100=Kielecki[[#Headers],[Kielecki]],VLOOKUP($E100,Kielecki[Kielecki],1,0),IF($D100=Konecki[[#Headers],[Konecki]],VLOOKUP($E100,Konecki[Konecki],1,0),IF($D100=Opatowski[[#Headers],[Opatowski]],VLOOKUP($E100,Opatowski[Opatowski],1,0),IF($D100=Ostrowiecki[[#Headers],[Ostrowiecki]],VLOOKUP($E100,Ostrowiecki[Ostrowiecki],1,0),IF($D100=Pińczowski[[#Headers],[Pińczowski]],VLOOKUP($E100,Pińczowski[Pińczowski],1,0),IF($D100=Sandomierski[[#Headers],[Sandomierski]],VLOOKUP($E100,Sandomierski[Sandomierski],1,0),IF($D100=Skarżyski[[#Headers],[Skarżyski]],VLOOKUP($E100,Skarżyski[Skarżyski],1,0),IF($D100=Starachowicki[[#Headers],[Starachowicki]],VLOOKUP($E100,Starachowicki[Starachowicki],1,0),IF($D100=Staszowski[[#Headers],[Staszowski]],VLOOKUP($E100,Staszowski[Staszowski],1,0),IF($D100=Włoszczowski[[#Headers],[Włoszczowski]],VLOOKUP($E100,Włoszczowski[Włoszczowski],1,0),\"\")))))))))))))","v":"Fałków"}]
[null,null,null,"konecki","Gowarczów","gmina Gowarczów",2605023,"GM-W",{"$f":"VLOOKUP($F101,'DANE - K1 lit.A'!$D$7:$M$120,4,0)","v":"NIE"},{"$f":"VLOOKUP($F101,'DANE - K1 lit.A'!$D$7:$M$120,5,0)","v":"NIE"},{"$f":"VLOOKUP($F101,'DANE - K1 lit.A'!$D$7:$M$120,6,0)","v":"NIE"},{"$f":"IF($E101=\"\",\"\",VLOOKUP($F101,'DANE - K4 lit.B'!$D$6:$E$107,2,0))","v":"NIE"},{"$f":"IF($E101=\"\",\"\",VLOOKUP($F101,'DANE - K2 lit.C'!$B$14:$I$114,8,0))","v":"w przedziale od 30 do 50 minut"},null,null,{"$f":"IF($D101=Buski[[#Headers],[Buski]],VLOOKUP($E101,Buski[Buski],1,0),IF($D101=Jędrzejowski[[#Headers],[Jędrzejowski]],VLOOKUP($E101,Jędrzejowski[Jędrzejowski],1,0),IF($D101=Kazimierski[[#Headers],[Kazimierski]],VLOOKUP($E101,Kazimierski[Kazimierski],1,0),IF($D101=Kielecki[[#Headers],[Kielecki]],VLOOKUP($E101,Kielecki[Kielecki],1,0),IF($D101=Konecki[[#Headers],[Konecki]],VLOOKUP($E101,Konecki[Konecki],1,0),IF($D101=Opatowski[[#Headers],[Opatowski]],VLOOKUP($E101,Opatowski[Opatowski],1,0),IF($D101=Ostrowiecki[[#Headers],[Ostrowiecki]],VLOOKUP($E101,Ostrowiecki[Ostrowiecki],1,0),IF($D101=Pińczowski[[#Headers],[Pińczowski]],VLOOKUP($E101,Pińczowski[Pińczowski],1,0),IF($D101=Sandomierski[[#Headers],[Sandomierski]],VLOOKUP($E101,Sandomierski[Sandomierski],1,0),IF($D101=Skarżyski[[#Headers],[Skarżyski]],VLOOKUP($E101,Skarżyski[Skarżyski],1,0),IF($D101=Starachowicki[[#Headers],[Starachowicki]],VLOOKUP($E101,Starachowicki[Starachowicki],1,0),IF($D101=Staszowski[[#Headers],[Staszowski]],VLOOKUP($E101,Staszowski[Staszowski],1,0),IF($D101=Włoszczowski[[#Headers],[Włoszczowski]],VLOOKUP($E101,Włoszczowski[Włoszczowski],1,0),\"\")))))))))))))","v":"Gowarczów"}]
[null,null,null,"konecki","Końskie","gmina Końskie",2605033,"GM-W",{"$f":"VLOOKUP($F102,'DANE - K1 lit.A'!$D$7:$M$120,4,0)","v":"TAK"},{"$f":"VLOOKUP($F102,'DANE - K1 lit.A'!$D$7:$M$120,5,0)","v":"TAK"},{"$f":"VLOOKUP($F102,'DANE - K1 lit.A'!$D$7:$M$120,6,0)","v":"TAK"},{"$f":"IF($E102=\"\",\"\",VLOOKUP($F102,'DANE - K4 lit.B'!$D$6:$E$107,2,0))","v":"TAK"},{"$f":"IF($E102=\"\",\"\",VLOOKUP($F102,'DANE - K2 lit.C'!$B$14:$I$114,8,0))","v":"w przedziale od 30 do 50 minut"},null,null,{"$f":"IF($D102=Buski[[#Headers],[Buski]],VLOOKUP($E102,Buski[Buski],1,0),IF($D102=Jędrzejowski[[#Headers],[Jędrzejowski]],VLOOKUP($E102,Jędrzejowski[Jędrzejowski],1,0),IF($D102=Kazimierski[[#Headers],[Kazimierski]],VLOOKUP($E102,Kazimierski[Kazimierski],1,0),IF($D102=Kielecki[[#Headers],[Kielecki]],VLOOKUP($E102,Kielecki[Kielecki],1,0),IF($D102=Konecki[[#Headers],[Konecki]],VLOOKUP($E102,Konecki[Konecki],1,0),IF($D102=Opatowski[[#Headers],[Opatowski]],VLOOKUP($E102,Opatowski[Opatowski],1,0),IF($D102=Ostrowiecki[[#Headers],[Ostrowiecki]],VLOOKUP($E102,Ostrowiecki[Ostrowiecki],1,0),IF($D102=Pińczowski[[#Headers],[Pińczowski]],VLOOKUP($E102,Pińczowski[Pińczowski],1,0),IF($D102=Sandomierski[[#Headers],[Sandomierski]],VLOOKUP($E102,Sandomierski[Sandomierski],1,0),IF($D102=Skarżyski[[#Headers],[Skarżyski]],VLOOKUP($E102,Skarżyski[Skarżyski],1,0),IF($D102=Starachowicki[[#Headers],[Starachowicki]],VLOOKUP($E102,Starachowicki[Starachowicki],1,0),IF($D102=Staszowski[[#Headers],[Staszowski]],VLOOKUP($E102,Staszowski[Staszowski],1,0),IF($D102=Włoszczowski[[#Headers],[Włoszczowski]],VLOOKUP($E102,Włoszczowski[Włoszczowski],1,0),\"\")))))))))))))","v":"Końskie"}]
[null,null,null,"konecki","Radoszyce","gmina Radoszyce",2605043,"GM-W",{"$f":"VLOOKUP($F103,'DANE - K1 lit.A'!$D$7:$M$120,4,0)","v":"NIE"},{"$f":"VLOOKUP($F103,'DANE - K1 lit.A'!$D$7:$M$120,5,0)","v":"NIE"},{"$f":"VLOOKUP($F103,'DANE - K1 lit.A'!$D$7:$M$120,6,0)","v":"NIE"},{"$f":"IF($E103=\"\",\"\",VLOOKUP($F103,'DANE - K4 lit.B'!$D$6:$E$107,2,0))","v":"NIE"},{"$f":"IF($E103=\"\",\"\",VLOOKUP($F103,'DANE - K2 lit.C'!$B$14:$I$114,8,0))","v":"w przedziale od 30 do 50 minut"},null,null,{"$f":"IF($D103=Buski[[#Headers],[Buski]],VLOOKUP($E103,Buski[Buski],1,0),IF($D103=Jędrzejowski[[#Headers],[Jędrzejowski]],VLOOKUP($E103,Jędrzejowski[Jędrzejowski],1,0),IF($D103=Kazimierski[[#Headers],[Kazimierski]],VLOOKUP($E103,Kazimierski[Kazimierski],1,0),IF($D103=Kielecki[[#Headers],[Kielecki]],VLOOKUP($E103,Kielecki[Kielecki],1,0),IF($D103=Konecki[[#Headers],[Konecki]],VLOOKUP($E103,Konecki[Konecki],1,0),IF($D103=Opatowski[[#Headers],[Opatowski]],VLOOKUP($E103,Opatowski[Opatowski],1,0),IF($D103=Ostrowiecki[[#Headers],[Ostrowiecki]],VLOOKUP($E103,Ostrowiecki[Ostrowiecki],1,0),IF($D103=Pińczowski[[#Headers],[Pińczowski]],VLOOKUP($E103,Pińczowski[Pińczowski],1,0),IF($D103=Sandomierski[[#Headers],[Sandomierski]],VLOOKUP($E103,Sandomierski[Sandomierski],1,0),IF($D103=Skarżyski[[#Headers],[Skarżyski]],VLOOKUP($E103,Skarżyski[Skarżyski],1,0),IF($D103=Starachowicki[[#Headers],[Starachowicki]],VLOOKUP($E103,Starachowicki[Starachowicki],1,0),IF($D103=Staszowski[[#Headers],[Staszowski]],VLOOKUP($E103,Staszowski[Staszowski],1,0),IF($D103=Włoszczowski[[#Headers],[Włoszczowski]],VLOOKUP($E103,Włoszczowski[Włoszczowski],1,0),\"\")))))))))))))","v":"Radoszyce"}]
[null,null,null,"konecki","Ruda Maleniecka","gmina Ruda Maleniecka",2605052,"GW",{"$f":"VLOOKUP($F104,'DANE - K1 lit.A'!$D$7:$M$120,4,0)","v":"NIE"},{"$f":"VLOOKUP($F104,'DANE - K1 lit.A'!$D$7:$M$120,5,0)","v":"NIE"},{"$f":"VLOOKUP($F104,'DANE - K1 lit.A'!$D$7:$M$120,6,0)","v":"NIE"},{"$f":"IF($E104=\"\",\"\",VLOOKUP($F104,'DANE - K4 lit.B'!$D$6:$E$107,2,0))","v":"NIE"},{"$f":"IF($E104=\"\",\"\",VLOOKUP($F104,'DANE - K2 lit.C'!$B$14:$I$114,8,0))","v":"w przedziale od 30 do 50 minut"},null,null,{"$f":"IF($D104=Buski[[#Headers],[Buski]],VLOOKUP($E104,Buski[Buski],1,0),IF($D104=Jędrzejowski[[#Headers],[Jędrzejowski]],VLOOKUP($E104,Jędrzejowski[Jędrzejowski],1,0),IF($D104=Kazimierski[[#Headers],[Kazimierski]],VLOOKUP($E104,Kazimierski[Kazimierski],1,0),IF($D104=Kielecki[[#Headers],[Kielecki]],VLOOKUP($E104,Kielecki[Kielecki],1,0),IF($D104=Konecki[[#Headers],[Konecki]],VLOOKUP($E104,Konecki[Konecki],1,0),IF($D104=Opatowski[[#Headers],[Opatowski]],VLOOKUP($E104,Opatowski[Opatowski],1,0),IF($D104=Ostrowiecki[[#Headers],[Ostrowiecki]],VLOOKUP($E104,Ostrowiecki[Ostrowiecki],1,0),IF($D104=Pińczowski[[#Headers],[Pińczowski]],VLOOKUP($E104,Pińczowski[Pińczowski],1,0),IF($D104=Sandomierski[[#Headers],[Sandomierski]],VLOOKUP($E104,Sandomierski[Sandomierski],1,0),IF($D104=Skarżyski[[#Headers],[Skarżyski]],VLOOKUP($E104,Skarżyski[Skarżyski],1,0),IF($D104=Starachowicki[[#Headers],[Starachowicki]],VLOOKUP($E104,Starachowicki[Starachowicki],1,0),IF($D104=Staszowski[[#Headers],[Staszowski]],VLOOKUP($E104,Staszowski[Staszowski],1,0),IF($D104=Włoszczowski[[#Headers],[Włoszczowski]],VLOOKUP($E104,Włoszczowski[Włoszczowski],1,0),\"\")))))))))))))","v":"Ruda Maleniecka"}]
[null,null,null,"konecki","Słupia Konecka","gmina Słupia Konecka",2605062,"GW",{"$f":"VLOOKUP($F105,'DANE - K1 lit.A'!$D$7:$M$120,4,0)","v":"NIE"},{"$f":"VLOOKUP($F105,'DANE - K1 lit.A'!$D$7:$M$120,5,0)","v":"NIE"},{"$f":"VLOOKUP($F105,'DANE - K1 lit.A'!$D$7:$M$120,6,0)","v":"NIE"},{"$f":"IF($E105=\"\",\"\",VLOOKUP($F105,'DANE - K4 lit.B'!$D$6:$E$107,2,0))","v":"NIE"},{"$f":"IF($E105=\"\",\"\",VLOOKUP($F105,'DANE - K2 lit.C'!$B$14:$I$114,8,0))","v":"w przedziale od 30 do 50 minut"},null,null,{"$f":"IF($D105=Buski[[#Headers],[Buski]],VLOOKUP($E105,Buski[Buski],1,0),IF($D105=Jędrzejowski[[#Headers],[Jędrzejowski]],VLOOKUP($E105,Jędrzejowski[Jędrzejowski],1,0),IF($D105=Kazimierski[[#Headers],[Kazimierski]],VLOOKUP($E105,Kazimierski[Kazimierski],1,0),IF($D105=Kielecki[[#Headers],[Kielecki]],VLOOKUP($E105,Kielecki[Kielecki],1,0),IF($D105=Konecki[[#Headers],[Konecki]],VLOOKUP($E105,Konecki[Konecki],1,0),IF($D105=Opatowski[[#Headers],[Opatowski]],VLOOKUP($E105,Opatowski[Opatowski],1,0),IF($D105=Ostrowiecki[[#Headers],[Ostrowiecki]],VLOOKUP($E105,Ostrowiecki[Ostrowiecki],1,0),IF($D105=Pińczowski[[#Headers],[Pińczowski]],VLOOKUP($E105,Pińczowski[Pińczowski],1,0),IF($D105=Sandomierski[[#Headers],[Sandomierski]],VLOOKUP($E105,Sandomierski[Sandomierski],1,0),IF($D105=Skarżyski[[#Headers],[Skarżyski]],VLOOKUP($E105,Skarżyski[Skarżyski],1,0),IF($D105=Starachowicki[[#Headers],[Starachowicki]],VLOOKUP($E105,Starachowicki[Starachowicki],1,0),IF($D105=Staszowski[[#Headers],[Staszowski]],VLOOKUP($E105,Staszowski[Staszowski],1,0),IF($D105=Włoszczowski[[#Headers],[Włoszczowski]],VLOOKUP($E105,Włoszczowski[Włoszczowski],1,0),\"\")))))))))))))","v":"Słupia Konecka"}]
[null,null,null,"konecki","Smyków","gmina Smyków",2605072,"GW",{"$f":"VLOOKUP($F106,'DANE - K1 lit.A'!$D$7:$M$120,4,0)","v":"NIE"},{"$f":"VLOOKUP($F106,'DANE - K1 lit.A'!$D$7:$M$120,5,0)","v":"TAK"},{"$f":"VLOOKUP($F106,'DANE - K1 lit.A'!$D$7:$M$120,6,0)","v":"NIE"},{"$f":"IF($E106=\"\",\"\",VLOOKUP($F106,'DANE - K4 lit.B'!$D$6:$E$107,2,0))","v":"NIE"},{"$f":"IF($E106=\"\",\"\",VLOOKUP($F106,'DANE - K2 lit.C'!$B$14:$I$114,8,0))","v":"w przedziale od 30 do 50 minut"},null,null,{"$f":"IF($D106=Buski[[#Headers],[Buski]],VLOOKUP($E106,Buski[Buski],1,0),IF($D106=Jędrzejowski[[#Headers],[Jędrzejowski]],VLOOKUP($E106,Jędrzejowski[Jędrzejowski],1,0),IF($D106=Kazimierski[[#Headers],[Kazimierski]],VLOOKUP($E106,Kazimierski[Kazimierski],1,0),IF($D106=Kielecki[[#Headers],[Kielecki]],VLOOKUP($E106,Kielecki[Kielecki],1,0),IF($D106=Konecki[[#Headers],[Konecki]],VLOOKUP($E106,Konecki[Konecki],1,0),IF($D106=Opatowski[[#Headers],[Opatowski]],VLOOKUP($E106,Opatowski[Opatowski],1,0),IF($D106=Ostrowiecki[[#Headers],[Ostrowiecki]],VLOOKUP($E106,Ostrowiecki[Ostrowiecki],1,0),IF($D106=Pińczowski[[#Headers],[Pińczowski]],VLOOKUP($E106,Pińczowski[Pińczowski],1,0),IF($D106=Sandomierski[[#Headers],[Sandomierski]],VLOOKUP($E106,Sandomierski[Sandomierski],1,0),IF($D106=Skarżyski[[#Headers],[Skarżyski]],VLOOKUP($E106,Skarżyski[Skarżyski],1,0),IF($D106=Starachowicki[[#Headers],[Starachowicki]],VLOOKUP($E106,Starachowicki[Starachowicki],1,0),IF($D106=Staszowski[[#Headers],[Staszowski]],VLOOKUP($E106,Staszowski[Staszowski],1,0),IF($D106=Włoszczowski[[#Headers],[Włoszczowski]],VLOOKUP($E106,Włoszczowski[Włoszczowski],1,0),\"\")))))))))))))","v":"Smyków"}]
[null,null,null,"konecki","Stąporków","gmina Stąporków",2605083,"GM-W",{"$f":"VLOOKUP($F107,'DANE - K1 lit.A'!$D$7:$M$120,4,0)","v":"TAK"},{"$f":"VLOOKUP($F107,'DANE - K1 lit.A'!$D$7:$M$120,5,0)","v":"TAK"},{"$f":"VLOOKUP($F107,'DANE - K1 lit.A'!$D$7:$M$120,6,0)","v":"TAK"},{"$f":"IF($E107=\"\",\"\",VLOOKUP($F107,'DANE - K4 lit.B'!$D$6:$E$107,2,0))","v":"NIE"},{"$f":"IF($E107=\"\",\"\",VLOOKUP($F107,'DANE - K2 lit.C'!$B$14:$I$114,8,0))","v":"w przedziale od 30 do 50 minut"},null,null,{"$f":"IF($D107=Buski[[#Headers],[Buski]],VLOOKUP($E107,Buski[Buski],1,0),IF($D107=Jędrzejowski[[#Headers],[Jędrzejowski]],VLOOKUP($E107,Jędrzejowski[Jędrzejowski],1,0),IF($D107=Kazimierski[[#Headers],[Kazimierski]],VLOOKUP($E107,Kazimierski[Kazimierski],1,0),IF($D107=Kielecki[[#Headers],[Kielecki]],VLOOKUP($E107,Kielecki[Kielecki],1,0),IF($D107=Konecki[[#Headers],[Konecki]],VLOOKUP($E107,Konecki[Konecki],1,0),IF($D107=Opatowski[[#Headers],[Opatowski]],VLOOKUP($E107,Opatowski[Opatowski],1,0),IF($D107=Ostrowiecki[[#Headers],[Ostrowiecki]],VLOOKUP($E107,Ostrowiecki[Ostrowiecki],1,0),IF($D107=Pińczowski[[#Headers],[Pińczowski]],VLOOKUP($E107,Pińczowski[Pińczowski],1,0),IF($D107=Sandomierski[[#Headers],[Sandomierski]],VLOOKUP($E107,Sandomierski[Sandomierski],1,0),IF($D107=Skarżyski[[#Headers],[Skarżyski]],VLOOKUP($E107,Skarżyski[Skarżyski],1,0),IF($D107=Starachowicki[[#Headers],[Starachowicki]],VLOOKUP($E107,Starachowicki[Starachowicki],1,0),IF($D107=Staszowski[[#Headers],[Staszowski]],VLOOKUP($E107,Staszowski[Staszowski],1,0),IF($D107=Włoszczowski[[#Headers],[Włoszczowski]],VLOOKUP($E107,Włoszczowski[Włoszczowski],1,0),\"\")))))))))))))","v":"Stąporków"}]
[null,null,null,"opatowski","Baćkowice","gmina Baćkowice",2606012,"GW",{"$f":"VLOOKUP($F108,'DANE - K1 lit.A'!$D$7:$M$120,4,0)","v":"NIE"},{"$f":"VLOOKUP($F108,'DANE - K1 lit.A'!$D$7:$M$120,5,0)","v":"NIE"},{"$f":"VLOOKUP($F108,'DANE - K1 lit.A'!$D$7:$M$120,6,0)","v":"NIE"},{"$f":"IF($E108=\"\",\"\",VLOOKUP($F108,'DANE - K4 lit.B'!$D$6:$E$107,2,0))","v":"NIE"},{"$f":"IF($E108=\"\",\"\",VLOOKUP($F108,'DANE - K2 lit.C'!$B$14:$I$114,8,0))","v":"w przedziale od 30 do 50 minut"},null,null,{"$f":"IF($D108=Buski[[#Headers],[Buski]],VLOOKUP($E108,Buski[Buski],1,0),IF($D108=Jędrzejowski[[#Headers],[Jędrzejowski]],VLOOKUP($E108,Jędrzejowski[Jędrzejowski],1,0),IF($D108=Kazimierski[[#Headers],[Kazimierski]],VLOOKUP($E108,Kazimierski[Kazimierski],1,0),IF($D108=Kielecki[[#Headers],[Kielecki]],VLOOKUP($E108,Kielecki[Kielecki],1,0),IF($D108=Konecki[[#Headers],[Konecki]],VLOOKUP($E108,Konecki[Konecki],1,0),IF($D108=Opatowski[[#Headers],[Opatowski]],VLOOKUP($E108,Opatowski[Opatowski],1,0),IF($D108=Ostrowiecki[[#Headers],[Ostrowiecki]],VLOOKUP($E108,Ostrowiecki[Ostrowiecki],1,0),IF($D108=Pińczowski[[#Headers],[Pińczowski]],VLOOKUP($E108,Pińczowski[Pińczowski],1,0),IF($D108=Sandomierski[[#Headers],[Sandomierski]],VLOOKUP($E108,Sandomierski[Sandomierski],1,0),IF($D108=Skarżyski[[#Headers],[Skarżyski]],VLOOKUP($E108,Skarżyski[Skarżyski],1,0),IF($D108=Starachowicki[[#Headers],[Starachowicki]],VLOOKUP($E108,Starachowicki[Starachowicki],1,0),IF($D108=Staszowski[[#Headers],[Staszowski]],VLOOKUP($E108,Staszowski[Staszowski],1,0),IF($D108=Włoszczowski[[#Headers],[Włoszczowski]],VLOOKUP($E108,Włoszczowski[Włoszczowski],1,0),\"\")))))))))))))","v":"Baćkowice"}]
[null,null,null,"opatowski","Iwaniska","gmina Iwaniska",2606023,"GM-W",{"$f":"VLOOKUP($F109,'DANE - K1 lit.A'!$D$7:$M$120,4,0)","v":"TAK"},{"$f":"VLOOKUP($F109,'DANE - K1 lit.A'!$D$7:$M$120,5,0)","v":"NIE"},{"$f":"VLOOKUP($F109,'DANE - K1 lit.A'!$D$7:$M$120,6,0)","v":"NIE"},{"$f":"IF($E109=\"\",\"\",VLOOKUP($F109,'DANE - K4 lit.B'!$D$6:$E$107,2,0))","v":"NIE"},{"$f":"IF($E109=\"\",\"\",VLOOKUP($F109,'DANE - K2 lit.C'!$B$14:$I$114,8,0))","v":"w przedziale od 30 do 50 minut"},null,null,{"$f":"IF($D109=Buski[[#Headers],[Buski]],VLOOKUP($E109,Buski[Buski],1,0),IF($D109=Jędrzejowski[[#Headers],[Jędrzejowski]],VLOOKUP($E109,Jędrzejowski[Jędrzejowski],1,0),IF($D109=Kazimierski[[#Headers],[Kazimierski]],VLOOKUP($E109,Kazimierski[Kazimierski],1,0),IF($D109=Kielecki[[#Headers],[Kielecki]],VLOOKUP($E109,Kielecki[Kielecki],1,0),IF($D109=Konecki[[#Headers],[Konecki]],VLOOKUP($E109,Konecki[Konecki],1,0),IF($D109=Opatowski[[#Headers],[Opatowski]],VLOOKUP($E109,Opatowski[Opatowski],1,0),IF($D109=Ostrowiecki[[#Headers],[Ostrowiecki]],VLOOKUP($E109,Ostrowiecki[Ostrowiecki],1,0),IF($D109=Pińczowski[[#Headers],[Pińczowski]],VLOOKUP($E109,Pińczowski[Pińczowski],1,0),IF($D109=Sandomierski[[#Headers],[Sandomierski]],VLOOKUP($E109,Sandomierski[Sandomierski],1,0),IF($D109=Skarżyski[[#Headers],[Skarżyski]],VLOOKUP($E109,Skarżyski[Skarżyski],1,0),IF($D109=Starachowicki[[#Headers],[Starachowicki]],VLOOKUP($E109,Starachowicki[Starachowicki],1,0),IF($D109=Staszowski[[#Headers],[Staszowski]],VLOOKUP($E109,Staszowski[Staszowski],1,0),IF($D109=Włoszczowski[[#Headers],[Włoszczowski]],VLOOKUP($E109,Włoszczowski[Włoszczowski],1,0),\"\")))))))))))))","v":"Iwaniska"}]
[null,null,null,"opatowski","Lipnik","gmina Lipnik",2606032,"GW",{"$f":"VLOOKUP($F110,'DANE - K1 lit.A'!$D$7:$M$120,4,0)","v":"TAK"},{"$f":"VLOOKUP($F110,'DANE - K1 lit.A'!$D$7:$M$120,5,0)","v":"TAK"},{"$f":"VLOOKUP($F110,'DANE - K1 lit.A'!$D$7:$M$120,6,0)","v":"NIE"},{"$f":"IF($E110=\"\",\"\",VLOOKUP($F110,'DANE - K4 lit.B'!$D$6:$E$107,2,0))","v":"NIE"},{"$f":"IF($E110=\"\",\"\",VLOOKUP($F110,'DANE - K2 lit.C'!$B$14:$I$114,8,0))","v":"w przedziale od 30 do 50 minut"},null,null,{"$f":"IF($D110=Buski[[#Headers],[Buski]],VLOOKUP($E110,Buski[Buski],1,0),IF($D110=Jędrzejowski[[#Headers],[Jędrzejowski]],VLOOKUP($E110,Jędrzejowski[Jędrzejowski],1,0),IF($D110=Kazimierski[[#Headers],[Kazimierski]],VLOOKUP($E110,Kazimierski[Kazimierski],1,0),IF($D110=Kielecki[[#Headers],[Kielecki]],VLOOKUP($E110,Kielecki[Kielecki],1,0),IF($D110=Konecki[[#Headers],[Konecki]],VLOOKUP($E110,Konecki[Konecki],1,0),IF($D110=Opatowski[[#Headers],[Opatowski]],VLOOKUP($E110,Opatowski[Opatowski],1,0),IF($D110=Ostrowiecki[[#Headers],[Ostrowiecki]],VLOOKUP($E110,Ostrowiecki[Ostrowiecki],1,0),IF($D110=Pińczowski[[#Headers],[Pińczowski]],VLOOKUP($E110,Pińczowski[Pińczowski],1,0),IF($D110=Sandomierski[[#Headers],[Sandomierski]],VLOOKUP($E110,Sandomierski[Sandomierski],1,0),IF($D110=Skarżyski[[#Headers],[Skarżyski]],VLOOKUP($E110,Skarżyski[Skarżyski],1,0),IF($D110=Starachowicki[[#Headers],[Starachowicki]],VLOOKUP($E110,Starachowicki[Starachowicki],1,0),IF($D110=Staszowski[[#Headers],[Staszowski]],VLOOKUP($E110,Staszowski[Staszowski],1,0),IF($D110=Włoszczowski[[#Headers],[Włoszczowski]],VLOOKUP($E110,Włoszczowski[Włoszczowski],1,0),\"\")))))))))))))","v":"Lipnik"}]
[null,null,null,"opatowski","Opatów","gmina Opatów",2606043,"GM-W",{"$f":"VLOOKUP($F111,'DANE - K1 lit.A'!$D$7:$M$120,4,0)","v":"TAK"},{"$f":"VLOOKUP($F111,'DANE - K1 lit.A'!$D$7:$M$120,5,0)","v":"NIE"},{"$f":"VLOOKUP($F111,'DANE - K1 lit.A'!$D$7:$M$120,6,0)","v":"NIE"},{"$f":"IF($E111=\"\",\"\",VLOOKUP($F111,'DANE - K4 lit.B'!$D$6:$E$107,2,0))","v":"NIE"},{"$f":"IF($E111=\"\",\"\",VLOOKUP($F111,'DANE - K2 lit.C'!$B$14:$I$114,8,0))","v":"w przedziale od 30 do 50 minut"},null,null,{"$f":"IF($D111=Buski[[#Headers],[Buski]],VLOOKUP($E111,Buski[Buski],1,0),IF($D111=Jędrzejowski[[#Headers],[Jędrzejowski]],VLOOKUP($E111,Jędrzejowski[Jędrzejowski],1,0),IF($D111=Kazimierski[[#Headers],[Kazimierski]],VLOOKUP($E111,Kazimierski[Kazimierski],1,0),IF($D111=Kielecki[[#Headers],[Kielecki]],VLOOKUP($E111,Kielecki[Kielecki],1,0),IF($D111=Konecki[[#Headers],[Konecki]],VLOOKUP($E111,Konecki[Konecki],1,0),IF($D111=Opatowski[[#Headers],[Opatowski]],VLOOKUP($E111,Opatowski[Opatowski],1,0),IF($D111=Ostrowiecki[[#Headers],[Ostrowiecki]],VLOOKUP($E111,Ostrowiecki[Ostrowiecki],1,0),IF($D111=Pińczowski[[#Headers],[Pińczowski]],VLOOKUP($E111,Pińczowski[Pińczowski],1,0),IF($D111=Sandomierski[[#Headers],[Sandomierski]],VLOOKUP($E111,Sandomierski[Sandomierski],1,0),IF($D111=Skarżyski[[#Headers],[Skarżyski]],VLOOKUP($E111,Skarżyski[Skarżyski],1,0),IF($D111=Starachowicki[[#Headers],[Starachowicki]],VLOOKUP($E111,Starachowicki[Starachowicki],1,0),IF($D111=Staszowski[[#Headers],[Staszowski]],VLOOKUP($E111,Staszowski[Staszowski],1,0),IF($D111=Włoszczowski[[#Headers],[Włoszczowski]],VLOOKUP($E111,Włoszczowski[Włoszczowski],1,0),\"\")))))))))))))","v":"Opatów"}]
[null,null,null,"opatowski","Ożarów","gmina Ożarów",2606053,"GM-W",{"$f":"VLOOKUP($F112,'DANE - K1 lit.A'!$D$7:$M$120,4,0)","v":"TAK"},{"$f":"VLOOKUP($F112,'DANE - K1 lit.A'!$D$7:$M$120,5,0)","v":"TAK"},{"$f":"VLOOKUP($F112,'DANE - K1 lit.A'!$D$7:$M$120,6,0)","v":"NIE"},{"$f":"IF($E112=\"\",\"\",VLOOKUP($F112,'DANE - K4 lit.B'!$D$6:$E$107,2,0))","v":"NIE"},{"$f":"IF($E112=\"\",\"\",VLOOKUP($F112,'DANE - K2 lit.C'!$B$14:$I$114,8,0))","v":"większy niż 50 minut"},null,null,{"$f":"IF($D112=Buski[[#Headers],[Buski]],VLOOKUP($E112,Buski[Buski],1,0),IF($D112=Jędrzejowski[[#Headers],[Jędrzejowski]],VLOOKUP($E112,Jędrzejowski[Jędrzejowski],1,0),IF($D112=Kazimierski[[#Headers],[Kazimierski]],VLOOKUP($E112,Kazimierski[Kazimierski],1,0),IF($D112=Kielecki[[#Headers],[Kielecki]],VLOOKUP($E112,Kielecki[Kielecki],1,0),IF($D112=Konecki[[#Headers],[Konecki]],VLOOKUP($E112,Konecki[Konecki],1,0),IF($D112=Opatowski[[#Headers],[Opatowski]],VLOOKUP($E112,Opatowski[Opatowski],1,0),IF($D112=Ostrowiecki[[#Headers],[Ostrowiecki]],VLOOKUP($E112,Ostrowiecki[Ostrowiecki],1,0),IF($D112=Pińczowski[[#Headers],[Pińczowski]],VLOOKUP($E112,Pińczowski[Pińczowski],1,0),IF($D112=Sandomierski[[#Headers],[Sandomierski]],VLOOKUP($E112,Sandomierski[Sandomierski],1,0),IF($D112=Skarżyski[[#Headers],[Skarżyski]],VLOOKUP($E112,Skarżyski[Skarżyski],1,0),IF($D112=Starachowicki[[#Headers],[Starachowicki]],VLOOKUP($E112,Starachowicki[Starachowicki],1,0),IF($D112=Staszowski[[#Headers],[Staszowski]],VLOOKUP($E112,Staszowski[Staszowski],1,0),IF($D112=Włoszczowski[[#Headers],[Włoszczowski]],VLOOKUP($E112,Włoszczowski[Włoszczowski],1,0),\"\")))))))))))))","v":"Ożarów"}]
[null,null,null,"opatowski","Sadowie","gmina Sadowie",2606062,"GW",{"$f":"VLOOKUP($F113,'DANE - K1 lit.A'!$D$7:$M$120,4,0)","v":"NIE"},{"$f":"VLOOKUP($F113,'DANE - K1 lit.A'!$D$7:$M$120,5,0)","v":"NIE"},{"$f":"VLOOKUP($F113,'DANE - K1 lit.A'!$D$7:$M$120,6,0)","v":"NIE"},{"$f":"IF($E113=\"\",\"\",VLOOKUP($F113,'DANE - K4 lit.B'!$D$6:$E$107,2,0))","v":"NIE"},{"$f":"IF($E113=\"\",\"\",VLOOKUP($F113,'DANE - K2 lit.C'!$B$14:$I$114,8,0))","v":"w przedziale od 30 do 50 minut"},null,null,{"$f":"IF($D113=Buski[[#Headers],[Buski]],VLOOKUP($E113,Buski[Buski],1,0),IF($D113=Jędrzejowski[[#Headers],[Jędrzejowski]],VLOOKUP($E113,Jędrzejowski[Jędrzejowski],1,0),IF($D113=Kazimierski[[#Headers],[Kazimierski]],VLOOKUP($E113,Kazimierski[Kazimierski],1,0),IF($D113=Kielecki[[#Headers],[Kielecki]],VLOOKUP($E113,Kielecki[Kielecki],1,0),IF($D113=Konecki[[#Headers],[Konecki]],VLOOKUP($E113,Konecki[Konecki],1,0),IF($D113=Opatowski[[#Headers],[Opatowski]],VLOOKUP($E113,Opatowski[Opatowski],1,0),IF($D113=Ostrowiecki[[#Headers],[Ostrowiecki]],VLOOKUP($E113,Ostrowiecki[Ostrowiecki],1,0),IF($D113=Pińczowski[[#Headers],[Pińczowski]],VLOOKUP($E113,Pińczowski[Pińczowski],1,0),IF($D113=Sandomierski[[#Headers],[Sandomierski]],VLOOKUP($E113,Sandomierski[Sandomierski],1,0),IF($D113=Skarżyski[[#Headers],[Skarżyski]],VLOOKUP($E113,Skarżyski[Skarżyski],1,0),IF($D113=Starachowicki[[#Headers],[Starachowicki]],VLOOKUP($E113,Starachowicki[Starachowicki],1,0),IF($D113=Staszowski[[#Headers],[Staszowski]],VLOOKUP($E113,Staszowski[Staszowski],1,0),IF($D113=Włoszczowski[[#Headers],[Włoszczowski]],VLOOKUP($E113,Włoszczowski[Włoszczowski],1,0),\"\")))))))))))))","v":"Sadowie"}]
[null,null,null,"opatowski","Tarłów","gmina Tarłów",2606072,"GW",{"$f":"VLOOKUP($F114,'DANE - K1 lit.A'!$D$7:$M$120,4,0)","v":"NIE"},{"$f":"VLOOKUP($F114,'DANE - K1 lit.A'!$D$7:$M$120,5,0)","v":"TAK"},{"$f":"VLOOKUP($F114,'DANE - K1 lit.A'!$D$7:$M$120,6,0)","v":"NIE"},{"$f":"IF($E114=\"\",\"\",VLOOKUP($F114,'DANE - K4 lit.B'!$D$6:$E$107,2,0))","v":"NIE"},{"$f":"IF($E114=\"\",\"\",VLOOKUP($F114,'DANE - K2 lit.C'!$B$14:$I$114,8,0))","v":"większy niż 50 minut"},null,null,{"$f":"IF($D114=Buski[[#Headers],[Buski]],VLOOKUP($E114,Buski[Buski],1,0),IF($D114=Jędrzejowski[[#Headers],[Jędrzejowski]],VLOOKUP($E114,Jędrzejowski[Jędrzejowski],1,0),IF($D114=Kazimierski[[#Headers],[Kazimierski]],VLOOKUP($E114,Kazimierski[Kazimierski],1,0),IF($D114=Kielecki[[#Headers],[Kielecki]],VLOOKUP($E114,Kielecki[Kielecki],1,0),IF($D114=Konecki[[#Headers],[Konecki]],VLOOKUP($E114,Konecki[Konecki],1,0),IF($D114=Opatowski[[#Headers],[Opatowski]],VLOOKUP($E114,Opatowski[Opatowski],1,0),IF($D114=Ostrowiecki[[#Headers],[Ostrowiecki]],VLOOKUP($E114,Ostrowiecki[Ostrowiecki],1,0),IF($D114=Pińczowski[[#Headers],[Pińczowski]],VLOOKUP($E114,Pińczowski[Pińczowski],1,0),IF($D114=Sandomierski[[#Headers],[Sandomierski]],VLOOKUP($E114,Sandomierski[Sandomierski],1,0),IF($D114=Skarżyski[[#Headers],[Skarżyski]],VLOOKUP($E114,Skarżyski[Skarżyski],1,0),IF($D114=Starachowicki[[#Headers],[Starachowicki]],VLOOKUP($E114,Starachowicki[Starachowicki],1,0),IF($D114=Staszowski[[#Headers],[Staszowski]],VLOOKUP($E114,Staszowski[Staszowski],1,0),IF($D114=Włoszczowski[[#Headers],[Włoszczowski]],VLOOKUP($E114,Włoszczowski[Włoszczowski],1,0),\"\")))))))))))))","v":"Tarłów"}]
[null,null,null,"opatowski","Wojciechowice","gmina Wojciechowice",2606082,"GW",{"$f":"VLOOKUP($F115,'DANE - K1 lit.A'!$D$7:$M$120,4,0)","v":"TAK"},{"$f":"VLOOKUP($F115,'DANE - K1 lit.A'!$D$7:$M$120,5,0)","v":"TAK"},{"$f":"VLOOKUP($F115,'DANE - K1 lit.A'!$D$7:$M$120,6,0)","v":"TAK"},{"$f":"IF($E115=\"\",\"\",VLOOKUP($F115,'DANE - K4 lit.B'!$D$6:$E$107,2,0))","v":"NIE"},{"$f":"IF($E115=\"\",\"\",VLOOKUP($F115,'DANE - K2 lit.C'!$B$14:$I$114,8,0))","v":"w przedziale od 30 do 50 minut"},null,null,{"$f":"IF($D115=Buski[[#Headers],[Buski]],VLOOKUP($E115,Buski[Buski],1,0),IF($D115=Jędrzejowski[[#Headers],[Jędrzejowski]],VLOOKUP($E115,Jędrzejowski[Jędrzejowski],1,0),IF($D115=Kazimierski[[#Headers],[Kazimierski]],VLOOKUP($E115,Kazimierski[Kazimierski],1,0),IF($D115=Kielecki[[#Headers],[Kielecki]],VLOOKUP($E115,Kielecki[Kielecki],1,0),IF($D115=Konecki[[#Headers],[Konecki]],VLOOKUP($E115,Konecki[Konecki],1,0),IF($D115=Opatowski[[#Headers],[Opatowski]],VLOOKUP($E115,Opatowski[Opatowski],1,0),IF($D115=Ostrowiecki[[#Headers],[Ostrowiecki]],VLOOKUP($E115,Ostrowiecki[Ostrowiecki],1,0),IF($D115=Pińczowski[[#Headers],[Pińczowski]],VLOOKUP($E115,Pińczowski[Pińczowski],1,0),IF($D115=Sandomierski[[#Headers],[Sandomierski]],VLOOKUP($E115,Sandomierski[Sandomierski],1,0),IF($D115=Skarżyski[[#Headers],[Skarżyski]],VLOOKUP($E115,Skarżyski[Skarżyski],1,0),IF($D115=Starachowicki[[#Headers],[Starachowicki]],VLOOKUP($E115,Starachowicki[Starachowicki],1,0),IF($D115=Staszowski[[#Headers],[Staszowski]],VLOOKUP($E115,Staszowski[Staszowski],1,0),IF($D115=Włoszczowski[[#Headers],[Włoszczowski]],VLOOKUP($E115,Włoszczowski[Włoszczowski],1,0),\"\")))))))))))))","v":"Wojciechowice"}]
[null,null,null,"ostrowiecki","Bałtów","gmina Bałtów",2607022,"GW",{"$f":"VLOOKUP($F116,'DANE - K1 lit.A'!$D$7:$M$120,4,0)","v":"NIE"},{"$f":"VLOOKUP($F116,'DANE - K1 lit.A'!$D$7:$M$120,5,0)","v":"TAK"},{"$f":"VLOOKUP($F116,'DANE - K1 lit.A'!$D$7:$M$120,6,0)","v":"NIE"},{"$f":"IF($E116=\"\",\"\",VLOOKUP($F116,'DANE - K4 lit.B'!$D$6:$E$107,2,0))","v":"NIE"},{"$f":"IF($E116=\"\",\"\",VLOOKUP($F116,'DANE - K2 lit.C'!$B$14:$I$114,8,0))","v":"większy niż 50 minut"},null,null,{"$f":"IF($D116=Buski[[#Headers],[Buski]],VLOOKUP($E116,Buski[Buski],1,0),IF($D116=Jędrzejowski[[#Headers],[Jędrzejowski]],VLOOKUP($E116,Jędrzejowski[Jędrzejowski],1,0),IF($D116=Kazimierski[[#Headers],[Kazimierski]],VLOOKUP($E116,Kazimierski[Kazimierski],1,0),IF($D116=Kielecki[[#Headers],[Kielecki]],VLOOKUP($E116,Kielecki[Kielecki],1,0),IF($D116=Konecki[[#Headers],[Konecki]],VLOOKUP($E116,Konecki[Konecki],1,0),IF($D116=Opatowski[[#Headers],[Opatowski]],VLOOKUP($E116,Opatowski[Opatowski],1,0),IF($D116=Ostrowiecki[[#Headers],[Ostrowiecki]],VLOOKUP($E116,Ostrowiecki[Ostrowiecki],1,0),IF($D116=Pińczowski[[#Headers],[Pińczowski]],VLOOKUP($E116,Pińczowski[Pińczowski],1,0),IF($D116=Sandomierski[[#Headers],[Sandomierski]],VLOOKUP($E116,Sandomierski[Sandomierski],1,0),IF($D116=Skarżyski[[#Headers],[Skarżyski]],VLOOKUP($E116,Skarżyski[Skarżyski],1,0),IF($D116=Starachowicki[[#Headers],[Starachowicki]],VLOOKUP($E116,Starachowicki[Starachowicki],1,0),IF($D116=Staszowski[[#Headers],[Staszowski]],VLOOKUP($E116,Staszowski[Staszowski],1,0),IF($D116=Włoszczowski[[#Headers],[Włoszczowski]],VLOOKUP($E116,Włoszczowski[Włoszczowski],1,0),\"\")))))))))))))","v":"Bałtów"}]
[null,null,null,"ostrowiecki","Bodzechów","gmina Bodzechów",2607032,"GW",{"$f":"VLOOKUP($F117,'DANE - K1 lit.A'!$D$7:$M$120,4,0)","v":"TAK"},{"$f":"VLOOKUP($F117,'DANE - K1 lit.A'!$D$7:$M$120,5,0)","v":"TAK"},{"$f":"VLOOKUP($F117,'DANE - K1 lit.A'!$D$7:$M$120,6,0)","v":"TAK"},{"$f":"IF($E117=\"\",\"\",VLOOKUP($F117,'DANE - K4 lit.B'!$D$6:$E$107,2,0))","v":"NIE"},{"$f":"IF($E117=\"\",\"\",VLOOKUP($F117,'DANE - K2 lit.C'!$B$14:$I$114,8,0))","v":"większy niż 50 minut"},null,null,{"$f":"IF($D117=Buski[[#Headers],[Buski]],VLOOKUP($E117,Buski[Buski],1,0),IF($D117=Jędrzejowski[[#Headers],[Jędrzejowski]],VLOOKUP($E117,Jędrzejowski[Jędrzejowski],1,0),IF($D117=Kazimierski[[#Headers],[Kazimierski]],VLOOKUP($E117,Kazimierski[Kazimierski],1,0),IF($D117=Kielecki[[#Headers],[Kielecki]],VLOOKUP($E117,Kielecki[Kielecki],1,0),IF($D117=Konecki[[#Headers],[Konecki]],VLOOKUP($E117,Konecki[Konecki],1,0),IF($D117=Opatowski[[#Headers],[Opatowski]],VLOOKUP($E117,Opatowski[Opatowski],1,0),IF($D117=Ostrowiecki[[#Headers],[Ostrowiecki]],VLOOKUP($E117,Ostrowiecki[Ostrowiecki],1,0),IF($D117=Pińczowski[[#Headers],[Pińczowski]],VLOOKUP($E117,Pińczowski[Pińczowski],1,0),IF($D117=Sandomierski[[#Headers],[Sandomierski]],VLOOKUP($E117,Sandomierski[Sandomierski],1,0),IF($D117=Skarżyski[[#Headers],[Skarżyski]],VLOOKUP($E117,Skarżyski[Skarżyski],1,0),IF($D117=Starachowicki[[#Headers],[Starachowicki]],VLOOKUP($E117,Starachowicki[Starachowicki],1,0),IF($D117=Staszowski[[#Headers],[Staszowski]],VLOOKUP($E117,Staszowski[Staszowski],1,0),IF($D117=Włoszczowski[[#Headers],[Włoszczowski]],VLOOKUP($E117,Włoszczowski[Włoszczowski],1,0),\"\")))))))))))))","v":"Bodzechów"}]
[null,null,null,"ostrowiecki","Ćmielów","gmina Ćmielów",2607043,"GM-W",{"$f":"VLOOKUP($F118,'DANE - K1 lit.A'!$D$7:$M$120,4,0)","v":"TAK"},{"$f":"VLOOKUP($F118,'DANE - K1 lit.A'!$D$7:$M$120,5,0)","v":"TAK"},{"$f":"VLOOKUP($F118,'DANE - K1 lit.A'!$D$7:$M$120,6,0)","v":"NIE"},{"$f":"IF($E118=\"\",\"\",VLOOKUP($F118,'DANE - K4 lit.B'!$D$6:$E$107,2,0))","v":"NIE"},{"$f":"IF($E118=\"\",\"\",VLOOKUP($F118,'DANE - K2 lit.C'!$B$14:$I$114,8,0))","v":"większy niż 50 minut"},null,null,{"$f":"IF($D118=Buski[[#Headers],[Buski]],VLOOKUP($E118,Buski[Buski],1,0),IF($D118=Jędrzejowski[[#Headers],[Jędrzejowski]],VLOOKUP($E118,Jędrzejowski[Jędrzejowski],1,0),IF($D118=Kazimierski[[#Headers],[Kazimierski]],VLOOKUP($E118,Kazimierski[Kazimierski],1,0),IF($D118=Kielecki[[#Headers],[Kielecki]],VLOOKUP($E118,Kielecki[Kielecki],1,0),IF($D118=Konecki[[#Headers],[Konecki]],VLOOKUP($E118,Konecki[Konecki],1,0),IF($D118=Opatowski[[#Headers],[Opatowski]],VLOOKUP($E118,Opatowski[Opatowski],1,0),IF($D118=Ostrowiecki[[#Headers],[Ostrowiecki]],VLOOKUP($E118,Ostrowiecki[Ostrowiecki],1,0),IF($D118=Pińczowski[[#Headers],[Pińczowski]],VLOOKUP($E118,Pińczowski[Pińczowski],1,0),IF($D118=Sandomierski[[#Headers],[Sandomierski]],VLOOKUP($E118,Sandomierski[Sandomierski],1,0),IF($D118=Skarżyski[[#Headers],[Skarżyski]],VLOOKUP($E118,Skarżyski[Skarżyski],1,0),IF($D118=Starachowicki[[#Headers],[Starachowicki]],VLOOKUP($E118,Starachowicki[Starachowicki],1,0),IF($D118=Staszowski[[#Headers],[Staszowski]],VLOOKUP($E118,Staszowski[Staszowski],1,0),IF($D118=Włoszczowski[[#Headers],[Włoszczowski]],VLOOKUP($E118,Włoszczowski[Włoszczowski],1,0),\"\")))))))))))))","v":"Ćmielów"}]
[null,null,null,"ostrowiecki","Kunów","gmina Kunów",2607053,"GM-W",{"$f":"VLOOKUP($F119,'DANE - K1 lit.A'!$D$7:$M$120,4,0)","v":"NIE"},{"$f":"VLOOKUP($F119,'DANE - K1 lit.A'!$D$7:$M$120,5,0)","v":"TAK"},{"$f":"VLOOKUP($F119,'DANE - K1 lit.A'!$D$7:$M$120,6,0)","v":"NIE"},{"$f":"IF($E119=\"\",\"\",VLOOKUP($F119,'DANE - K4 lit.B'!$D$6:$E$107,2,0))","v":"NIE"},{"$f":"IF($E119=\"\",\"\",VLOOKUP($F119,'DANE - K2 lit.C'!$B$14:$I$114,8,0))","v":"większy niż 50 minut"},null,null,{"$f":"IF($D119=Buski[[#Headers],[Buski]],VLOOKUP($E119,Buski[Buski],1,0),IF($D119=Jędrzejowski[[#Headers],[Jędrzejowski]],VLOOKUP($E119,Jędrzejowski[Jędrzejowski],1,0),IF($D119=Kazimierski[[#Headers],[Kazimierski]],VLOOKUP($E119,Kazimierski[Kazimierski],1,0),IF($D119=Kielecki[[#Headers],[Kielecki]],VLOOKUP($E119,Kielecki[Kielecki],1,0),IF($D119=Konecki[[#Headers],[Konecki]],VLOOKUP($E119,Konecki[Konecki],1,0),IF($D119=Opatowski[[#Headers],[Opatowski]],VLOOKUP($E119,Opatowski[Opatowski],1,0),IF($D119=Ostrowiecki[[#Headers],[Ostrowiecki]],VLOOKUP($E119,Ostrowiecki[Ostrowiecki],1,0),IF($D119=Pińczowski[[#Headers],[Pińczowski]],VLOOKUP($E119,Pińczowski[Pińczowski],1,0),IF($D119=Sandomierski[[#Headers],[Sandomierski]],VLOOKUP($E119,Sandomierski[Sandomierski],1,0),IF($D119=Skarżyski[[#Headers],[Skarżyski]],VLOOKUP($E119,Skarżyski[Skarżyski],1,0),IF($D119=Starachowicki[[#Headers],[Starachowicki]],VLOOKUP($E119,Starachowicki[Starachowicki],1,0),IF($D119=Staszowski[[#Headers],[Staszowski]],VLOOKUP($E119,Staszowski[Staszowski],1,0),IF($D119=Włoszczowski[[#Headers],[Włoszczowski]],VLOOKUP($E119,Włoszczowski[Włoszczowski],1,0),\"\")))))))))))))","v":"Kunów"}]
[null,null,null,"ostrowiecki","Ostrowiec Świętokrzyski","gmina Ostrowiec Świętokrzyski",2607011,"GM",{"$f":"VLOOKUP($F120,'DANE - K1 lit.A'!$D$7:$M$120,4,0)","v":"TAK"},{"$f":"VLOOKUP($F120,'DANE - K1 lit.A'!$D$7:$M$120,5,0)","v":"TAK"},{"$f":"VLOOKUP($F120,'DANE - K1 lit.A'!$D$7:$M$120,6,0)","v":"TAK"},{"$f":"IF($E120=\"\",\"\",VLOOKUP($F120,'DANE - K4 lit.B'!$D$6:$E$107,2,0))","v":"TAK"},{"$f":"IF($E120=\"\",\"\",VLOOKUP($F120,'DANE - K2 lit.C'!$B$14:$I$114,8,0))","v":"w przedziale od 30 do 50 minut"},null,null,{"$f":"IF($D120=Buski[[#Headers],[Buski]],VLOOKUP($E120,Buski[Buski],1,0),IF($D120=Jędrzejowski[[#Headers],[Jędrzejowski]],VLOOKUP($E120,Jędrzejowski[Jędrzejowski],1,0),IF($D120=Kazimierski[[#Headers],[Kazimierski]],VLOOKUP($E120,Kazimierski[Kazimierski],1,0),IF($D120=Kielecki[[#Headers],[Kielecki]],VLOOKUP($E120,Kielecki[Kielecki],1,0),IF($D120=Konecki[[#Headers],[Konecki]],VLOOKUP($E120,Konecki[Konecki],1,0),IF($D120=Opatowski[[#Headers],[Opatowski]],VLOOKUP($E120,Opatowski[Opatowski],1,0),IF($D120=Ostrowiecki[[#Headers],[Ostrowiecki]],VLOOKUP($E120,Ostrowiecki[Ostrowiecki],1,0),IF($D120=Pińczowski[[#Headers],[Pińczowski]],VLOOKUP($E120,Pińczowski[Pińczowski],1,0),IF($D120=Sandomierski[[#Headers],[Sandomierski]],VLOOKUP($E120,Sandomierski[Sandomierski],1,0),IF($D120=Skarżyski[[#Headers],[Skarżyski]],VLOOKUP($E120,Skarżyski[Skarżyski],1,0),IF($D120=Starachowicki[[#Headers],[Starachowicki]],VLOOKUP($E120,Starachowicki[Starachowicki],1,0),IF($D120=Staszowski[[#Headers],[Staszowski]],VLOOKUP($E120,Staszowski[Staszowski],1,0),IF($D120=Włoszczowski[[#Headers],[Włoszczowski]],VLOOKUP($E120,Włoszczowski[Włoszczowski],1,0),\"\")))))))))))))","v":"Ostrowiec Świętokrzyski"}]
[null,null,null,"ostrowiecki","Waśniów","gmina Waśniów",2607062,"GW",{"$f":"VLOOKUP($F121,'DANE - K1 lit.A'!$D$7:$M$120,4,0)","v":"TAK"},{"$f":"VLOOKUP($F121,'DANE - K1 lit.A'!$D$7:$M$120,5,0)","v":"TAK"},{"$f":"VLOOKUP($F121,'DANE - K1 lit.A'!$D$7:$M$120,6,0)","v":"TAK"},{"$f":"IF($E121=\"\",\"\",VLOOKUP($F121,'DANE - K4 lit.B'!$D$6:$E$107,2,0))","v":"NIE"},{"$f":"IF($E121=\"\",\"\",VLOOKUP($F121,'DANE - K2 lit.C'!$B$14:$I$114,8,0))","v":"w przedziale od 30 do 50 minut"},null,null,{"$f":"IF($D121=Buski[[#Headers],[Buski]],VLOOKUP($E121,Buski[Buski],1,0),IF($D121=Jędrzejowski[[#Headers],[Jędrzejowski]],VLOOKUP($E121,Jędrzejowski[Jędrzejowski],1,0),IF($D121=Kazimierski[[#Headers],[Kazimierski]],VLOOKUP($E121,Kazimierski[Kazimierski],1,0),IF($D121=Kielecki[[#Headers],[Kielecki]],VLOOKUP($E121,Kielecki[Kielecki],1,0),IF($D121=Konecki[[#Headers],[Konecki]],VLOOKUP($E121,Konecki[Konecki],1,0),IF($D121=Opatowski[[#Headers],[Opatowski]],VLOOKUP($E121,Opatowski[Opatowski],1,0),IF($D121=Ostrowiecki[[#Headers],[Ostrowiecki]],VLOOKUP($E121,Ostrowiecki[Ostrowiecki],1,0),IF($D121=Pińczowski[[#Headers],[Pińczowski]],VLOOKUP($E121,Pińczowski[Pińczowski],1,0),IF($D121=Sandomierski[[#Headers],[Sandomierski]],VLOOKUP($E121,Sandomierski[Sandomierski],1,0),IF($D121=Skarżyski[[#Headers],[Skarżyski]],VLOOKUP($E121,Skarżyski[Skarżyski],1,0),IF($D121=Starachowicki[[#Headers],[Starachowicki]],VLOOKUP($E121,Starachowicki[Starachowicki],1,0),IF($D121=Staszowski[[#Headers],[Staszowski]],VLOOKUP($E121,Staszowski[Staszowski],1,0),IF($D121=Włoszczowski[[#Headers],[Włoszczowski]],VLOOKUP($E121,Włoszczowski[Włoszczowski],1,0),\"\")))))))))))))","v":"Waśniów"}]
[null,null,null,"pińczowski","Działoszyce","gmina Działoszyce",2608013,"GM-W",{"$f":"VLOOKUP($F122,'DANE - K1 lit.A'!$D$7:$M$120,4,0)","v":"NIE"},{"$f":"VLOOKUP($F122,'DANE - K1 lit.A'!$D$7:$M$120,5,0)","v":"NIE"},{"$f":"VLOOKUP($F122,'DANE - K1 lit.A'!$D$7:$M$120,6,0)","v":"NIE"},{"$f":"IF($E122=\"\",\"\",VLOOKUP($F122,'DANE - K4 lit.B'!$D$6:$E$107,2,0))","v":"NIE"},{"$f":"IF($E122=\"\",\"\",VLOOKUP($F122,'DANE - K2 lit.C'!$B$14:$I$114,8,0))","v":"w przedziale od 30 do 50 minut"},null,null,{"$f":"IF($D122=Buski[[#Headers],[Buski]],VLOOKUP($E122,Buski[Buski],1,0),IF($D122=Jędrzejowski[[#Headers],[Jędrzejowski]],VLOOKUP($E122,Jędrzejowski[Jędrzejowski],1,0),IF($D122=Kazimierski[[#Headers],[Kazimierski]],VLOOKUP($E122,Kazimierski[Kazimierski],1,0),IF($D122=Kielecki[[#Headers],[Kielecki]],VLOOKUP($E122,Kielecki[Kielecki],1,0),IF($D122=Konecki[[#Headers],[Konecki]],VLOOKUP($E122,Konecki[Konecki],1,0),IF($D122=Opatowski[[#Headers],[Opatowski]],VLOOKUP($E122,Opatowski[Opatowski],1,0),IF($D122=Ostrowiecki[[#Headers],[Ostrowiecki]],VLOOKUP($E122,Ostrowiecki[Ostrowiecki],1,0),IF($D122=Pińczowski[[#Headers],[Pińczowski]],VLOOKUP($E122,Pińczowski[Pińczowski],1,0),IF($D122=Sandomierski[[#Headers],[Sandomierski]],VLOOKUP($E122,Sandomierski[Sandomierski],1,0),IF($D122=Skarżyski[[#Headers],[Skarżyski]],VLOOKUP($E122,Skarżyski[Skarżyski],1,0),IF($D122=Starachowicki[[#Headers],[Starachowicki]],VLOOKUP($E122,Starachowicki[Starachowicki],1,0),IF($D122=Staszowski[[#Headers],[Staszowski]],VLOOKUP($E122,Staszowski[Staszowski],1,0),IF($D122=Włoszczowski[[#Headers],[Włoszczowski]],VLOOKUP($E122,Włoszczowski[Włoszczowski],1,0),\"\")))))))))))))","v":"Działoszyce"}]
[null,null,null,"pińczowski","Kije","gmina Kije",2608022,"GW",{"$f":"VLOOKUP($F123,'DANE - K1 lit.A'!$D$7:$M$120,4,0)","v":"NIE"},{"$f":"VLOOKUP($F123,'DANE - K1 lit.A'!$D$7:$M$120,5,0)","v":"NIE"},{"$f":"VLOOKUP($F123,'DANE - K1 lit.A'!$D$7:$M$120,6,0)","v":"NIE"},{"$f":"IF($E123=\"\",\"\",VLOOKUP($F123,'DANE - K4 lit.B'!$D$6:$E$107,2,0))","v":"NIE"},{"$f":"IF($E123=\"\",\"\",VLOOKUP($F123,'DANE - K2 lit.C'!$B$14:$I$114,8,0))","v":"w przedziale od 30 do 50 minut"},null,null,{"$f":"IF($D123=Buski[[#Headers],[Buski]],VLOOKUP($E123,Buski[Buski],1,0),IF($D123=Jędrzejowski[[#Headers],[Jędrzejowski]],VLOOKUP($E123,Jędrzejowski[Jędrzejowski],1,0),IF($D123=Kazimierski[[#Headers],[Kazimierski]],VLOOKUP($E123,Kazimierski[Kazimierski],1,0),IF($D123=Kielecki[[#Headers],[Kielecki]],VLOOKUP($E123,Kielecki[Kielecki],1,0),IF($D123=Konecki[[#Headers],[Konecki]],VLOOKUP($E123,Konecki[Konecki],1,0),IF($D123=Opatowski[[#Headers],[Opatowski]],VLOOKUP($E123,Opatowski[Opatowski],1,0),IF($D123=Ostrowiecki[[#Headers],[Ostrowiecki]],VLOOKUP($E123,Ostrowiecki[Ostrowiecki],1,0),IF($D123=Pińczowski[[#Headers],[Pińczowski]],VLOOKUP($E123,Pińczowski[Pińczowski],1,0),IF($D123=Sandomierski[[#Headers],[Sandomierski]],VLOOKUP($E123,Sandomierski[Sandomierski],1,0),IF($D123=Skarżyski[[#Headers],[Skarżyski]],VLOOKUP($E123,Skarżyski[Skarżyski],1,0),IF($D123=Starachowicki[[#Headers],[Starachowicki]],VLOOKUP($E123,Starachowicki[Starachowicki],1,0),IF($D123=Staszowski[[#Headers],[Staszowski]],VLOOKUP($E123,Staszowski[Staszowski],1,0),IF($D123=Włoszczowski[[#Headers],[Włoszczowski]],VLOOKUP($E123,Włoszczowski[Włoszczowski],1,0),\"\")))))))))))))","v":"Kije"}]
[null,null,null,"pińczowski","Michałów","gmina Michałów",2608032,"GW",{"$f":"VLOOKUP($F124,'DANE - K1 lit.A'!$D$7:$M$120,4,0)","v":"NIE"},{"$f":"VLOOKUP($F124,'DANE - K1 lit.A'!$D$7:$M$120,5,0)","v":"TAK"},{"$f":"VLOOKUP($F124,'DANE - K1 lit.A'!$D$7:$M$120,6,0)","v":"NIE"},{"$f":"IF($E124=\"\",\"\",VLOOKUP($F124,'DANE - K4 lit.B'!$D$6:$E$107,2,0))","v":"NIE"},{"$f":"IF($E124=\"\",\"\",VLOOKUP($F124,'DANE - K2 lit.C'!$B$14:$I$114,8,0))","v":"w przedziale od 30 do 50 minut"},null,null,{"$f":"IF($D124=Buski[[#Headers],[Buski]],VLOOKUP($E124,Buski[Buski],1,0),IF($D124=Jędrzejowski[[#Headers],[Jędrzejowski]],VLOOKUP($E124,Jędrzejowski[Jędrzejowski],1,0),IF($D124=Kazimierski[[#Headers],[Kazimierski]],VLOOKUP($E124,Kazimierski[Kazimierski],1,0),IF($D124=Kielecki[[#Headers],[Kielecki]],VLOOKUP($E124,Kielecki[Kielecki],1,0),IF($D124=Konecki[[#Headers],[Konecki]],VLOOKUP($E124,Konecki[Konecki],1,0),IF($D124=Opatowski[[#Headers],[Opatowski]],VLOOKUP($E124,Opatowski[Opatowski],1,0),IF($D124=Ostrowiecki[[#Headers],[Ostrowiecki]],VLOOKUP($E124,Ostrowiecki[Ostrowiecki],1,0),IF($D124=Pińczowski[[#Headers],[Pińczowski]],VLOOKUP($E124,Pińczowski[Pińczowski],1,0),IF($D124=Sandomierski[[#Headers],[Sandomierski]],VLOOKUP($E124,Sandomierski[Sandomierski],1,0),IF($D124=Skarżyski[[#Headers],[Skarżyski]],VLOOKUP($E124,Skarżyski[Skarżyski],1,0),IF($D124=Starachowicki[[#Headers],[Starachowicki]],VLOOKUP($E124,Starachowicki[Starachowicki],1,0),IF($D124=Staszowski[[#Headers],[Staszowski]],VLOOKUP($E124,Staszowski[Staszowski],1,0),IF($D124=Włoszczowski[[#Headers],[Włoszczowski]],VLOOKUP($E124,Włoszczowski[Włoszczowski],1,0),\"\")))))))))))))","v":"Michałów"}]
[null,null,null,"pińczowski","Pińczów","gmina Pińczów",2608043,"GM-W",{"$f":"VLOOKUP($F125,'DANE - K1 lit.A'!$D$7:$M$120,4,0)","v":"TAK"},{"$f":"VLOOKUP($F125,'DANE - K1 lit.A'!$D$7:$M$120,5,0)","v":"TAK"},{"$f":"VLOOKUP($F125,'DANE - K1 lit.A'!$D$7:$M$120,6,0)","v":"TAK"},{"$f":"IF($E125=\"\",\"\",VLOOKUP($F125,'DANE - K4 lit.B'!$D$6:$E$107,2,0))","v":"NIE"},{"$f":"IF($E125=\"\",\"\",VLOOKUP($F125,'DANE - K2 lit.C'!$B$14:$I$114,8,0))","v":"w przedziale od 30 do 50 minut"},null,null,{"$f":"IF($D125=Buski[[#Headers],[Buski]],VLOOKUP($E125,Buski[Buski],1,0),IF($D125=Jędrzejowski[[#Headers],[Jędrzejowski]],VLOOKUP($E125,Jędrzejowski[Jędrzejowski],1,0),IF($D125=Kazimierski[[#Headers],[Kazimierski]],VLOOKUP($E125,Kazimierski[Kazimierski],1,0),IF($D125=Kielecki[[#Headers],[Kielecki]],VLOOKUP($E125,Kielecki[Kielecki],1,0),IF($D125=Konecki[[#Headers],[Konecki]],VLOOKUP($E125,Konecki[Konecki],1,0),IF($D125=Opatowski[[#Headers],[Opatowski]],VLOOKUP($E125,Opatowski[Opatowski],1,0),IF($D125=Ostrowiecki[[#Headers],[Ostrowiecki]],VLOOKUP($E125,Ostrowiecki[Ostrowiecki],1,0),IF($D125=Pińczowski[[#Headers],[Pińczowski]],VLOOKUP($E125,Pińczowski[Pińczowski],1,0),IF($D125=Sandomierski[[#Headers],[Sandomierski]],VLOOKUP($E125,Sandomierski[Sandomierski],1,0),IF($D125=Skarżyski[[#Headers],[Skarżyski]],VLOOKUP($E125,Skarżyski[Skarżyski],1,0),IF($D125=Starachowicki[[#Headers],[Starachowicki]],VLOOKUP($E125,Starachowicki[Starachowicki],1,0),IF($D125=Staszowski[[#Headers],[Staszowski]],VLOOKUP($E125,Staszowski[Staszowski],1,0),IF($D125=Włoszczowski[[#Headers],[Włoszczowski]],VLOOKUP($E125,Włoszczowski[Włoszczowski],1,0),\"\")))))))))))))","v":"Pińczów"}]
[null,null,null,"pińczowski","Złota","gmina Złota",2608052,"GW",{"$f":"VLOOKUP($F126,'DANE - K1 lit.A'!$D$7:$M$120,4,0)","v":"NIE"},{"$f":"VLOOKUP($F126,'DANE - K1 lit.A'!$D$7:$M$120,5,0)","v":"NIE"},{"$f":"VLOOKUP($F126,'DANE - K1 lit.A'!$D$7:$M$120,6,0)","v":"NIE"},{"$f":"IF($E126=\"\",\"\",VLOOKUP($F126,'DANE - K4 lit.B'!$D$6:$E$107,2,0))","v":"NIE"},{"$f":"IF($E126=\"\",\"\",VLOOKUP($F126,'DANE - K2 lit.C'!$B$14:$I$114,8,0))","v":"większy niż 50 minut"},null,null,{"$f":"IF($D126=Buski[[#Headers],[Buski]],VLOOKUP($E126,Buski[Buski],1,0),IF($D126=Jędrzejowski[[#Headers],[Jędrzejowski]],VLOOKUP($E126,Jędrzejowski[Jędrzejowski],1,0),IF($D126=Kazimierski[[#Headers],[Kazimierski]],VLOOKUP($E126,Kazimierski[Kazimierski],1,0),IF($D126=Kielecki[[#Headers],[Kielecki]],VLOOKUP($E126,Kielecki[Kielecki],1,0),IF($D126=Konecki[[#Headers],[Konecki]],VLOOKUP($E126,Konecki[Konecki],1,0),IF($D126=Opatowski[[#Headers],[Opatowski]],VLOOKUP($E126,Opatowski[Opatowski],1,0),IF($D126=Ostrowiecki[[#Headers],[Ostrowiecki]],VLOOKUP($E126,Ostrowiecki[Ostrowiecki],1,0),IF($D126=Pińczowski[[#Headers],[Pińczowski]],VLOOKUP($E126,Pińczowski[Pińczowski],1,0),IF($D126=Sandomierski[[#Headers],[Sandomierski]],VLOOKUP($E126,Sandomierski[Sandomierski],1,0),IF($D126=Skarżyski[[#Headers],[Skarżyski]],VLOOKUP($E126,Skarżyski[Skarżyski],1,0),IF($D126=Starachowicki[[#Headers],[Starachowicki]],VLOOKUP($E126,Starachowicki[Starachowicki],1,0),IF($D126=Staszowski[[#Headers],[Staszowski]],VLOOKUP($E126,Staszowski[Staszowski],1,0),IF($D126=Włoszczowski[[#Headers],[Włoszczowski]],VLOOKUP($E126,Włoszczowski[Włoszczowski],1,0),\"\")))))))))))))","v":"Złota"}]
[null,null,null,"sandomierski","Dwikozy","gmina Dwikozy",2609022,"GW",{"$f":"VLOOKUP($F127,'DANE - K1 lit.A'!$D$7:$M$120,4,0)","v":"NIE"},{"$f":"VLOOKUP($F127,'DANE - K1 lit.A'!$D$7:$M$120,5,0)","v":"NIE"},{"$f":"VLOOKUP($F127,'DANE - K1 lit.A'!$D$7:$M$120,6,0)","v":"NIE"},{"$f":"IF($E127=\"\",\"\",VLOOKUP($F127,'DANE - K4 lit.B'!$D$6:$E$107,2,0))","v":"NIE"},{"$f":"IF($E127=\"\",\"\",VLOOKUP($F127,'DANE - K2 lit.C'!$B$14:$I$114,8,0))","v":"w przedziale od 30 do 50 minut"},null,null,{"$f":"IF($D127=Buski[[#Headers],[Buski]],VLOOKUP($E127,Buski[Buski],1,0),IF($D127=Jędrzejowski[[#Headers],[Jędrzejowski]],VLOOKUP($E127,Jędrzejowski[Jędrzejowski],1,0),IF($D127=Kazimierski[[#Headers],[Kazimierski]],VLOOKUP($E127,Kazimierski[Kazimierski],1,0),IF($D127=Kielecki[[#Headers],[Kielecki]],VLOOKUP($E127,Kielecki[Kielecki],1,0),IF($D127=Konecki[[#Headers],[Konecki]],VLOOKUP($E127,Konecki[Konecki],1,0),IF($D127=Opatowski[[#Headers],[Opatowski]],VLOOKUP($E127,Opatowski[Opatowski],1,0),IF($D127=Ostrowiecki[[#Headers],[Ostrowiecki]],VLOOKUP($E127,Ostrowiecki[Ostrowiecki],1,0),IF($D127=Pińczowski[[#Headers],[Pińczowski]],VLOOKUP($E127,Pińczowski[Pińczowski],1,0),IF($D127=Sandomierski[[#Headers],[Sandomierski]],VLOOKUP($E127,Sandomierski[Sandomierski],1,0),IF($D127=Skarżyski[[#Headers],[Skarżyski]],VLOOKUP($E127,Skarżyski[Skarżyski],1,0),IF($D127=Starachowicki[[#Headers],[Starachowicki]],VLOOKUP($E127,Starachowicki[Starachowicki],1,0),IF($D127=Staszowski[[#Headers],[Staszowski]],VLOOKUP($E127,Staszowski[Staszowski],1,0),IF($D127=Włoszczowski[[#Headers],[Włoszczowski]],VLOOKUP($E127,Włoszczowski[Włoszczowski],1,0),\"\")))))))))))))","v":"Dwikozy"}]
[null,null,null,"sandomierski","Klimontów","gmina Klimontów",2609033,"GM-W",{"$f":"VLOOKUP($F128,'DANE - K1 lit.A'!$D$7:$M$120,4,0)","v":"TAK"},{"$f":"VLOOKUP($F128,'DANE - K1 lit.A'!$D$7:$M$120,5,0)","v":"TAK"},{"$f":"VLOOKUP($F128,'DANE - K1 lit.A'!$D$7:$M$120,6,0)","v":"TAK"},{"$f":"IF($E128=\"\",\"\",VLOOKUP($F128,'DANE - K4 lit.B'!$D$6:$E$107,2,0))","v":"NIE"},{"$f":"IF($E128=\"\",\"\",VLOOKUP($F128,'DANE - K2 lit.C'!$B$14:$I$114,8,0))","v":"w przedziale od 30 do 50 minut"},null,null,{"$f":"IF($D128=Buski[[#Headers],[Buski]],VLOOKUP($E128,Buski[Buski],1,0),IF($D128=Jędrzejowski[[#Headers],[Jędrzejowski]],VLOOKUP($E128,Jędrzejowski[Jędrzejowski],1,0),IF($D128=Kazimierski[[#Headers],[Kazimierski]],VLOOKUP($E128,Kazimierski[Kazimierski],1,0),IF($D128=Kielecki[[#Headers],[Kielecki]],VLOOKUP($E128,Kielecki[Kielecki],1,0),IF($D128=Konecki[[#Headers],[Konecki]],VLOOKUP($E128,Konecki[Konecki],1,0),IF($D128=Opatowski[[#Headers],[Opatowski]],VLOOKUP($E128,Opatowski[Opatowski],1,0),IF($D128=Ostrowiecki[[#Headers],[Ostrowiecki]],VLOOKUP($E128,Ostrowiecki[Ostrowiecki],1,0),IF($D128=Pińczowski[[#Headers],[Pińczowski]],VLOOKUP($E128,Pińczowski[Pińczowski],1,0),IF($D128=Sandomierski[[#Headers],[Sandomierski]],VLOOKUP($E128,Sandomierski[Sandomierski],1,0),IF($D128=Skarżyski[[#Headers],[Skarżyski]],VLOOKUP($E128,Skarżyski[Skarżyski],1,0),IF($D128=Starachowicki[[#Headers],[Starachowicki]],VLOOKUP($E128,Starachowicki[Starachowicki],1,0),IF($D128=Staszowski[[#Headers],[Staszowski]],VLOOKUP($E128,Staszowski[Staszowski],1,0),IF($D128=Włoszczowski[[#Headers],[Włoszczowski]],VLOOKUP($E128,Włoszczowski[Włoszczowski],1,0),\"\")))))))))))))","v":"Klimontów"}]
[null,null,null,"sandomierski","Koprzywnica","gmina Koprzywnica",2609043,"GM-W",{"$f":"VLOOKUP($F129,'DANE - K1 lit.A'!$D$7:$M$120,4,0)","v":"NIE"},{"$f":"VLOOKUP($F129,'DANE - K1 lit.A'!$D$7:$M$120,5,0)","v":"NIE"},{"$f":"VLOOKUP($F129,'DANE - K1 lit.A'!$D$7:$M$120,6,0)","v":"TAK"},{"$f":"IF($E129=\"\",\"\",VLOOKUP($F129,'DANE - K4 lit.B'!$D$6:$E$107,2,0))","v":"NIE"},{"$f":"IF($E129=\"\",\"\",VLOOKUP($F129,'DANE - K2 lit.C'!$B$14:$I$114,8,0))","v":"w przedziale od 30 do 50 minut"},null,null,{"$f":"IF($D129=Buski[[#Headers],[Buski]],VLOOKUP($E129,Buski[Buski],1,0),IF($D129=Jędrzejowski[[#Headers],[Jędrzejowski]],VLOOKUP($E129,Jędrzejowski[Jędrzejowski],1,0),IF($D129=Kazimierski[[#Headers],[Kazimierski]],VLOOKUP($E129,Kazimierski[Kazimierski],1,0),IF($D129=Kielecki[[#Headers],[Kielecki]],VLOOKUP($E129,Kielecki[Kielecki],1,0),IF($D129=Konecki[[#Headers],[Konecki]],VLOOKUP($E129,Konecki[Konecki],1,0),IF($D129=Opatowski[[#Headers],[Opatowski]],VLOOKUP($E129,Opatowski[Opatowski],1,0),IF($D129=Ostrowiecki[[#Headers],[Ostrowiecki]],VLOOKUP($E129,Ostrowiecki[Ostrowiecki],1,0),IF($D129=Pińczowski[[#Headers],[Pińczowski]],VLOOKUP($E129,Pińczowski[Pińczowski],1,0),IF($D129=Sandomierski[[#Headers],[Sandomierski]],VLOOKUP($E129,Sandomierski[Sandomierski],1,0),IF($D129=Skarżyski[[#Headers],[Skarżyski]],VLOOKUP($E129,Skarżyski[Skarżyski],1,0),IF($D129=Starachowicki[[#Headers],[Starachowicki]],VLOOKUP($E129,Starachowicki[Starachowicki],1,0),IF($D129=Staszowski[[#Headers],[Staszowski]],VLOOKUP($E129,Staszowski[Staszowski],1,0),IF($D129=Włoszczowski[[#Headers],[Włoszczowski]],VLOOKUP($E129,Włoszczowski[Włoszczowski],1,0),\"\")))))))))))))","v":"Koprzywnica"}]
[null,null,null,"sandomierski","Łoniów","gmina Łoniów",2609052,"GW",{"$f":"VLOOKUP($F130,'DANE - K1 lit.A'!$D$7:$M$120,4,0)","v":"NIE"},{"$f":"VLOOKUP($F130,'DANE - K1 lit.A'!$D$7:$M$120,5,0)","v":"TAK"},{"$f":"VLOOKUP($F130,'DANE - K1 lit.A'!$D$7:$M$120,6,0)","v":"NIE"},{"$f":"IF($E130=\"\",\"\",VLOOKUP($F130,'DANE - K4 lit.B'!$D$6:$E$107,2,0))","v":"NIE"},{"$f":"IF($E130=\"\",\"\",VLOOKUP($F130,'DANE - K2 lit.C'!$B$14:$I$114,8,0))","v":"w przedziale od 30 do 50 minut"},null,null,{"$f":"IF($D130=Buski[[#Headers],[Buski]],VLOOKUP($E130,Buski[Buski],1,0),IF($D130=Jędrzejowski[[#Headers],[Jędrzejowski]],VLOOKUP($E130,Jędrzejowski[Jędrzejowski],1,0),IF($D130=Kazimierski[[#Headers],[Kazimierski]],VLOOKUP($E130,Kazimierski[Kazimierski],1,0),IF($D130=Kielecki[[#Headers],[Kielecki]],VLOOKUP($E130,Kielecki[Kielecki],1,0),IF($D130=Konecki[[#Headers],[Konecki]],VLOOKUP($E130,Konecki[Konecki],1,0),IF($D130=Opatowski[[#Headers],[Opatowski]],VLOOKUP($E130,Opatowski[Opatowski],1,0),IF($D130=Ostrowiecki[[#Headers],[Ostrowiecki]],VLOOKUP($E130,Ostrowiecki[Ostrowiecki],1,0),IF($D130=Pińczowski[[#Headers],[Pińczowski]],VLOOKUP($E130,Pińczowski[Pińczowski],1,0),IF($D130=Sandomierski[[#Headers],[Sandomierski]],VLOOKUP($E130,Sandomierski[Sandomierski],1,0),IF($D130=Skarżyski[[#Headers],[Skarżyski]],VLOOKUP($E130,Skarżyski[Skarżyski],1,0),IF($D130=Starachowicki[[#Headers],[Starachowicki]],VLOOKUP($E130,Starachowicki[Starachowicki],1,0),IF($D130=Staszowski[[#Headers],[Staszowski]],VLOOKUP($E130,Staszowski[Staszowski],1,0),IF($D130=Włoszczowski[[#Headers],[Włoszczowski]],VLOOKUP($E130,Włoszczowski[Włoszczowski],1,0),\"\")))))))))))))","v":"Łoniów"}]
[null,null,null,"sandomierski","Obrazów","gmina Obrazów",2609062,"GW",{"$f":"VLOOKUP($F131,'DANE - K1 lit.A'!$D$7:$M$120,4,0)","v":"NIE"},{"$f":"VLOOKUP($F131,'DANE - K1 lit.A'!$D$7:$M$120,5,0)","v":"NIE"},{"$f":"VLOOKUP($F131,'DANE - K1 lit.A'!$D$7:$M$120,6,0)","v":"NIE"},{"$f":"IF($E131=\"\",\"\",VLOOKUP($F131,'DANE - K4 lit.B'!$D$6:$E$107,2,0))","v":"NIE"},{"$f":"IF($E131=\"\",\"\",VLOOKUP($F131,'DANE - K2 lit.C'!$B$14:$I$114,8,0))","v":"w przedziale od 30 do 50 minut"},null,null,{"$f":"IF($D131=Buski[[#Headers],[Buski]],VLOOKUP($E131,Buski[Buski],1,0),IF($D131=Jędrzejowski[[#Headers],[Jędrzejowski]],VLOOKUP($E131,Jędrzejowski[Jędrzejowski],1,0),IF($D131=Kazimierski[[#Headers],[Kazimierski]],VLOOKUP($E131,Kazimierski[Kazimierski],1,0),IF($D131=Kielecki[[#Headers],[Kielecki]],VLOOKUP($E131,Kielecki[Kielecki],1,0),IF($D131=Konecki[[#Headers],[Konecki]],VLOOKUP($E131,Konecki[Konecki],1,0),IF($D131=Opatowski[[#Headers],[Opatowski]],VLOOKUP($E131,Opatowski[Opatowski],1,0),IF($D131=Ostrowiecki[[#Headers],[Ostrowiecki]],VLOOKUP($E131,Ostrowiecki[Ostrowiecki],1,0),IF($D131=Pińczowski[[#Headers],[Pińczowski]],VLOOKUP($E131,Pińczowski[Pińczowski],1,0),IF($D131=Sandomierski[[#Headers],[Sandomierski]],VLOOKUP($E131,Sandomierski[Sandomierski],1,0),IF($D131=Skarżyski[[#Headers],[Skarżyski]],VLOOKUP($E131,Skarżyski[Skarżyski],1,0),IF($D131=Starachowicki[[#Headers],[Starachowicki]],VLOOKUP($E131,Starachowicki[Starachowicki],1,0),IF($D131=Staszowski[[#Headers],[Staszowski]],VLOOKUP($E131,Staszowski[Staszowski],1,0),IF($D131=Włoszczowski[[#Headers],[Włoszczowski]],VLOOKUP($E131,Włoszczowski[Włoszczowski],1,0),\"\")))))))))))))","v":"Obrazów"}]
[null,null,null,"sandomierski","Samborzec","gmina Samborzec",2609072,"GW",{"$f":"VLOOKUP($F132,'DANE - K1 lit.A'!$D$7:$M$120,4,0)","v":"NIE"},{"$f":"VLOOKUP($F132,'DANE - K1 lit.A'!$D$7:$M$120,5,0)","v":"NIE"},{"$f":"VLOOKUP($F132,'DANE - K1 lit.A'!$D$7:$M$120,6,0)","v":"NIE"},{"$f":"IF($E132=\"\",\"\",VLOOKUP($F132,'DANE - K4 lit.B'!$D$6:$E$107,2,0))","v":"NIE"},{"$f":"IF($E132=\"\",\"\",VLOOKUP($F132,'DANE - K2 lit.C'!$B$14:$I$114,8,0))","v":"w przedziale od 30 do 50 minut"},null,null,{"$f":"IF($D132=Buski[[#Headers],[Buski]],VLOOKUP($E132,Buski[Buski],1,0),IF($D132=Jędrzejowski[[#Headers],[Jędrzejowski]],VLOOKUP($E132,Jędrzejowski[Jędrzejowski],1,0),IF($D132=Kazimierski[[#Headers],[Kazimierski]],VLOOKUP($E132,Kazimierski[Kazimierski],1,0),IF($D132=Kielecki[[#Headers],[Kielecki]],VLOOKUP($E132,Kielecki[Kielecki],1,0),IF($D132=Konecki[[#Headers],[Konecki]],VLOOKUP($E132,Konecki[Konecki],1,0),IF($D132=Opatowski[[#Headers],[Opatowski]],VLOOKUP($E132,Opatowski[Opatowski],1,0),IF($D132=Ostrowiecki[[#Headers],[Ostrowiecki]],VLOOKUP($E132,Ostrowiecki[Ostrowiecki],1,0),IF($D132=Pińczowski[[#Headers],[Pińczowski]],VLOOKUP($E132,Pińczowski[Pińczowski],1,0),IF($D132=Sandomierski[[#Headers],[Sandomierski]],VLOOKUP($E132,Sandomierski[Sandomierski],1,0),IF($D132=Skarżyski[[#Headers],[Skarżyski]],VLOOKUP($E132,Skarżyski[Skarżyski],1,0),IF($D132=Starachowicki[[#Headers],[Starachowicki]],VLOOKUP($E132,Starachowicki[Starachowicki],1,0),IF($D132=Staszowski[[#Headers],[Staszowski]],VLOOKUP($E132,Staszowski[Staszowski],1,0),IF($D132=Włoszczowski[[#Headers],[Włoszczowski]],VLOOKUP($E132,Włoszczowski[Włoszczowski],1,0),\"\")))))))))))))","v":"Samborzec"}]
[null,null,null,"sandomierski","Sandomierz","gmina Sandomierz",2609011,"GM",{"$f":"VLOOKUP($F133,'DANE - K1 lit.A'!$D$7:$M$120,4,0)","v":"TAK"},{"$f":"VLOOKUP($F133,'DANE - K1 lit.A'!$D$7:$M$120,5,0)","v":"NIE"},{"$f":"VLOOKUP($F133,'DANE - K1 lit.A'!$D$7:$M$120,6,0)","v":"NIE"},{"$f":"IF($E133=\"\",\"\",VLOOKUP($F133,'DANE - K4 lit.B'!$D$6:$E$107,2,0))","v":"TAK"},{"$f":"IF($E133=\"\",\"\",VLOOKUP($F133,'DANE - K2 lit.C'!$B$14:$I$114,8,0))","v":"w przedziale od 30 do 50 minut"},null,null,{"$f":"IF($D133=Buski[[#Headers],[Buski]],VLOOKUP($E133,Buski[Buski],1,0),IF($D133=Jędrzejowski[[#Headers],[Jędrzejowski]],VLOOKUP($E133,Jędrzejowski[Jędrzejowski],1,0),IF($D133=Kazimierski[[#Headers],[Kazimierski]],VLOOKUP($E133,Kazimierski[Kazimierski],1,0),IF($D133=Kielecki[[#Headers],[Kielecki]],VLOOKUP($E133,Kielecki[Kielecki],1,0),IF($D133=Konecki[[#Headers],[Konecki]],VLOOKUP($E133,Konecki[Konecki],1,0),IF($D133=Opatowski[[#Headers],[Opatowski]],VLOOKUP($E133,Opatowski[Opatowski],1,0),IF($D133=Ostrowiecki[[#Headers],[Ostrowiecki]],VLOOKUP($E133,Ostrowiecki[Ostrowiecki],1,0),IF($D133=Pińczowski[[#Headers],[Pińczowski]],VLOOKUP($E133,Pińczowski[Pińczowski],1,0),IF($D133=Sandomierski[[#Headers],[Sandomierski]],VLOOKUP($E133,Sandomierski[Sandomierski],1,0),IF($D133=Skarżyski[[#Headers],[Skarżyski]],VLOOKUP($E133,Skarżyski[Skarżyski],1,0),IF($D133=Starachowicki[[#Headers],[Starachowicki]],VLOOKUP($E133,Starachowicki[Starachowicki],1,0),IF($D133=Staszowski[[#Headers],[Staszowski]],VLOOKUP($E133,Staszowski[Staszowski],1,0),IF($D133=Włoszczowski[[#Headers],[Włoszczowski]],VLOOKUP($E133,Włoszczowski[Włoszczowski],1,0),\"\")))))))))))))","v":"Sandomierz"}]
[null,null,null,"sandomierski","Wilczyce","gmina Wilczyce",2609082,"GW",{"$f":"VLOOKUP($F134,'DANE - K1 lit.A'!$D$7:$M$120,4,0)","v":"NIE"},{"$f":"VLOOKUP($F134,'DANE - K1 lit.A'!$D$7:$M$120,5,0)","v":"NIE"},{"$f":"VLOOKUP($F134,'DANE - K1 lit.A'!$D$7:$M$120,6,0)","v":"NIE"},{"$f":"IF($E134=\"\",\"\",VLOOKUP($F134,'DANE - K4 lit.B'!$D$6:$E$107,2,0))","v":"NIE"},{"$f":"IF($E134=\"\",\"\",VLOOKUP($F134,'DANE - K2 lit.C'!$B$14:$I$114,8,0))","v":"w przedziale od 30 do 50 minut"},null,null,{"$f":"IF($D134=Buski[[#Headers],[Buski]],VLOOKUP($E134,Buski[Buski],1,0),IF($D134=Jędrzejowski[[#Headers],[Jędrzejowski]],VLOOKUP($E134,Jędrzejowski[Jędrzejowski],1,0),IF($D134=Kazimierski[[#Headers],[Kazimierski]],VLOOKUP($E134,Kazimierski[Kazimierski],1,0),IF($D134=Kielecki[[#Headers],[Kielecki]],VLOOKUP($E134,Kielecki[Kielecki],1,0),IF($D134=Konecki[[#Headers],[Konecki]],VLOOKUP($E134,Konecki[Konecki],1,0),IF($D134=Opatowski[[#Headers],[Opatowski]],VLOOKUP($E134,Opatowski[Opatowski],1,0),IF($D134=Ostrowiecki[[#Headers],[Ostrowiecki]],VLOOKUP($E134,Ostrowiecki[Ostrowiecki],1,0),IF($D134=Pińczowski[[#Headers],[Pińczowski]],VLOOKUP($E134,Pińczowski[Pińczowski],1,0),IF($D134=Sandomierski[[#Headers],[Sandomierski]],VLOOKUP($E134,Sandomierski[Sandomierski],1,0),IF($D134=Skarżyski[[#Headers],[Skarżyski]],VLOOKUP($E134,Skarżyski[Skarżyski],1,0),IF($D134=Starachowicki[[#Headers],[Starachowicki]],VLOOKUP($E134,Starachowicki[Starachowicki],1,0),IF($D134=Staszowski[[#Headers],[Staszowski]],VLOOKUP($E134,Staszowski[Staszowski],1,0),IF($D134=Włoszczowski[[#Headers],[Włoszczowski]],VLOOKUP($E134,Włoszczowski[Włoszczowski],1,0),\"\")))))))))))))","v":"Wilczyce"}]
[null,null,null,"sandomierski","Zawichost","gmina Zawichost",2609093,"GM-W",{"$f":"VLOOKUP($F135,'DANE - K1 lit.A'!$D$7:$M$120,4,0)","v":"NIE"},{"$f":"VLOOKUP($F135,'DANE - K1 lit.A'!$D$7:$M$120,5,0)","v":"NIE"},{"$f":"VLOOKUP($F135,'DANE - K1 lit.A'!$D$7:$M$120,6,0)","v":"NIE"},{"$f":"IF($E135=\"\",\"\",VLOOKUP($F135,'DANE - K4 lit.B'!$D$6:$E$107,2,0))","v":"NIE"},{"$f":"IF($E135=\"\",\"\",VLOOKUP($F135,'DANE - K2 lit.C'!$B$14:$I$114,8,0))","v":"większy niż 50 minut"},null,null,{"$f":"IF($D135=Buski[[#Headers],[Buski]],VLOOKUP($E135,Buski[Buski],1,0),IF($D135=Jędrzejowski[[#Headers],[Jędrzejowski]],VLOOKUP($E135,Jędrzejowski[Jędrzejowski],1,0),IF($D135=Kazimierski[[#Headers],[Kazimierski]],VLOOKUP($E135,Kazimierski[Kazimierski],1,0),IF($D135=Kielecki[[#Headers],[Kielecki]],VLOOKUP($E135,Kielecki[Kielecki],1,0),IF($D135=Konecki[[#Headers],[Konecki]],VLOOKUP($E135,Konecki[Konecki],1,0),IF($D135=Opatowski[[#Headers],[Opatowski]],VLOOKUP($E135,Opatowski[Opatowski],1,0),IF($D135=Ostrowiecki[[#Headers],[Ostrowiecki]],VLOOKUP($E135,Ostrowiecki[Ostrowiecki],1,0),IF($D135=Pińczowski[[#Headers],[Pińczowski]],VLOOKUP($E135,Pińczowski[Pińczowski],1,0),IF($D135=Sandomierski[[#Headers],[Sandomierski]],VLOOKUP($E135,Sandomierski[Sandomierski],1,0),IF($D135=Skarżyski[[#Headers],[Skarżyski]],VLOOKUP($E135,Skarżyski[Skarżyski],1,0),IF($D135=Starachowicki[[#Headers],[Starachowicki]],VLOOKUP($E135,Starachowicki[Starachowicki],1,0),IF($D135=Staszowski[[#Headers],[Staszowski]],VLOOKUP($E135,Staszowski[Staszowski],1,0),IF($D135=Włoszczowski[[#Headers],[Włoszczowski]],VLOOKUP($E135,Włoszczowski[Włoszczowski],1,0),\"\")))))))))))))","v":"Zawichost"}]
[null,null,null,"skarżyski","Bliżyn","gmina Bliżyn",2610022,"GW",{"$f":"VLOOKUP($F136,'DANE - K1 lit.A'!$D$7:$M$120,4,0)","v":"NIE"},{"$f":"VLOOKUP($F136,'DANE - K1 lit.A'!$D$7:$M$120,5,0)","v":"NIE"},{"$f":"VLOOKUP($F136,'DANE - K1 lit.A'!$D$7:$M$120,6,0)","v":"NIE"},{"$f":"IF($E136=\"\",\"\",VLOOKUP($F136,'DANE - K4 lit.B'!$D$6:$E$107,2,0))","v":"NIE"},{"$f":"IF($E136=\"\",\"\",VLOOKUP($F136,'DANE - K2 lit.C'!$B$14:$I$114,8,0))","v":"w przedziale od 30 do 50 minut"},null,null,{"$f":"IF($D136=Buski[[#Headers],[Buski]],VLOOKUP($E136,Buski[Buski],1,0),IF($D136=Jędrzejowski[[#Headers],[Jędrzejowski]],VLOOKUP($E136,Jędrzejowski[Jędrzejowski],1,0),IF($D136=Kazimierski[[#Headers],[Kazimierski]],VLOOKUP($E136,Kazimierski[Kazimierski],1,0),IF($D136=Kielecki[[#Headers],[Kielecki]],VLOOKUP($E136,Kielecki[Kielecki],1,0),IF($D136=Konecki[[#Headers],[Konecki]],VLOOKUP($E136,Konecki[Konecki],1,0),IF($D136=Opatowski[[#Headers],[Opatowski]],VLOOKUP($E136,Opatowski[Opatowski],1,0),IF($D136=Ostrowiecki[[#Headers],[Ostrowiecki]],VLOOKUP($E136,Ostrowiecki[Ostrowiecki],1,0),IF($D136=Pińczowski[[#Headers],[Pińczowski]],VLOOKUP($E136,Pińczowski[Pińczowski],1,0),IF($D136=Sandomierski[[#Headers],[Sandomierski]],VLOOKUP($E136,Sandomierski[Sandomierski],1,0),IF($D136=Skarżyski[[#Headers],[Skarżyski]],VLOOKUP($E136,Skarżyski[Skarżyski],1,0),IF($D136=Starachowicki[[#Headers],[Starachowicki]],VLOOKUP($E136,Starachowicki[Starachowicki],1,0),IF($D136=Staszowski[[#Headers],[Staszowski]],VLOOKUP($E136,Staszowski[Staszowski],1,0),IF($D136=Włoszczowski[[#Headers],[Włoszczowski]],VLOOKUP($E136,Włoszczowski[Włoszczowski],1,0),\"\")))))))))))))","v":"Bliżyn"}]
[null,null,null,"skarżyski","Łączna","gmina Łączna",2610032,"GW",{"$f":"VLOOKUP($F137,'DANE - K1 lit.A'!$D$7:$M$120,4,0)","v":"NIE"},{"$f":"VLOOKUP($F137,'DANE - K1 lit.A'!$D$7:$M$120,5,0)","v":"NIE"},{"$f":"VLOOKUP($F137,'DANE - K1 lit.A'!$D$7:$M$120,6,0)","v":"NIE"},{"$f":"IF($E137=\"\",\"\",VLOOKUP($F137,'DANE - K4 lit.B'!$D$6:$E$107,2,0))","v":"NIE"},{"$f":"IF($E137=\"\",\"\",VLOOKUP($F137,'DANE - K2 lit.C'!$B$14:$I$114,8,0))","v":"mniejszy niż 30 minut"},null,null,{"$f":"IF($D137=Buski[[#Headers],[Buski]],VLOOKUP($E137,Buski[Buski],1,0),IF($D137=Jędrzejowski[[#Headers],[Jędrzejowski]],VLOOKUP($E137,Jędrzejowski[Jędrzejowski],1,0),IF($D137=Kazimierski[[#Headers],[Kazimierski]],VLOOKUP($E137,Kazimierski[Kazimierski],1,0),IF($D137=Kielecki[[#Headers],[Kielecki]],VLOOKUP($E137,Kielecki[Kielecki],1,0),IF($D137=Konecki[[#Headers],[Konecki]],VLOOKUP($E137,Konecki[Konecki],1,0),IF($D137=Opatowski[[#Headers],[Opatowski]],VLOOKUP($E137,Opatowski[Opatowski],1,0),IF($D137=Ostrowiecki[[#Headers],[Ostrowiecki]],VLOOKUP($E137,Ostrowiecki[Ostrowiecki],1,0),IF($D137=Pińczowski[[#Headers],[Pińczowski]],VLOOKUP($E137,Pińczowski[Pińczowski],1,0),IF($D137=Sandomierski[[#Headers],[Sandomierski]],VLOOKUP($E137,Sandomierski[Sandomierski],1,0),IF($D137=Skarżyski[[#Headers],[Skarżyski]],VLOOKUP($E137,Skarżyski[Skarżyski],1,0),IF($D137=Starachowicki[[#Headers],[Starachowicki]],VLOOKUP($E137,Starachowicki[Starachowicki],1,0),IF($D137=Staszowski[[#Headers],[Staszowski]],VLOOKUP($E137,Staszowski[Staszowski],1,0),IF($D137=Włoszczowski[[#Headers],[Włoszczowski]],VLOOKUP($E137,Włoszczowski[Włoszczowski],1,0),\"\")))))))))))))","v":"Łączna"}]
[null,null,null,"skarżyski","Skarżysko-Kamienna","gmina Skarżysko-Kamienna",2610011,"GM",{"$f":"VLOOKUP($F138,'DANE - K1 lit.A'!$D$7:$M$120,4,0)","v":"TAK"},{"$f":"VLOOKUP($F138,'DANE - K1 lit.A'!$D$7:$M$120,5,0)","v":"TAK"},{"$f":"VLOOKUP($F138,'DANE - K1 lit.A'!$D$7:$M$120,6,0)","v":"TAK"},{"$f":"IF($E138=\"\",\"\",VLOOKUP($F138,'DANE - K4 lit.B'!$D$6:$E$107,2,0))","v":"TAK"},{"$f":"IF($E138=\"\",\"\",VLOOKUP($F138,'DANE - K2 lit.C'!$B$14:$I$114,8,0))","v":"w przedziale od 30 do 50 minut"},null,null,{"$f":"IF($D138=Buski[[#Headers],[Buski]],VLOOKUP($E138,Buski[Buski],1,0),IF($D138=Jędrzejowski[[#Headers],[Jędrzejowski]],VLOOKUP($E138,Jędrzejowski[Jędrzejowski],1,0),IF($D138=Kazimierski[[#Headers],[Kazimierski]],VLOOKUP($E138,Kazimierski[Kazimierski],1,0),IF($D138=Kielecki[[#Headers],[Kielecki]],VLOOKUP($E138,Kielecki[Kielecki],1,0),IF($D138=Konecki[[#Headers],[Konecki]],VLOOKUP($E138,Konecki[Konecki],1,0),IF($D138=Opatowski[[#Headers],[Opatowski]],VLOOKUP($E138,Opatowski[Opatowski],1,0),IF($D138=Ostrowiecki[[#Headers],[Ostrowiecki]],VLOOKUP($E138,Ostrowiecki[Ostrowiecki],1,0),IF($D138=Pińczowski[[#Headers],[Pińczowski]],VLOOKUP($E138,Pińczowski[Pińczowski],1,0),IF($D138=Sandomierski[[#Headers],[Sandomierski]],VLOOKUP($E138,Sandomierski[Sandomierski],1,0),IF($D138=Skarżyski[[#Headers],[Skarżyski]],VLOOKUP($E138,Skarżyski[Skarżyski],1,0),IF($D138=Starachowicki[[#Headers],[Starachowicki]],VLOOKUP($E138,Starachowicki[Starachowicki],1,0),IF($D138=Staszowski[[#Headers],[Staszowski]],VLOOKUP($E138,Staszowski[Staszowski],1,0),IF($D138=Włoszczowski[[#Headers],[Włoszczowski]],VLOOKUP($E138,Włoszczowski[Włoszczowski],1,0),\"\")))))))))))))","v":"Skarżysko-Kamienna"}]
[null,null,null,"skarżyski","Skarżysko Kościelne","gmina Skarżysko Kościelne",2610042,"GW",{"$f":"VLOOKUP($F139,'DANE - K1 lit.A'!$D$7:$M$120,4,0)","v":"NIE"},{"$f":"VLOOKUP($F139,'DANE - K1 lit.A'!$D$7:$M$120,5,0)","v":"TAK"},{"$f":"VLOOKUP($F139,'DANE - K1 lit.A'!$D$7:$M$120,6,0)","v":"NIE"},{"$f":"IF($E139=\"\",\"\",VLOOKUP($F139,'DANE - K4 lit.B'!$D$6:$E$107,2,0))","v":"NIE"},{"$f":"IF($E139=\"\",\"\",VLOOKUP($F139,'DANE - K2 lit.C'!$B$14:$I$114,8,0))","v":"w przedziale od 30 do 50 minut"},null,null,{"$f":"IF($D139=Buski[[#Headers],[Buski]],VLOOKUP($E139,Buski[Buski],1,0),IF($D139=Jędrzejowski[[#Headers],[Jędrzejowski]],VLOOKUP($E139,Jędrzejowski[Jędrzejowski],1,0),IF($D139=Kazimierski[[#Headers],[Kazimierski]],VLOOKUP($E139,Kazimierski[Kazimierski],1,0),IF($D139=Kielecki[[#Headers],[Kielecki]],VLOOKUP($E139,Kielecki[Kielecki],1,0),IF($D139=Konecki[[#Headers],[Konecki]],VLOOKUP($E139,Konecki[Konecki],1,0),IF($D139=Opatowski[[#Headers],[Opatowski]],VLOOKUP($E139,Opatowski[Opatowski],1,0),IF($D139=Ostrowiecki[[#Headers],[Ostrowiecki]],VLOOKUP($E139,Ostrowiecki[Ostrowiecki],1,0),IF($D139=Pińczowski[[#Headers],[Pińczowski]],VLOOKUP($E139,Pińczowski[Pińczowski],1,0),IF($D139=Sandomierski[[#Headers],[Sandomierski]],VLOOKUP($E139,Sandomierski[Sandomierski],1,0),IF($D139=Skarżyski[[#Headers],[Skarżyski]],VLOOKUP($E139,Skarżyski[Skarżyski],1,0),IF($D139=Starachowicki[[#Headers],[Starachowicki]],VLOOKUP($E139,Starachowicki[Starachowicki],1,0),IF($D139=Staszowski[[#Headers],[Staszowski]],VLOOKUP($E139,Staszowski[Staszowski],1,0),IF($D139=Włoszczowski[[#Headers],[Włoszczowski]],VLOOKUP($E139,Włoszczowski[Włoszczowski],1,0),\"\")))))))))))))","v":"Skarżysko Kościelne"}]
[null,null,null,"skarżyski","Suchedniów","gmina Suchedniów",2610053,"GM-W",{"$f":"VLOOKUP($F140,'DANE - K1 lit.A'!$D$7:$M$120,4,0)","v":"TAK"},{"$f":"VLOOKUP($F140,'DANE - K1 lit.A'!$D$7:$M$120,5,0)","v":"TAK"},{"$f":"VLOOKUP($F140,'DANE - K1 lit.A'!$D$7:$M$120,6,0)","v":"NIE"},{"$f":"IF($E140=\"\",\"\",VLOOKUP($F140,'DANE - K4 lit.B'!$D$6:$E$107,2,0))","v":"NIE"},{"$f":"IF($E140=\"\",\"\",VLOOKUP($F140,'DANE - K2 lit.C'!$B$14:$I$114,8,0))","v":"w przedziale od 30 do 50 minut"},null,null,{"$f":"IF($D140=Buski[[#Headers],[Buski]],VLOOKUP($E140,Buski[Buski],1,0),IF($D140=Jędrzejowski[[#Headers],[Jędrzejowski]],VLOOKUP($E140,Jędrzejowski[Jędrzejowski],1,0),IF($D140=Kazimierski[[#Headers],[Kazimierski]],VLOOKUP($E140,Kazimierski[Kazimierski],1,0),IF($D140=Kielecki[[#Headers],[Kielecki]],VLOOKUP($E140,Kielecki[Kielecki],1,0),IF($D140=Konecki[[#Headers],[Konecki]],VLOOKUP($E140,Konecki[Konecki],1,0),IF($D140=Opatowski[[#Headers],[Opatowski]],VLOOKUP($E140,Opatowski[Opatowski],1,0),IF($D140=Ostrowiecki[[#Headers],[Ostrowiecki]],VLOOKUP($E140,Ostrowiecki[Ostrowiecki],1,0),IF($D140=Pińczowski[[#Headers],[Pińczowski]],VLOOKUP($E140,Pińczowski[Pińczowski],1,0),IF($D140=Sandomierski[[#Headers],[Sandomierski]],VLOOKUP($E140,Sandomierski[Sandomierski],1,0),IF($D140=Skarżyski[[#Headers],[Skarżyski]],VLOOKUP($E140,Skarżyski[Skarżyski],1,0),IF($D140=Starachowicki[[#Headers],[Starachowicki]],VLOOKUP($E140,Starachowicki[Starachowicki],1,0),IF($D140=Staszowski[[#Headers],[Staszowski]],VLOOKUP($E140,Staszowski[Staszowski],1,0),IF($D140=Włoszczowski[[#Headers],[Włoszczowski]],VLOOKUP($E140,Włoszczowski[Włoszczowski],1,0),\"\")))))))))))))","v":"Suchedniów"}]
[null,null,null,"starachowicki","Brody","gmina Brody",2611022,"GW",{"$f":"VLOOKUP($F141,'DANE - K1 lit.A'!$D$7:$M$120,4,0)","v":"NIE"},{"$f":"VLOOKUP($F141,'DANE - K1 lit.A'!$D$7:$M$120,5,0)","v":"TAK"},{"$f":"VLOOKUP($F141,'DANE - K1 lit.A'!$D$7:$M$120,6,0)","v":"TAK"},{"$f":"IF($E141=\"\",\"\",VLOOKUP($F141,'DANE - K4 lit.B'!$D$6:$E$107,2,0))","v":"NIE"},{"$f":"IF($E141=\"\",\"\",VLOOKUP($F141,'DANE - K2 lit.C'!$B$14:$I$114,8,0))","v":"w przedziale od 30 do 50 minut"},null,null,{"$f":"IF($D141=Buski[[#Headers],[Buski]],VLOOKUP($E141,Buski[Buski],1,0),IF($D141=Jędrzejowski[[#Headers],[Jędrzejowski]],VLOOKUP($E141,Jędrzejowski[Jędrzejowski],1,0),IF($D141=Kazimierski[[#Headers],[Kazimierski]],VLOOKUP($E141,Kazimierski[Kazimierski],1,0),IF($D141=Kielecki[[#Headers],[Kielecki]],VLOOKUP($E141,Kielecki[Kielecki],1,0),IF($D141=Konecki[[#Headers],[Konecki]],VLOOKUP($E141,Konecki[Konecki],1,0),IF($D141=Opatowski[[#Headers],[Opatowski]],VLOOKUP($E141,Opatowski[Opatowski],1,0),IF($D141=Ostrowiecki[[#Headers],[Ostrowiecki]],VLOOKUP($E141,Ostrowiecki[Ostrowiecki],1,0),IF($D141=Pińczowski[[#Headers],[Pińczowski]],VLOOKUP($E141,Pińczowski[Pińczowski],1,0),IF($D141=Sandomierski[[#Headers],[Sandomierski]],VLOOKUP($E141,Sandomierski[Sandomierski],1,0),IF($D141=Skarżyski[[#Headers],[Skarżyski]],VLOOKUP($E141,Skarżyski[Skarżyski],1,0),IF($D141=Starachowicki[[#Headers],[Starachowicki]],VLOOKUP($E141,Starachowicki[Starachowicki],1,0),IF($D141=Staszowski[[#Headers],[Staszowski]],VLOOKUP($E141,Staszowski[Staszowski],1,0),IF($D141=Włoszczowski[[#Headers],[Włoszczowski]],VLOOKUP($E141,Włoszczowski[Włoszczowski],1,0),\"\")))))))))))))","v":"Brody"}]
[null,null,null,"starachowicki","Mirzec","gmina Mirzec",2611032,"GW",{"$f":"VLOOKUP($F142,'DANE - K1 lit.A'!$D$7:$M$120,4,0)","v":"NIE"},{"$f":"VLOOKUP($F142,'DANE - K1 lit.A'!$D$7:$M$120,5,0)","v":"NIE"},{"$f":"VLOOKUP($F142,'DANE - K1 lit.A'!$D$7:$M$120,6,0)","v":"NIE"},{"$f":"IF($E142=\"\",\"\",VLOOKUP($F142,'DANE - K4 lit.B'!$D$6:$E$107,2,0))","v":"NIE"},{"$f":"IF($E142=\"\",\"\",VLOOKUP($F142,'DANE - K2 lit.C'!$B$14:$I$114,8,0))","v":"w przedziale od 30 do 50 minut"},null,null,{"$f":"IF($D142=Buski[[#Headers],[Buski]],VLOOKUP($E142,Buski[Buski],1,0),IF($D142=Jędrzejowski[[#Headers],[Jędrzejowski]],VLOOKUP($E142,Jędrzejowski[Jędrzejowski],1,0),IF($D142=Kazimierski[[#Headers],[Kazimierski]],VLOOKUP($E142,Kazimierski[Kazimierski],1,0),IF($D142=Kielecki[[#Headers],[Kielecki]],VLOOKUP($E142,Kielecki[Kielecki],1,0),IF($D142=Konecki[[#Headers],[Konecki]],VLOOKUP($E142,Konecki[Konecki],1,0),IF($D142=Opatowski[[#Headers],[Opatowski]],VLOOKUP($E142,Opatowski[Opatowski],1,0),IF($D142=Ostrowiecki[[#Headers],[Ostrowiecki]],VLOOKUP($E142,Ostrowiecki[Ostrowiecki],1,0),IF($D142=Pińczowski[[#Headers],[Pińczowski]],VLOOKUP($E142,Pińczowski[Pińczowski],1,0),IF($D142=Sandomierski[[#Headers],[Sandomierski]],VLOOKUP($E142,Sandomierski[Sandomierski],1,0),IF($D142=Skarżyski[[#Headers],[Skarżyski]],VLOOKUP($E142,Skarżyski[Skarżyski],1,0),IF($D142=Starachowicki[[#Headers],[Starachowicki]],VLOOKUP($E142,Starachowicki[Starachowicki],1,0),IF($D142=Staszowski[[#Headers],[Staszowski]],VLOOKUP($E142,Staszowski[Staszowski],1,0),IF($D142=Włoszczowski[[#Headers],[Włoszczowski]],VLOOKUP($E142,Włoszczowski[Włoszczowski],1,0),\"\")))))))))))))","v":"Mirzec"}]
[null,null,null,"starachowicki","Pawłów","gmina Pawłów",2611042,"GW",{"$f":"VLOOKUP($F143,'DANE - K1 lit.A'!$D$7:$M$120,4,0)","v":"TAK"},{"$f":"VLOOKUP($F143,'DANE - K1 lit.A'!$D$7:$M$120,5,0)","v":"TAK"},{"$f":"VLOOKUP($F143,'DANE - K1 lit.A'!$D$7:$M$120,6,0)","v":"NIE"},{"$f":"IF($E143=\"\",\"\",VLOOKUP($F143,'DANE - K4 lit.B'!$D$6:$E$107,2,0))","v":"NIE"},{"$f":"IF($E143=\"\",\"\",VLOOKUP($F143,'DANE - K2 lit.C'!$B$14:$I$114,8,0))","v":"w przedziale od 30 do 50 minut"},null,null,{"$f":"IF($D143=Buski[[#Headers],[Buski]],VLOOKUP($E143,Buski[Buski],1,0),IF($D143=Jędrzejowski[[#Headers],[Jędrzejowski]],VLOOKUP($E143,Jędrzejowski[Jędrzejowski],1,0),IF($D143=Kazimierski[[#Headers],[Kazimierski]],VLOOKUP($E143,Kazimierski[Kazimierski],1,0),IF($D143=Kielecki[[#Headers],[Kielecki]],VLOOKUP($E143,Kielecki[Kielecki],1,0),IF($D143=Konecki[[#Headers],[Konecki]],VLOOKUP($E143,Konecki[Konecki],1,0),IF($D143=Opatowski[[#Headers],[Opatowski]],VLOOKUP($E143,Opatowski[Opatowski],1,0),IF($D143=Ostrowiecki[[#Headers],[Ostrowiecki]],VLOOKUP($E143,Ostrowiecki[Ostrowiecki],1,0),IF($D143=Pińczowski[[#Headers],[Pińczowski]],VLOOKUP($E143,Pińczowski[Pińczowski],1,0),IF($D143=Sandomierski[[#Headers],[Sandomierski]],VLOOKUP($E143,Sandomierski[Sandomierski],1,0),IF($D143=Skarżyski[[#Headers],[Skarżyski]],VLOOKUP($E143,Skarżyski[Skarżyski],1,0),IF($D143=Starachowicki[[#Headers],[Starachowicki]],VLOOKUP($E143,Starachowicki[Starachowicki],1,0),IF($D143=Staszowski[[#Headers],[Staszowski]],VLOOKUP($E143,Staszowski[Staszowski],1,0),IF($D143=Włoszczowski[[#Headers],[Włoszczowski]],VLOOKUP($E143,Włoszczowski[Włoszczowski],1,0),\"\")))))))))))))","v":"Pawłów"}]
[null,null,null,"starachowicki","Starachowice","gmina Starachowice",2611011,"GM",{"$f":"VLOOKUP($F144,'DANE - K1 lit.A'!$D$7:$M$120,4,0)","v":"TAK"},{"$f":"VLOOKUP($F144,'DANE - K1 lit.A'!$D$7:$M$120,5,0)","v":"NIE"},{"$f":"VLOOKUP($F144,'DANE - K1 lit.A'!$D$7:$M$120,6,0)","v":"TAK"},{"$f":"IF($E144=\"\",\"\",VLOOKUP($F144,'DANE - K4 lit.B'!$D$6:$E$107,2,0))","v":"TAK"},{"$f":"IF($E144=\"\",\"\",VLOOKUP($F144,'DANE - K2 lit.C'!$B$14:$I$114,8,0))","v":"w przedziale od 30 do 50 minut"},null,null,{"$f":"IF($D144=Buski[[#Headers],[Buski]],VLOOKUP($E144,Buski[Buski],1,0),IF($D144=Jędrzejowski[[#Headers],[Jędrzejowski]],VLOOKUP($E144,Jędrzejowski[Jędrzejowski],1,0),IF($D144=Kazimierski[[#Headers],[Kazimierski]],VLOOKUP($E144,Kazimierski[Kazimierski],1,0),IF($D144=Kielecki[[#Headers],[Kielecki]],VLOOKUP($E144,Kielecki[Kielecki],1,0),IF($D144=Konecki[[#Headers],[Konecki]],VLOOKUP($E144,Konecki[Konecki],1,0),IF($D144=Opatowski[[#Headers],[Opatowski]],VLOOKUP($E144,Opatowski[Opatowski],1,0),IF($D144=Ostrowiecki[[#Headers],[Ostrowiecki]],VLOOKUP($E144,Ostrowiecki[Ostrowiecki],1,0),IF($D144=Pińczowski[[#Headers],[Pińczowski]],VLOOKUP($E144,Pińczowski[Pińczowski],1,0),IF($D144=Sandomierski[[#Headers],[Sandomierski]],VLOOKUP($E144,Sandomierski[Sandomierski],1,0),IF($D144=Skarżyski[[#Headers],[Skarżyski]],VLOOKUP($E144,Skarżyski[Skarżyski],1,0),IF($D144=Starachowicki[[#Headers],[Starachowicki]],VLOOKUP($E144,Starachowicki[Starachowicki],1,0),IF($D144=Staszowski[[#Headers],[Staszowski]],VLOOKUP($E144,Staszowski[Staszowski],1,0),IF($D144=Włoszczowski[[#Headers],[Włoszczowski]],VLOOKUP($E144,Włoszczowski[Włoszczowski],1,0),\"\")))))))))))))","v":"Starachowice"}]
[null,null,null,"starachowicki","Wąchock","gmina Wąchock",2611053,"GM-W",{"$f":"VLOOKUP($F145,'DANE - K1 lit.A'!$D$7:$M$120,4,0)","v":"TAK"},{"$f":"VLOOKUP($F145,'DANE - K1 lit.A'!$D$7:$M$120,5,0)","v":"NIE"},{"$f":"VLOOKUP($F145,'DANE - K1 lit.A'!$D$7:$M$120,6,0)","v":"NIE"},{"$f":"IF($E145=\"\",\"\",VLOOKUP($F145,'DANE - K4 lit.B'!$D$6:$E$107,2,0))","v":"NIE"},{"$f":"IF($E145=\"\",\"\",VLOOKUP($F145,'DANE - K2 lit.C'!$B$14:$I$114,8,0))","v":"w przedziale od 30 do 50 minut"},null,null,{"$f":"IF($D145=Buski[[#Headers],[Buski]],VLOOKUP($E145,Buski[Buski],1,0),IF($D145=Jędrzejowski[[#Headers],[Jędrzejowski]],VLOOKUP($E145,Jędrzejowski[Jędrzejowski],1,0),IF($D145=Kazimierski[[#Headers],[Kazimierski]],VLOOKUP($E145,Kazimierski[Kazimierski],1,0),IF($D145=Kielecki[[#Headers],[Kielecki]],VLOOKUP($E145,Kielecki[Kielecki],1,0),IF($D145=Konecki[[#Headers],[Konecki]],VLOOKUP($E145,Konecki[Konecki],1,0),IF($D145=Opatowski[[#Headers],[Opatowski]],VLOOKUP($E145,Opatowski[Opatowski],1,0),IF($D145=Ostrowiecki[[#Headers],[Ostrowiecki]],VLOOKUP($E145,Ostrowiecki[Ostrowiecki],1,0),IF($D145=Pińczowski[[#Headers],[Pińczowski]],VLOOKUP($E145,Pińczowski[Pińczowski],1,0),IF($D145=Sandomierski[[#Headers],[Sandomierski]],VLOOKUP($E145,Sandomierski[Sandomierski],1,0),IF($D145=Skarżyski[[#Headers],[Skarżyski]],VLOOKUP($E145,Skarżyski[Skarżyski],1,0),IF($D145=Starachowicki[[#Headers],[Starachowicki]],VLOOKUP($E145,Starachowicki[Starachowicki],1,0),IF($D145=Staszowski[[#Headers],[Staszowski]],VLOOKUP($E145,Staszowski[Staszowski],1,0),IF($D145=Włoszczowski[[#Headers],[Włoszczowski]],VLOOKUP($E145,Włoszczowski[Włoszczowski],1,0),\"\")))))))))))))","v":"Wąchock"}]
[null,null,null,"staszowski","Bogoria","gmina Bogoria",2612013,"GM-W",{"$f":"VLOOKUP($F146,'DANE - K1 lit.A'!$D$7:$M$120,4,0)","v":"NIE"},{"$f":"VLOOKUP($F146,'DANE - K1 lit.A'!$D$7:$M$120,5,0)","v":"TAK"},{"$f":"VLOOKUP($F146,'DANE - K1 lit.A'!$D$7:$M$120,6,0)","v":"NIE"},{"$f":"IF($E146=\"\",\"\",VLOOKUP($F146,'DANE - K4 lit.B'!$D$6:$E$107,2,0))","v":"NIE"},{"$f":"IF($E146=\"\",\"\",VLOOKUP($F146,'DANE - K2 lit.C'!$B$14:$I$114,8,0))","v":"w przedziale od 30 do 50 minut"},null,null,{"$f":"IF($D146=Buski[[#Headers],[Buski]],VLOOKUP($E146,Buski[Buski],1,0),IF($D146=Jędrzejowski[[#Headers],[Jędrzejowski]],VLOOKUP($E146,Jędrzejowski[Jędrzejowski],1,0),IF($D146=Kazimierski[[#Headers],[Kazimierski]],VLOOKUP($E146,Kazimierski[Kazimierski],1,0),IF($D146=Kielecki[[#Headers],[Kielecki]],VLOOKUP($E146,Kielecki[Kielecki],1,0),IF($D146=Konecki[[#Headers],[Konecki]],VLOOKUP($E146,Konecki[Konecki],1,0),IF($D146=Opatowski[[#Headers],[Opatowski]],VLOOKUP($E146,Opatowski[Opatowski],1,0),IF($D146=Ostrowiecki[[#Headers],[Ostrowiecki]],VLOOKUP($E146,Ostrowiecki[Ostrowiecki],1,0),IF($D146=Pińczowski[[#Headers],[Pińczowski]],VLOOKUP($E146,Pińczowski[Pińczowski],1,0),IF($D146=Sandomierski[[#Headers],[Sandomierski]],VLOOKUP($E146,Sandomierski[Sandomierski],1,0),IF($D146=Skarżyski[[#Headers],[Skarżyski]],VLOOKUP($E146,Skarżyski[Skarżyski],1,0),IF($D146=Starachowicki[[#Headers],[Starachowicki]],VLOOKUP($E146,Starachowicki[Starachowicki],1,0),IF($D146=Staszowski[[#Headers],[Staszowski]],VLOOKUP($E146,Staszowski[Staszowski],1,0),IF($D146=Włoszczowski[[#Headers],[Włoszczowski]],VLOOKUP($E146,Włoszczowski[Włoszczowski],1,0),\"\")))))))))))))","v":"Bogoria"}]
[null,null,null,"staszowski","Łubnice","gmina Łubnice",2612022,"GW",{"$f":"VLOOKUP($F147,'DANE - K1 lit.A'!$D$7:$M$120,4,0)","v":"NIE"},{"$f":"VLOOKUP($F147,'DANE - K1 lit.A'!$D$7:$M$120,5,0)","v":"NIE"},{"$f":"VLOOKUP($F147,'DANE - K1 lit.A'!$D$7:$M$120,6,0)","v":"NIE"},{"$f":"IF($E147=\"\",\"\",VLOOKUP($F147,'DANE - K4 lit.B'!$D$6:$E$107,2,0))","v":"NIE"},{"$f":"IF($E147=\"\",\"\",VLOOKUP($F147,'DANE - K2 lit.C'!$B$14:$I$114,8,0))","v":"większy niż 50 minut"},null,null,{"$f":"IF($D147=Buski[[#Headers],[Buski]],VLOOKUP($E147,Buski[Buski],1,0),IF($D147=Jędrzejowski[[#Headers],[Jędrzejowski]],VLOOKUP($E147,Jędrzejowski[Jędrzejowski],1,0),IF($D147=Kazimierski[[#Headers],[Kazimierski]],VLOOKUP($E147,Kazimierski[Kazimierski],1,0),IF($D147=Kielecki[[#Headers],[Kielecki]],VLOOKUP($E147,Kielecki[Kielecki],1,0),IF($D147=Konecki[[#Headers],[Konecki]],VLOOKUP($E147,Konecki[Konecki],1,0),IF($D147=Opatowski[[#Headers],[Opatowski]],VLOOKUP($E147,Opatowski[Opatowski],1,0),IF($D147=Ostrowiecki[[#Headers],[Ostrowiecki]],VLOOKUP($E147,Ostrowiecki[Ostrowiecki],1,0),IF($D147=Pińczowski[[#Headers],[Pińczowski]],VLOOKUP($E147,Pińczowski[Pińczowski],1,0),IF($D147=Sandomierski[[#Headers],[Sandomierski]],VLOOKUP($E147,Sandomierski[Sandomierski],1,0),IF($D147=Skarżyski[[#Headers],[Skarżyski]],VLOOKUP($E147,Skarżyski[Skarżyski],1,0),IF($D147=Starachowicki[[#Headers],[Starachowicki]],VLOOKUP($E147,Starachowicki[Starachowicki],1,0),IF($D147=Staszowski[[#Headers],[Staszowski]],VLOOKUP($E147,Staszowski[Staszowski],1,0),IF($D147=Włoszczowski[[#Headers],[Włoszczowski]],VLOOKUP($E147,Włoszczowski[Włoszczowski],1,0),\"\")))))))))))))","v":"Łubnice"}]
[null,null,null,"staszowski","Oleśnica","gmina Oleśnica",2612033,"GM-W",{"$f":"VLOOKUP($F148,'DANE - K1 lit.A'!$D$7:$M$120,4,0)","v":"NIE"},{"$f":"VLOOKUP($F148,'DANE - K1 lit.A'!$D$7:$M$120,5,0)","v":"NIE"},{"$f":"VLOOKUP($F148,'DANE - K1 lit.A'!$D$7:$M$120,6,0)","v":"NIE"},{"$f":"IF($E148=\"\",\"\",VLOOKUP($F148,'DANE - K4 lit.B'!$D$6:$E$107,2,0))","v":"NIE"},{"$f":"IF($E148=\"\",\"\",VLOOKUP($F148,'DANE - K2 lit.C'!$B$14:$I$114,8,0))","v":"większy niż 50 minut"},null,null,{"$f":"IF($D148=Buski[[#Headers],[Buski]],VLOOKUP($E148,Buski[Buski],1,0),IF($D148=Jędrzejowski[[#Headers],[Jędrzejowski]],VLOOKUP($E148,Jędrzejowski[Jędrzejowski],1,0),IF($D148=Kazimierski[[#Headers],[Kazimierski]],VLOOKUP($E148,Kazimierski[Kazimierski],1,0),IF($D148=Kielecki[[#Headers],[Kielecki]],VLOOKUP($E148,Kielecki[Kielecki],1,0),IF($D148=Konecki[[#Headers],[Konecki]],VLOOKUP($E148,Konecki[Konecki],1,0),IF($D148=Opatowski[[#Headers],[Opatowski]],VLOOKUP($E148,Opatowski[Opatowski],1,0),IF($D148=Ostrowiecki[[#Headers],[Ostrowiecki]],VLOOKUP($E148,Ostrowiecki[Ostrowiecki],1,0),IF($D148=Pińczowski[[#Headers],[Pińczowski]],VLOOKUP($E148,Pińczowski[Pińczowski],1,0),IF($D148=Sandomierski[[#Headers],[Sandomierski]],VLOOKUP($E148,Sandomierski[Sandomierski],1,0),IF($D148=Skarżyski[[#Headers],[Skarżyski]],VLOOKUP($E148,Skarżyski[Skarżyski],1,0),IF($D148=Starachowicki[[#Headers],[Starachowicki]],VLOOKUP($E148,Starachowicki[Starachowicki],1,0),IF($D148=Staszowski[[#Headers],[Staszowski]],VLOOKUP($E148,Staszowski[Staszowski],1,0),IF($D148=Włoszczowski[[#Headers],[Włoszczowski]],VLOOKUP($E148,Włoszczowski[Włoszczowski],1,0),\"\")))))))))))))","v":"Oleśnica"}]
[null,null,null,"staszowski","Osiek","gmina Osiek",2612043,"GM-W",{"$f":"VLOOKUP($F149,'DANE - K1 lit.A'!$D$7:$M$120,4,0)","v":"TAK"},{"$f":"VLOOKUP($F149,'DANE - K1 lit.A'!$D$7:$M$120,5,0)","v":"TAK"},{"$f":"VLOOKUP($F149,'DANE - K1 lit.A'!$D$7:$M$120,6,0)","v":"TAK"},{"$f":"IF($E149=\"\",\"\",VLOOKUP($F149,'DANE - K4 lit.B'!$D$6:$E$107,2,0))","v":"NIE"},{"$f":"IF($E149=\"\",\"\",VLOOKUP($F149,'DANE - K2 lit.C'!$B$14:$I$114,8,0))","v":"w przedziale od 30 do 50 minut"},null,null,{"$f":"IF($D149=Buski[[#Headers],[Buski]],VLOOKUP($E149,Buski[Buski],1,0),IF($D149=Jędrzejowski[[#Headers],[Jędrzejowski]],VLOOKUP($E149,Jędrzejowski[Jędrzejowski],1,0),IF($D149=Kazimierski[[#Headers],[Kazimierski]],VLOOKUP($E149,Kazimierski[Kazimierski],1,0),IF($D149=Kielecki[[#Headers],[Kielecki]],VLOOKUP($E149,Kielecki[Kielecki],1,0),IF($D149=Konecki[[#Headers],[Konecki]],VLOOKUP($E149,Konecki[Konecki],1,0),IF($D149=Opatowski[[#Headers],[Opatowski]],VLOOKUP($E149,Opatowski[Opatowski],1,0),IF($D149=Ostrowiecki[[#Headers],[Ostrowiecki]],VLOOKUP($E149,Ostrowiecki[Ostrowiecki],1,0),IF($D149=Pińczowski[[#Headers],[Pińczowski]],VLOOKUP($E149,Pińczowski[Pińczowski],1,0),IF($D149=Sandomierski[[#Headers],[Sandomierski]],VLOOKUP($E149,Sandomierski[Sandomierski],1,0),IF($D149=Skarżyski[[#Headers],[Skarżyski]],VLOOKUP($E149,Skarżyski[Skarżyski],1,0),IF($D149=Starachowicki[[#Headers],[Starachowicki]],VLOOKUP($E149,Starachowicki[Starachowicki],1,0),IF($D149=Staszowski[[#Headers],[Staszowski]],VLOOKUP($E149,Staszowski[Staszowski],1,0),IF($D149=Włoszczowski[[#Headers],[Włoszczowski]],VLOOKUP($E149,Włoszczowski[Włoszczowski],1,0),\"\")))))))))))))","v":"Osiek"}]
[null,null,null,"staszowski","Połaniec","gmina Połaniec",2612053,"GM-W",{"$f":"VLOOKUP($F150,'DANE - K1 lit.A'!$D$7:$M$120,4,0)","v":"TAK"},{"$f":"VLOOKUP($F150,'DANE - K1 lit.A'!$D$7:$M$120,5,0)","v":"NIE"},{"$f":"VLOOKUP($F150,'DANE - K1 lit.A'!$D$7:$M$120,6,0)","v":"NIE"},{"$f":"IF($E150=\"\",\"\",VLOOKUP($F150,'DANE - K4 lit.B'!$D$6:$E$107,2,0))","v":"NIE"},{"$f":"IF($E150=\"\",\"\",VLOOKUP($F150,'DANE - K2 lit.C'!$B$14:$I$114,8,0))","v":"większy niż 50 minut"},null,null,{"$f":"IF($D150=Buski[[#Headers],[Buski]],VLOOKUP($E150,Buski[Buski],1,0),IF($D150=Jędrzejowski[[#Headers],[Jędrzejowski]],VLOOKUP($E150,Jędrzejowski[Jędrzejowski],1,0),IF($D150=Kazimierski[[#Headers],[Kazimierski]],VLOOKUP($E150,Kazimierski[Kazimierski],1,0),IF($D150=Kielecki[[#Headers],[Kielecki]],VLOOKUP($E150,Kielecki[Kielecki],1,0),IF($D150=Konecki[[#Headers],[Konecki]],VLOOKUP($E150,Konecki[Konecki],1,0),IF($D150=Opatowski[[#Headers],[Opatowski]],VLOOKUP($E150,Opatowski[Opatowski],1,0),IF($D150=Ostrowiecki[[#Headers],[Ostrowiecki]],VLOOKUP($E150,Ostrowiecki[Ostrowiecki],1,0),IF($D150=Pińczowski[[#Headers],[Pińczowski]],VLOOKUP($E150,Pińczowski[Pińczowski],1,0),IF($D150=Sandomierski[[#Headers],[Sandomierski]],VLOOKUP($E150,Sandomierski[Sandomierski],1,0),IF($D150=Skarżyski[[#Headers],[Skarżyski]],VLOOKUP($E150,Skarżyski[Skarżyski],1,0),IF($D150=Starachowicki[[#Headers],[Starachowicki]],VLOOKUP($E150,Starachowicki[Starachowicki],1,0),IF($D150=Staszowski[[#Headers],[Staszowski]],VLOOKUP($E150,Staszowski[Staszowski],1,0),IF($D150=Włoszczowski[[#Headers],[Włoszczowski]],VLOOKUP($E150,Włoszczowski[Włoszczowski],1,0),\"\")))))))))))))","v":"Połaniec"}]
[null,null,null,"staszowski","Rytwiany","gmina Rytwiany",2612062,"GW",{"$f":"VLOOKUP($F151,'DANE - K1 lit.A'!$D$7:$M$120,4,0)","v":"NIE"},{"$f":"VLOOKUP($F151,'DANE - K1 lit.A'!$D$7:$M$120,5,0)","v":"NIE"},{"$f":"VLOOKUP($F151,'DANE - K1 lit.A'!$D$7:$M$120,6,0)","v":"NIE"},{"$f":"IF($E151=\"\",\"\",VLOOKUP($F151,'DANE - K4 lit.B'!$D$6:$E$107,2,0))","v":"NIE"},{"$f":"IF($E151=\"\",\"\",VLOOKUP($F151,'DANE - K2 lit.C'!$B$14:$I$114,8,0))","v":"w przedziale od 30 do 50 minut"},null,null,{"$f":"IF($D151=Buski[[#Headers],[Buski]],VLOOKUP($E151,Buski[Buski],1,0),IF($D151=Jędrzejowski[[#Headers],[Jędrzejowski]],VLOOKUP($E151,Jędrzejowski[Jędrzejowski],1,0),IF($D151=Kazimierski[[#Headers],[Kazimierski]],VLOOKUP($E151,Kazimierski[Kazimierski],1,0),IF($D151=Kielecki[[#Headers],[Kielecki]],VLOOKUP($E151,Kielecki[Kielecki],1,0),IF($D151=Konecki[[#Headers],[Konecki]],VLOOKUP($E151,Konecki[Konecki],1,0),IF($D151=Opatowski[[#Headers],[Opatowski]],VLOOKUP($E151,Opatowski[Opatowski],1,0),IF($D151=Ostrowiecki[[#Headers],[Ostrowiecki]],VLOOKUP($E151,Ostrowiecki[Ostrowiecki],1,0),IF($D151=Pińczowski[[#Headers],[Pińczowski]],VLOOKUP($E151,Pińczowski[Pińczowski],1,0),IF($D151=Sandomierski[[#Headers],[Sandomierski]],VLOOKUP($E151,Sandomierski[Sandomierski],1,0),IF($D151=Skarżyski[[#Headers],[Skarżyski]],VLOOKUP($E151,Skarżyski[Skarżyski],1,0),IF($D151=Starachowicki[[#Headers],[Starachowicki]],VLOOKUP($E151,Starachowicki[Starachowicki],1,0),IF($D151=Staszowski[[#Headers],[Staszowski]],VLOOKUP($E151,Staszowski[Staszowski],1,0),IF($D151=Włoszczowski[[#Headers],[Włoszczowski]],VLOOKUP($E151,Włoszczowski[Włoszczowski],1,0),\"\")))))))))))))","v":"Rytwiany"}]
[null,null,null,"staszowski","Staszów","gmina Staszów",2612073,"GM-W",{"$f":"VLOOKUP($F152,'DANE - K1 lit.A'!$D$7:$M$120,4,0)","v":"TAK"},{"$f":"VLOOKUP($F152,'DANE - K1 lit.A'!$D$7:$M$120,5,0)","v":"TAK"},{"$f":"VLOOKUP($F152,'DANE - K1 lit.A'!$D$7:$M$120,6,0)","v":"TAK"},{"$f":"IF($E152=\"\",\"\",VLOOKUP($F152,'DANE - K4 lit.B'!$D$6:$E$107,2,0))","v":"TAK"},{"$f":"IF($E152=\"\",\"\",VLOOKUP($F152,'DANE - K2 lit.C'!$B$14:$I$114,8,0))","v":"w przedziale od 30 do 50 minut"},null,null,{"$f":"IF($D152=Buski[[#Headers],[Buski]],VLOOKUP($E152,Buski[Buski],1,0),IF($D152=Jędrzejowski[[#Headers],[Jędrzejowski]],VLOOKUP($E152,Jędrzejowski[Jędrzejowski],1,0),IF($D152=Kazimierski[[#Headers],[Kazimierski]],VLOOKUP($E152,Kazimierski[Kazimierski],1,0),IF($D152=Kielecki[[#Headers],[Kielecki]],VLOOKUP($E152,Kielecki[Kielecki],1,0),IF($D152=Konecki[[#Headers],[Konecki]],VLOOKUP($E152,Konecki[Konecki],1,0),IF($D152=Opatowski[[#Headers],[Opatowski]],VLOOKUP($E152,Opatowski[Opatowski],1,0),IF($D152=Ostrowiecki[[#Headers],[Ostrowiecki]],VLOOKUP($E152,Ostrowiecki[Ostrowiecki],1,0),IF($D152=Pińczowski[[#Headers],[Pińczowski]],VLOOKUP($E152,Pińczowski[Pińczowski],1,0),IF($D152=Sandomierski[[#Headers],[Sandomierski]],VLOOKUP($E152,Sandomierski[Sandomierski],1,0),IF($D152=Skarżyski[[#Headers],[Skarżyski]],VLOOKUP($E152,Skarżyski[Skarżyski],1,0),IF($D152=Starachowicki[[#Headers],[Starachowicki]],VLOOKUP($E152,Starachowicki[Starachowicki],1,0),IF($D152=Staszowski[[#Headers],[Staszowski]],VLOOKUP($E152,Staszowski[Staszowski],1,0),IF($D152=Włoszczowski[[#Headers],[Włoszczowski]],VLOOKUP($E152,Włoszczowski[Włoszczowski],1,0),\"\")))))))))))))","v":"Staszów"}]
[null,null,null,"staszowski","Szydłów","gmina Szydłów",2612083,"GM-W",{"$f":"VLOOKUP($F153,'DANE - K1 lit.A'!$D$7:$M$120,4,0)","v":"NIE"},{"$f":"VLOOKUP($F153,'DANE - K1 lit.A'!$D$7:$M$120,5,0)","v":"TAK"},{"$f":"VLOOKUP($F153,'DANE - K1 lit.A'!$D$7:$M$120,6,0)","v":"NIE"},{"$f":"IF($E153=\"\",\"\",VLOOKUP($F153,'DANE - K4 lit.B'!$D$6:$E$107,2,0))","v":"NIE"},{"$f":"IF($E153=\"\",\"\",VLOOKUP($F153,'DANE - K2 lit.C'!$B$14:$I$114,8,0))","v":"w przedziale od 30 do 50 minut"},null,null,{"$f":"IF($D153=Buski[[#Headers],[Buski]],VLOOKUP($E153,Buski[Buski],1,0),IF($D153=Jędrzejowski[[#Headers],[Jędrzejowski]],VLOOKUP($E153,Jędrzejowski[Jędrzejowski],1,0),IF($D153=Kazimierski[[#Headers],[Kazimierski]],VLOOKUP($E153,Kazimierski[Kazimierski],1,0),IF($D153=Kielecki[[#Headers],[Kielecki]],VLOOKUP($E153,Kielecki[Kielecki],1,0),IF($D153=Konecki[[#Headers],[Konecki]],VLOOKUP($E153,Konecki[Konecki],1,0),IF($D153=Opatowski[[#Headers],[Opatowski]],VLOOKUP($E153,Opatowski[Opatowski],1,0),IF($D153=Ostrowiecki[[#Headers],[Ostrowiecki]],VLOOKUP($E153,Ostrowiecki[Ostrowiecki],1,0),IF($D153=Pińczowski[[#Headers],[Pińczowski]],VLOOKUP($E153,Pińczowski[Pińczowski],1,0),IF($D153=Sandomierski[[#Headers],[Sandomierski]],VLOOKUP($E153,Sandomierski[Sandomierski],1,0),IF($D153=Skarżyski[[#Headers],[Skarżyski]],VLOOKUP($E153,Skarżyski[Skarżyski],1,0),IF($D153=Starachowicki[[#Headers],[Starachowicki]],VLOOKUP($E153,Starachowicki[Starachowicki],1,0),IF($D153=Staszowski[[#Headers],[Staszowski]],VLOOKUP($E153,Staszowski[Staszowski],1,0),IF($D153=Włoszczowski[[#Headers],[Włoszczowski]],VLOOKUP($E153,Włoszczowski[Włoszczowski],1,0),\"\")))))))))))))","v":"Szydłów"}]
[null,null,null,"włoszczowski","Kluczewsko","gmina Kluczewsko",2613012,"GW",{"$f":"VLOOKUP($F154,'DANE - K1 lit.A'!$D$7:$M$120,4,0)","v":"NIE"},{"$f":"VLOOKUP($F154,'DANE - K1 lit.A'!$D$7:$M$120,5,0)","v":"NIE"},{"$f":"VLOOKUP($F154,'DANE - K1 lit.A'!$D$7:$M$120,6,0)","v":"NIE"},{"$f":"IF($E154=\"\",\"\",VLOOKUP($F154,'DANE - K4 lit.B'!$D$6:$E$107,2,0))","v":"NIE"},{"$f":"IF($E154=\"\",\"\",VLOOKUP($F154,'DANE - K2 lit.C'!$B$14:$I$114,8,0))","v":"w przedziale od 30 do 50 minut"},null,null,{"$f":"IF($D154=Buski[[#Headers],[Buski]],VLOOKUP($E154,Buski[Buski],1,0),IF($D154=Jędrzejowski[[#Headers],[Jędrzejowski]],VLOOKUP($E154,Jędrzejowski[Jędrzejowski],1,0),IF($D154=Kazimierski[[#Headers],[Kazimierski]],VLOOKUP($E154,Kazimierski[Kazimierski],1,0),IF($D154=Kielecki[[#Headers],[Kielecki]],VLOOKUP($E154,Kielecki[Kielecki],1,0),IF($D154=Konecki[[#Headers],[Konecki]],VLOOKUP($E154,Konecki[Konecki],1,0),IF($D154=Opatowski[[#Headers],[Opatowski]],VLOOKUP($E154,Opatowski[Opatowski],1,0),IF($D154=Ostrowiecki[[#Headers],[Ostrowiecki]],VLOOKUP($E154,Ostrowiecki[Ostrowiecki],1,0),IF($D154=Pińczowski[[#Headers],[Pińczowski]],VLOOKUP($E154,Pińczowski[Pińczowski],1,0),IF($D154=Sandomierski[[#Headers],[Sandomierski]],VLOOKUP($E154,Sandomierski[Sandomierski],1,0),IF($D154=Skarżyski[[#Headers],[Skarżyski]],VLOOKUP($E154,Skarżyski[Skarżyski],1,0),IF($D154=Starachowicki[[#Headers],[Starachowicki]],VLOOKUP($E154,Starachowicki[Starachowicki],1,0),IF($D154=Staszowski[[#Headers],[Staszowski]],VLOOKUP($E154,Staszowski[Staszowski],1,0),IF($D154=Włoszczowski[[#Headers],[Włoszczowski]],VLOOKUP($E154,Włoszczowski[Włoszczowski],1,0),\"\")))))))))))))","v":"Kluczewsko"}]
[null,null,null,"włoszczowski","Krasocin","gmina Krasocin",2613022,"GW",{"$f":"VLOOKUP($F155,'DANE - K1 lit.A'!$D$7:$M$120,4,0)","v":"NIE"},{"$f":"VLOOKUP($F155,'DANE - K1 lit.A'!$D$7:$M$120,5,0)","v":"NIE"},{"$f":"VLOOKUP($F155,'DANE - K1 lit.A'!$D$7:$M$120,6,0)","v":"NIE"},{"$f":"IF($E155=\"\",\"\",VLOOKUP($F155,'DANE - K4 lit.B'!$D$6:$E$107,2,0))","v":"NIE"},{"$f":"IF($E155=\"\",\"\",VLOOKUP($F155,'DANE - K2 lit.C'!$B$14:$I$114,8,0))","v":"w przedziale od 30 do 50 minut"},null,null,{"$f":"IF($D155=Buski[[#Headers],[Buski]],VLOOKUP($E155,Buski[Buski],1,0),IF($D155=Jędrzejowski[[#Headers],[Jędrzejowski]],VLOOKUP($E155,Jędrzejowski[Jędrzejowski],1,0),IF($D155=Kazimierski[[#Headers],[Kazimierski]],VLOOKUP($E155,Kazimierski[Kazimierski],1,0),IF($D155=Kielecki[[#Headers],[Kielecki]],VLOOKUP($E155,Kielecki[Kielecki],1,0),IF($D155=Konecki[[#Headers],[Konecki]],VLOOKUP($E155,Konecki[Konecki],1,0),IF($D155=Opatowski[[#Headers],[Opatowski]],VLOOKUP($E155,Opatowski[Opatowski],1,0),IF($D155=Ostrowiecki[[#Headers],[Ostrowiecki]],VLOOKUP($E155,Ostrowiecki[Ostrowiecki],1,0),IF($D155=Pińczowski[[#Headers],[Pińczowski]],VLOOKUP($E155,Pińczowski[Pińczowski],1,0),IF($D155=Sandomierski[[#Headers],[Sandomierski]],VLOOKUP($E155,Sandomierski[Sandomierski],1,0),IF($D155=Skarżyski[[#Headers],[Skarżyski]],VLOOKUP($E155,Skarżyski[Skarżyski],1,0),IF($D155=Starachowicki[[#Headers],[Starachowicki]],VLOOKUP($E155,Starachowicki[Starachowicki],1,0),IF($D155=Staszowski[[#Headers],[Staszowski]],VLOOKUP($E155,Staszowski[Staszowski],1,0),IF($D155=Włoszczowski[[#Headers],[Włoszczowski]],VLOOKUP($E155,Włoszczowski[Włoszczowski],1,0),\"\")))))))))))))","v":"Krasocin"}]
[null,null,null,"włoszczowski","Moskorzew","gmina Moskorzew",2613032,"GW",{"$f":"VLOOKUP($F156,'DANE - K1 lit.A'!$D$7:$M$120,4,0)","v":"NIE"},{"$f":"VLOOKUP($F156,'DANE - K1 lit.A'!$D$7:$M$120,5,0)","v":"TAK"},{"$f":"VLOOKUP($F156,'DANE - K1 lit.A'!$D$7:$M$120,6,0)","v":"NIE"},{"$f":"IF($E156=\"\",\"\",VLOOKUP($F156,'DANE - K4 lit.B'!$D$6:$E$107,2,0))","v":"NIE"},{"$f":"IF($E156=\"\",\"\",VLOOKUP($F156,'DANE - K2 lit.C'!$B$14:$I$114,8,0))","v":"większy niż 50 minut"},null,null,{"$f":"IF($D156=Buski[[#Headers],[Buski]],VLOOKUP($E156,Buski[Buski],1,0),IF($D156=Jędrzejowski[[#Headers],[Jędrzejowski]],VLOOKUP($E156,Jędrzejowski[Jędrzejowski],1,0),IF($D156=Kazimierski[[#Headers],[Kazimierski]],VLOOKUP($E156,Kazimierski[Kazimierski],1,0),IF($D156=Kielecki[[#Headers],[Kielecki]],VLOOKUP($E156,Kielecki[Kielecki],1,0),IF($D156=Konecki[[#Headers],[Konecki]],VLOOKUP($E156,Konecki[Konecki],1,0),IF($D156=Opatowski[[#Headers],[Opatowski]],VLOOKUP($E156,Opatowski[Opatowski],1,0),IF($D156=Ostrowiecki[[#Headers],[Ostrowiecki]],VLOOKUP($E156,Ostrowiecki[Ostrowiecki],1,0),IF($D156=Pińczowski[[#Headers],[Pińczowski]],VLOOKUP($E156,Pińczowski[Pińczowski],1,0),IF($D156=Sandomierski[[#Headers],[Sandomierski]],VLOOKUP($E156,Sandomierski[Sandomierski],1,0),IF($D156=Skarżyski[[#Headers],[Skarżyski]],VLOOKUP($E156,Skarżyski[Skarżyski],1,0),IF($D156=Starachowicki[[#Headers],[Starachowicki]],VLOOKUP($E156,Starachowicki[Starachowicki],1,0),IF($D156=Staszowski[[#Headers],[Staszowski]],VLOOKUP($E156,Staszowski[Staszowski],1,0),IF($D156=Włoszczowski[[#Headers],[Włoszczowski]],VLOOKUP($E156,Włoszczowski[Włoszczowski],1,0),\"\")))))))))))))","v":"Moskorzew"}]
[null,null,null,"włoszczowski","Radków","gmina Radków",2613042,"GW",{"$f":"VLOOKUP($F157,'DANE - K1 lit.A'!$D$7:$M$120,4,0)","v":"NIE"},{"$f":"VLOOKUP($F157,'DANE - K1 lit.A'!$D$7:$M$120,5,0)","v":"NIE"},{"$f":"VLOOKUP($F157,'DANE - K1 lit.A'!$D$7:$M$120,6,0)","v":"NIE"},{"$f":"IF($E157=\"\",\"\",VLOOKUP($F157,'DANE - K4 lit.B'!$D$6:$E$107,2,0))","v":"NIE"},{"$f":"IF($E157=\"\",\"\",VLOOKUP($F157,'DANE - K2 lit.C'!$B$14:$I$114,8,0))","v":"w przedziale od 30 do 50 minut"},null,null,{"$f":"IF($D157=Buski[[#Headers],[Buski]],VLOOKUP($E157,Buski[Buski],1,0),IF($D157=Jędrzejowski[[#Headers],[Jędrzejowski]],VLOOKUP($E157,Jędrzejowski[Jędrzejowski],1,0),IF($D157=Kazimierski[[#Headers],[Kazimierski]],VLOOKUP($E157,Kazimierski[Kazimierski],1,0),IF($D157=Kielecki[[#Headers],[Kielecki]],VLOOKUP($E157,Kielecki[Kielecki],1,0),IF($D157=Konecki[[#Headers],[Konecki]],VLOOKUP($E157,Konecki[Konecki],1,0),IF($D157=Opatowski[[#Headers],[Opatowski]],VLOOKUP($E157,Opatowski[Opatowski],1,0),IF($D157=Ostrowiecki[[#Headers],[Ostrowiecki]],VLOOKUP($E157,Ostrowiecki[Ostrowiecki],1,0),IF($D157=Pińczowski[[#Headers],[Pińczowski]],VLOOKUP($E157,Pińczowski[Pińczowski],1,0),IF($D157=Sandomierski[[#Headers],[Sandomierski]],VLOOKUP($E157,Sandomierski[Sandomierski],1,0),IF($D157=Skarżyski[[#Headers],[Skarżyski]],VLOOKUP($E157,Skarżyski[Skarżyski],1,0),IF($D157=Starachowicki[[#Headers],[Starachowicki]],VLOOKUP($E157,Starachowicki[Starachowicki],1,0),IF($D157=Staszowski[[#Headers],[Staszowski]],VLOOKUP($E157,Staszowski[Staszowski],1,0),IF($D157=Włoszczowski[[#Headers],[Włoszczowski]],VLOOKUP($E157,Włoszczowski[Włoszczowski],1,0),\"\")))))))))))))","v":"Radków"}]
[null,null,null,"włoszczowski","Secemin","gmina Secemin",2613052,"GW",{"$f":"VLOOKUP($F158,'DANE - K1 lit.A'!$D$7:$M$120,4,0)","v":"NIE"},{"$f":"VLOOKUP($F158,'DANE - K1 lit.A'!$D$7:$M$120,5,0)","v":"TAK"},{"$f":"VLOOKUP($F158,'DANE - K1 lit.A'!$D$7:$M$120,6,0)","v":"NIE"},{"$f":"IF($E158=\"\",\"\",VLOOKUP($F158,'DANE - K4 lit.B'!$D$6:$E$107,2,0))","v":"NIE"},{"$f":"IF($E158=\"\",\"\",VLOOKUP($F158,'DANE - K2 lit.C'!$B$14:$I$114,8,0))","v":"większy niż 50 minut"},null,null,{"$f":"IF($D158=Buski[[#Headers],[Buski]],VLOOKUP($E158,Buski[Buski],1,0),IF($D158=Jędrzejowski[[#Headers],[Jędrzejowski]],VLOOKUP($E158,Jędrzejowski[Jędrzejowski],1,0),IF($D158=Kazimierski[[#Headers],[Kazimierski]],VLOOKUP($E158,Kazimierski[Kazimierski],1,0),IF($D158=Kielecki[[#Headers],[Kielecki]],VLOOKUP($E158,Kielecki[Kielecki],1,0),IF($D158=Konecki[[#Headers],[Konecki]],VLOOKUP($E158,Konecki[Konecki],1,0),IF($D158=Opatowski[[#Headers],[Opatowski]],VLOOKUP($E158,Opatowski[Opatowski],1,0),IF($D158=Ostrowiecki[[#Headers],[Ostrowiecki]],VLOOKUP($E158,Ostrowiecki[Ostrowiecki],1,0),IF($D158=Pińczowski[[#Headers],[Pińczowski]],VLOOKUP($E158,Pińczowski[Pińczowski],1,0),IF($D158=Sandomierski[[#Headers],[Sandomierski]],VLOOKUP($E158,Sandomierski[Sandomierski],1,0),IF($D158=Skarżyski[[#Headers],[Skarżyski]],VLOOKUP($E158,Skarżyski[Skarżyski],1,0),IF($D158=Starachowicki[[#Headers],[Starachowicki]],VLOOKUP($E158,Starachowicki[Starachowicki],1,0),IF($D158=Staszowski[[#Headers],[Staszowski]],VLOOKUP($E158,Staszowski[Staszowski],1,0),IF($D158=Włoszczowski[[#Headers],[Włoszczowski]],VLOOKUP($E158,Włoszczowski[Włoszczowski],1,0),\"\")))))))))))))","v":"Secemin"}]
[null,null,null,"włoszczowski","Włoszczowa","gmina Włoszczowa",2613063,"GM-W",{"$f":"VLOOKUP($F159,'DANE - K1 lit.A'!$D$7:$M$120,4,0)","v":"TAK"},{"$f":"VLOOKUP($F159,'DANE - K1 lit.A'!$D$7:$M$120,5,0)","v":"TAK"},{"$f":"VLOOKUP($F159,'DANE - K1 lit.A'!$D$7:$M$120,6,0)","v":"NIE"},{"$f":"IF($E159=\"\",\"\",VLOOKUP($F159,'DANE - K4 lit.B'!$D$6:$E$107,2,0))","v":"NIE"},{"$f":"IF($E159=\"\",\"\",VLOOKUP($F159,'DANE - K2 lit.C'!$B$14:$I$114,8,0))","v":"w przedziale od 30 do 50 minut"},null,null,{"$f":"IF($D159=Buski[[#Headers],[Buski]],VLOOKUP($E159,Buski[Buski],1,0),IF($D159=Jędrzejowski[[#Headers],[Jędrzejowski]],VLOOKUP($E159,Jędrzejowski[Jędrzejowski],1,0),IF($D159=Kazimierski[[#Headers],[Kazimierski]],VLOOKUP($E159,Kazimierski[Kazimierski],1,0),IF($D159=Kielecki[[#Headers],[Kielecki]],VLOOKUP($E159,Kielecki[Kielecki],1,0),IF($D159=Konecki[[#Headers],[Konecki]],VLOOKUP($E159,Konecki[Konecki],1,0),IF($D159=Opatowski[[#Headers],[Opatowski]],VLOOKUP($E159,Opatowski[Opatowski],1,0),IF($D159=Ostrowiecki[[#Headers],[Ostrowiecki]],VLOOKUP($E159,Ostrowiecki[Ostrowiecki],1,0),IF($D159=Pińczowski[[#Headers],[Pińczowski]],VLOOKUP($E159,Pińczowski[Pińczowski],1,0),IF($D159=Sandomierski[[#Headers],[Sandomierski]],VLOOKUP($E159,Sandomierski[Sandomierski],1,0),IF($D159=Skarżyski[[#Headers],[Skarżyski]],VLOOKUP($E159,Skarżyski[Skarżyski],1,0),IF($D159=Starachowicki[[#Headers],[Starachowicki]],VLOOKUP($E159,Starachowicki[Starachowicki],1,0),IF($D159=Staszowski[[#Headers],[Staszowski]],VLOOKUP($E159,Staszowski[Staszowski],1,0),IF($D159=Włoszczowski[[#Headers],[Włoszczowski]],VLOOKUP($E159,Włoszczowski[Włoszczowski],1,0),\"\")))))))))))))","v":"Włoszczowa"}]
[]
[]
[]
[null,null,null,"Rodzaj","jednoroczne","wieloletnie",null,"obszar wiejski",null,null,null,"utrata funkcji","miasto"]
[null,null,null,"jednoroczne",2025,2025,null,"TAK - odcinek przebiega W CAŁOŚCI na obszarze wiejskim",null,null,null,"TAK - odcinek drogi PRZEBIEGA w granicach administracyjnych jednego z miast ujętych w Pakiecie dla średnich miast uznanych za zagrożone utratą funkcji społeczno-gospodarczych","Busko-Zdrój"]
[null,null,null,"wieloletnie",2026,2026,null,"TAK - odcinek przebiega W CZĘŚCI na obszarze wiejskim",null,null,null,"NIE - odcinek drogi NIE PRZEBIEGA w granicach administracyjnych jednego z miast ujętych w Pakiecie dla średnich miast uznanych za zagrożone utratą funkcji społeczno-gospodarczych","Jędrzejów"]
[null,null,null,null,null,2027,null,"NIE - odcinek NIE PRZEBIEGA przez obszar wiejski",null,null,null,null,"Końskie"]
[null,null,null,null,null,2028,null,null,null,null,null,null,"Ostrowiec Świętokrzyski"]
[null,null,null,null,null,2029,null,null,null,null,null,null,"Sandomierz"]
[null,null,null,null,null,2030,null,null,null,null,null,null,"Skarżysko-Kamienna"]
[null,null,null,null,null,null,null,null,null,null,null,null,"Starachowice"]
[null,null,null,"miesiąca","miesiąc",null,null,null,null,null,null,null,"Staszów"]
[null,null,null,"stycznia","styczeń"]
[null,null,null,"lutego","luty"]
[null,null,null,"marca","marzec"]
[null,null,null,"kwietnia","kwiecień"]
[null,null,null,"maja","maj"]
[null,null,null,"czerwca","czerwiec"]
[null,null,null,"lipca","lipiec"]
[null,null,null,"sierpnia","sierpień"]
[null,null,null,"września","wrzesień"]
[null,null,null,"października","październik"]
[null,null,null,"listopada","listopad"]
[null,null,null,"grudnia","grudzień"]
[]
[]
[]
[]
[]
[]
[]
[]
[]
[]
[]
[]
[]
[null,null,null,null,"KATEGORIA - ośw."]
[null,null,null,null,"gminnych"]
[null,null,null,null,"powiatowych",null,null,null,null,"Dzień","Miesiąc ","Rok","Kolumna1",null,"ROBOTY","R","BRP"]
[null,null,null,null,"nie dotyczy",null,null,null,null,1,"I",2000,2023,null,"REMONT","remont","budowa"]
[null,null,null,null,null,null,null,null,null,2,"II",2001,2022,null,"BUDOWA / ROZBUDOWA / PRZEBUDOWA",null,"rozbudowa"]
[null,null,null,null,null,null,null,null,null,3,"III",2002,2021,null,null,null,"przebudowa"]
[null,null,"TAK","TAK",null,null,null,null,null,4,"IV",2003,2020]
[null,null,"NIE","NIE",null,null,null,null,null,5,"V",2004,2019]
[null,null,null,"NIE DOTYCZY",null,null,null,null,null,6,"VI",2005,2018,null,null,null,"jednej drogi publicznej odchodzącej od tego skrzyżowania (kontynuacja od skrzyżowania)"]
[null,null,null,null,null,null,null,null,null,7,"VII",2006,2017,null,null,null,"dwóch dróg publicznych odchodzących od tego skrzyżowania (kontynuacja od skrzyżowania)"]
[null,null,null,null,null,null,null,null,null,8,"VIII",2007,2016,null,null,null,"trzech dróg publicznych odchodzących od tego skrzyżowania (kontynuacja od skrzyżowania)"]
[null,null,null,null,null,null,null,null,null,9,"IX",2008,2015,null,null,null,"czterech dróg publicznych odchodzących od tego skrzyżowania (kontynuacja od skrzyżowania)"]
[null,null,null,null,null,null,null,null,null,10,"X",2009,2014]
[null,null,null,null,null,null,null,null,null,11,"XI",2010,2013]
[null,null,null,null,null,null,null,null,null,12,"XII",2011,2012]
[null,null,null,null,null,null,null,null,null,13,null,2012,2011]
[null,null,null,null,null,null,null,null,null,14,null,2013,2010]
[null,null,null,null,null,null,null,null,null,15,null,2014,2009]
[null,null,null,null,"Peryferyjność",null,null,null,null,16,null,2015,2008]
[null,null,null,null,"mniejszy niż 30 minut",null,null,null,null,17,null,2016,2007]
[null,null,null,null,"w przedziale od 30 do 50 minut",null,null,null,null,18,null,2017,2006]
[null,null,null,null,"większy niż 50 minut",null,null,null,null,19,null,2018,2005]
[null,null,null,null,null,null,null,null,null,20,null,2019,2004]
[null,null,null,null,null,null,null,null,null,21,null,2020,2003]
[null,null,null,null,"w całości",null,null,null,null,22,null,2021,2002]
[null,null,null,null,"w części",null,null,null,null,23,null,2022,2001]
[null,null,null,null,null,null,null,null,null,24,null,2023,2000]
[null,null,null,null,null,null,null,null,null,25]
[null,null,null,null,null,null,null,null,null,26]
[null,null,null,null,null,null,null,null,null,27]
[null,null,null,null,"bezpośredni dojazd do:",null,null,null,null,28]
[null,null,null,null,"pośredni dojazd do:",null,null,null,null,29]
[null,null,null,null,"bezpośredni i pośredni dojazd do:",null,null,null,null,30]
[null,null,null,null,null,null,null,null,null,31]
[]
[]
[null,null,null,"oznaczenie","wyjaśnienie"]
[null,null,null,"OK","poprawnie"]
[null,null,null,"D","wprowadzono daną"]
[null,null,null,"W","wprowadź daną"]
[null,null,null,"B","błąd danej"]
[]
[]
[]
[]
[]
[]
[]
[]
[]
[]
[]
[null,null,null,null,"POWIAT / GMINA",null,null,null,"TERC / TERYT",null,null,null,"%"]
[null,null,null,null,null,null,"POWIATY","JST","Teryt","Dochód RAZEM","Dochód na mieszkańca","Dochód art. 14 ","%",null,null,null,"peryferyjność"]
[null,null,{"$f":"IF(F251=\"\",_xlfn.CONCAT(\"powiat\",D251),_xlfn.CONCAT(\"gmina\",D251))","v":"powiatbuski"},{"$f":"CONCATENATE(G251&F251)","v":"buski"},"buski26",null,"buski","powiat buski",2601,26527448.859999999,377.48596721404789,1.0140010148759659,0.7]
[null,null,{"$f":"IF(F252=\"\",_xlfn.CONCAT(\"powiat\",D252),_xlfn.CONCAT(\"gmina\",D252))","v":"powiatjędrzejowski"},{"$f":"CONCATENATE(G252&F252)","v":"jędrzejowski"},"jędrzejowski26",null,"jędrzejowski","powiat jędrzejowski",2602,30304747.239999998,360.6763376258599,0.9688470675970553,0.8]
[null,null,"powiatkazimierski",{"$f":"CONCATENATE(G253&F253)","v":"kazimierski"},"kazimierski26",null,"kazimierski","powiat kazimierski",2603,12632130.98,382.75705178317122,1.0281601772470466,0.7]
[null,null,"powiatkielecki","kielecki","kielecki26",null,"kielecki","powiat kielecki",2604,84572327.859999999,401.42170598342523,1.0782970828413008,0.7]
[null,null,"powiatkonecki","konecki","konecki26",null,"konecki","powiat konecki",2605,35525321.600000001,455.21939518195796,1.2228081804269806,0.7]
[null,null,"powiatopatowski","opatowski","opatowski26",null,"opatowski","powiat opatowski",2606,27570873.530000001,542.31738488168537,1.4567703872898941,0.7]
[null,null,"powiatostrowiecki","ostrowiecki","ostrowiecki26",null,"ostrowiecki","powiat ostrowiecki",2607,41427817.049999997,390.01531759256642,1.047657296441395,0.7]
[null,null,"powiatpińczowski","pińczowski","pińczowski26",null,"pińczowski","powiat pińczowski",2608,14419486.039999999,379.12094546984275,1.0183928857126798,0.7]
[null,null,"powiatsandomierski","sandomierski","sandomierski26",null,"sandomierski","powiat sandomierski",2609,24736611.120000001,327.67195358448578,0.88019084771078648,0.8]
[null,null,"powiatskarżyski","skarżyski","skarżyski26",null,"skarżyski","powiat skarżyski",2610,36163336.399999999,502.5756906998721,1.3500164368565566,0.7]
[null,null,"powiatstarachowicki","starachowicki","starachowicki26",null,"starachowicki","powiat starachowicki",2611,29351667.399999999,335.60488228770049,0.90150024317087563,0.8]
[null,null,"powiatstaszowski","staszowski","staszowski26",null,"staszowski","powiat staszowski",2612,24700606.039999999,349.47588449185753,0.93876046350745446,0.8]
[null,null,"powiatwłoszczowski","włoszczowski","włoszczowski26",null,"włoszczowski","powiat włoszczowski",2613,16639741.800000001,374.64239108409322,1.0063626141615465,0.7]
[null,null,"gminabuskiBusko-Zdrój",{"$f":"CONCATENATE(F264&G264)","v":"buskiBusko-Zdrój"},"Busko-Zdrój26","buski","Busko-Zdrój","gmina Busko-Zdrój",2601013,63580725.509999998,2007.7912498815801,0.87552396592476556,0.8,"buski",null,null,{"$f":"VLOOKUP($H264,$F$372:$O$473,9,0)","v":"w przedziale od 30 do 50 minut"}]
[null,null,"gminabuskiGnojno","buskiGnojno","Gnojno26","buski","Gnojno","gmina Gnojno",2601022,8897521.2100000009,2074.497833993938,0.90461225539648726,0.7,"buski",null,null,"w przedziale od 30 do 50 minut"]
[null,null,"gminabuskiNowy Korczyn","buskiNowy Korczyn","Nowy Korczyn26","buski","Nowy Korczyn","gmina Nowy Korczyn",2601033,12108930,2115.0969432314409,0.92231603467868506,0.7,"buski",null,null,"większy niż 50 minut"]
[null,null,"gminabuskiPacanów","buskiPacanów","Pacanów26","buski","Pacanów","gmina Pacanów",2601043,14638013.49,2049.2809029819405,0.89361607865282555,0.8,"buski",null,null,"większy niż 50 minut"]
[null,null,"gminabuskiSolec-Zdrój","buskiSolec-Zdrój","Solec-Zdrój26","buski","Solec-Zdrój","gmina Solec-Zdrój",2601052,10418213.92,2094.5343626859672,0.91334944909869387,0.7,"buski",null,null,"większy niż 50 minut"]
[null,null,"gminabuskiStopnica","buskiStopnica","Stopnica26","buski","Stopnica","gmina Stopnica",2601063,15268337.92,2037.9522050186865,0.88867604986739435,0.8,"buski",null,null,"w przedziale od 30 do 50 minut"]
[null,null,"gminabuskiTuczępy","buskiTuczępy","Tuczępy26","buski","Tuczępy","gmina Tuczępy",2601072,8615500.5999999996,2363.0007131102575,1.0304177567998485,0.7,"buski",null,null,"w przedziale od 30 do 50 minut"]
[null,null,"gminabuskiWiślica","buskiWiślica","Wiślica26","buski","Wiślica","gmina Wiślica",2601083,11040242.559999999,2068.2357736980139,0.90188160106901638,0.7,"buski",null,null,"w przedziale od 30 do 50 minut"]
[null,null,"gminajędrzejowskiImielno","jędrzejowskiImielno","Imielno26","jędrzejowski","Imielno","gmina Imielno",2602012,8677560.620000001,2045.6295662423388,0.89202386490880647,0.8,"jędrzejowski",null,null,"w przedziale od 30 do 50 minut"]
[null,null,"gminajędrzejowskiJędrzejów","jędrzejowskiJędrzejów","Jędrzejów26","jędrzejowski","Jędrzejów","gmina Jędrzejów",2602023,53788849,1963.0966788321168,0.85603430627870403,0.8,"jędrzejowski",null,null,"w przedziale od 30 do 50 minut"]
[null,null,"gminajędrzejowskiMałogoszcz","jędrzejowskiMałogoszcz","Małogoszcz26","jędrzejowski","Małogoszcz","gmina Małogoszcz",2602033,25738618.700000003,2255.9925234464022,0.98375541846838399,0.7,"jędrzejowski",null,null,"w przedziale od 30 do 50 minut"]
[null,null,"gminajędrzejowskiNagłowice","jędrzejowskiNagłowice","Nagłowice26","jędrzejowski","Nagłowice","gmina Nagłowice",2602042,9964278.4499999993,2056.6106191950462,0.89681229848313904,0.8,"jędrzejowski",null,null,"w przedziale od 30 do 50 minut"]
[null,null,"gminajędrzejowskiOksa","jędrzejowskiOksa","Oksa26","jędrzejowski","Oksa","gmina Oksa",2602052,9139214,2037.7288740245262,0.88857866342956993,0.8,"jędrzejowski",null,null,"w przedziale od 30 do 50 minut"]
[null,null,"gminajędrzejowskiSędziszów","jędrzejowskiSędziszów","Sędziszów26","jędrzejowski","Sędziszów","gmina Sędziszów",2602063,25356628.900000002,2080.8000082061385,0.90736040192842382,0.7,"jędrzejowski",null,null,"większy niż 50 minut"]
[null,null,"gminajędrzejowskiSłupia Jędrzejowska","jędrzejowskiSłupia Jędrzejowska","Słupia Jędrzejowska26","jędrzejowski","Słupia Jędrzejowska","gmina Słupia Jędrzejowska",2602072,8760890.3200000003,2074.5655505564764,0.90464178410042795,0.7,"jędrzejowski",null,null,"większy niż 50 minut"]
[null,null,"gminajędrzejowskiSobków","jędrzejowskiSobków","Sobków26","jędrzejowski","Sobków","gmina Sobków",2602082,17782214.119999997,2109.8972615092543,0.92004864459855396,0.7,"jędrzejowski",null,null,"mniejszy niż 30 minut"]
[null,null,"gminajędrzejowskiWodzisław","jędrzejowskiWodzisław","Wodzisław26","jędrzejowski","Wodzisław","gmina Wodzisław",2602093,14324445.239999998,2105.2976543209875,0.9180429249663935,0.7,"jędrzejowski",null,null,"w przedziale od 30 do 50 minut"]
[null,null,"gminakazimierskiBejsce","kazimierskiBejsce","Bejsce26","kazimierski","Bejsce","gmina Bejsce",2603012,7735098.3599999994,1957.2617307692306,0.85348989989717183,0.8,"kazimierski",null,null,"w przedziale od 30 do 50 minut"]
[null,null,"gminakazimierskiCzarnocin","kazimierskiCzarnocin","Czarnocin26","kazimierski","Czarnocin","gmina Czarnocin",2603022,7319231.5,1980.84749661705,0.86377478546765818,0.8,"kazimierski",null,null,"większy niż 50 minut"]
[null,null,"gminakazimierskiKazimierza Wielka","kazimierskiKazimierza Wielka","Kazimierza Wielka26","kazimierski","Kazimierza Wielka","gmina Kazimierza Wielka",2603033,30062052.75,1893.6726141732283,0.82576102342404856,0.8,"kazimierski",null,null,"w przedziale od 30 do 50 minut"]
[null,null,"gminakazimierskiOpatowiec","kazimierskiOpatowiec","Opatowiec26","kazimierski","Opatowiec","gmina Opatowiec",2603043,6567769.0600000005,2066.6359534298304,0.90118397825287477,0.7,"kazimierski",null,null,"większy niż 50 minut"]
[null,null,"gminakazimierskiSkalbmierz","kazimierskiSkalbmierz","Skalbmierz26","kazimierski","Skalbmierz","gmina Skalbmierz",2603053,12672744.469999999,2010.5893177851815,0.87674410049205798,0.8,"kazimierski",null,null,"w przedziale od 30 do 50 minut"]
[null,null,"gminakieleckiBieliny","kieleckiBieliny","Bieliny26","kielecki","Bieliny","gmina Bieliny",2604012,18608181.219999999,1816.8503436828744,0.79226165493390954,0.8,"kielecki",null,null,"w przedziale od 30 do 50 minut"]
[null,null,"gminakieleckiBodzentyn","kieleckiBodzentyn","Bodzentyn26","kielecki","Bodzentyn","gmina Bodzentyn",2604023,23777222.059999999,2099.1632435772931,0.9153679339167774,0.7,"kielecki",null,null,"w przedziale od 30 do 50 minut"]
[null,null,"gminakieleckiChęciny","kieleckiChęciny","Chęciny26","kielecki","Chęciny","gmina Chęciny",2604033,29194079.59,1955.0043253197616,0.85250552835359839,0.8,"kielecki",null,null,"mniejszy niż 30 minut"]
[null,null,"gminakieleckiChmielnik","kieleckiChmielnik","Chmielnik26","kielecki","Chmielnik","gmina Chmielnik",2604043,22865005.800000001,2064.7467762326169,0.90036017751555375,0.7,"kielecki",null,null,"w przedziale od 30 do 50 minut"]
[null,null,"gminakieleckiDaleszyce","kieleckiDaleszyce","Daleszyce26","kielecki","Daleszyce","gmina Daleszyce",2604053,37218233.740000002,2356.0317617269102,1.0273788532515613,0.7,"kielecki",null,null,"w przedziale od 30 do 50 minut"]
[null,null,"gminakieleckiGórno","kieleckiGórno","Górno26","kielecki","Górno","gmina Górno",2604062,27147844.700000003,1844.5335439597773,0.80433328105408175,0.8,"kielecki",null,null,"mniejszy niż 30 minut"]
[null,null,"gminakieleckiKielce","kieleckiKielce","Kielce26","kielecki","Kielce","gmina Kielce",{"$error":"#N/A"},{"$error":"#N/A"},{"$error":"#N/A"},{"$error":"#N/A"},{"$error":"#N/A"},"kielecki",null,null,0]
[null,null,"gminakieleckiŁagów","kieleckiŁagów","Łagów26","kielecki","Łagów","gmina Łagów",2604073,14851261,2206.7252600297179,0.96227177575434208,0.7,"kielecki",null,null,"w przedziale od 30 do 50 minut"]
[null,null,"gminakieleckiŁopuszno","kieleckiŁopuszno","Łopuszno26","kielecki","Łopuszno","gmina Łopuszno",2604082,18256657.75,2057.0881971830986,0.89702055268992609,0.8,"kielecki",null,null,"w przedziale od 30 do 50 minut"]
[null,null,"gminakieleckiMasłów","kieleckiMasłów","Masłów26","kielecki","Masłów","gmina Masłów",2604092,22549586.280000001,2001.2057401490949,0.87265226718668121,0.8,"kielecki",null,null,"mniejszy niż 30 minut"]
[null,null,"gminakieleckiMiedziana Góra",{"$f":"CONCATENATE(F296&G296)","v":"kieleckiMiedziana Góra"},"Miedziana Góra26","kielecki","Miedziana Góra","gmina Miedziana Góra",2604102,22463608.099999998,1905.3102714164545,0.8308357779954032,0.8,"kielecki",null,null,"mniejszy niż 30 minut"]
[null,null,"gminakieleckiMniów","kieleckiMniów","Mniów26","kielecki","Mniów","gmina Mniów",2604112,17944258.449999999,1936.7791095520777,0.84455818164128538,0.8,"kielecki",null,null,"w przedziale od 30 do 50 minut"]
[null,null,"gminakieleckiMorawica","kieleckiMorawica","Morawica26","kielecki","Morawica","gmina Morawica",2604123,40273851.359999999,2356.2983477650364,1.0274951016241818,0.7,"kielecki",null,null,"mniejszy niż 30 minut"]
[null,null,"gminakieleckiNowa Słupia","kieleckiNowa Słupia","Nowa Słupia26","kielecki","Nowa Słupia","gmina Nowa Słupia",2604133,17293774.66,1874.2575766771431,0.81729483918893286,0.8,"kielecki",null,null,"w przedziale od 30 do 50 minut"]
[null,null,"gminakieleckiNowiny","kieleckiNowiny","Nowiny26","kielecki","Nowiny","gmina Nowiny",2604172,36911130,4604.681886227545,2.007932521416083,0.7,"kielecki",null,null,"mniejszy niż 30 minut"]
[null,null,"gminakieleckiPiekoszów","kieleckiPiekoszów","Piekoszów26","kielecki","Piekoszów","gmina Piekoszów",2604142,33187491.919999998,2011.8508680892337,0.8772942162102545,0.8,"kielecki",null,null,"mniejszy niż 30 minut"]
[null,null,"gminakieleckiPierzchnica","kieleckiPierzchnica","Pierzchnica26","kielecki","Pierzchnica","gmina Pierzchnica",2604153,9747609.0099999998,2119.5061991737334,0.92423874912900494,0.7,"kielecki",null,null,"w przedziale od 30 do 50 minut"]
[null,null,"gminakieleckiRaków","kieleckiRaków","Raków26","kielecki","Raków","gmina Raków",2604162,11649365.459999999,2133.1927229445155,0.93020693908511987,0.7,"kielecki",null,null,"w przedziale od 30 do 50 minut"]
[null,null,"gminakieleckiStrawczyn","kieleckiStrawczyn","Strawczyn26","kielecki","Strawczyn","gmina Strawczyn",2604182,21410228.039999999,1943.3809603340292,0.84743700611041217,0.8,"kielecki",null,null,"w przedziale od 30 do 50 minut"]
[null,null,"gminakieleckiZagnańsk","kieleckiZagnańsk","Zagnańsk26","kielecki","Zagnańsk","gmina Zagnańsk",2604192,24278223.649999999,1903.4279615836926,0.83001497186330353,0.8,"kielecki",null,null,"mniejszy niż 30 minut"]
[null,null,"gminakoneckiFałków","koneckiFałków","Fałków26","konecki","Fałków","gmina Fałków",2605012,9165752.4600000009,2148.0554159831267,0.93668801322779027,0.7,"konecki",null,null,"w przedziale od 30 do 50 minut"]
[null,null,"gminakoneckiGowarczów","koneckiGowarczów","Gowarczów26","konecki","Gowarczów","gmina Gowarczów",2605022,9353469.9499999993,2058.8751815980627,0.89779979091109441,0.8,"konecki",null,null,"w przedziale od 30 do 50 minut"]
[null,null,"gminakoneckiKońskie","koneckiKońskie","Końskie26","konecki","Końskie","gmina Końskie",2605033,69857581.609999999,2028.3261696814843,0.88447848967030906,0.8,"konecki",null,null,"w przedziale od 30 do 50 minut"]
[null,null,"gminakoneckiRadoszyce","koneckiRadoszyce","Radoszyce26","konecki","Radoszyce","gmina Radoszyce",2605043,17893637.120000001,2069.5856025907938,0.9024702118349992,0.7,"konecki",null,null,"w przedziale od 30 do 50 minut"]
[null,null,"gminakoneckiRuda Maleniecka","koneckiRuda Maleniecka","Ruda Maleniecka26","konecki","Ruda Maleniecka","gmina Ruda Maleniecka",2605052,8712234.0999999996,2913.7906688963208,1.270597011744695,0.7,"konecki",null,null,"w przedziale od 30 do 50 minut"]
[null,null,"gminakoneckiSłupia Konecka","koneckiSłupia Konecka","Słupia Konecka26","konecki","Słupia Konecka","gmina Słupia Konecka",2605062,6875806.8799999999,2136.6708763206962,0.93172363392985935,0.7,"konecki",null,null,"w przedziale od 30 do 50 minut"]
[null,null,"gminakoneckiSmyków","koneckiSmyków","Smyków26","konecki","Smyków","gmina Smyków",2605072,7571048.7400000002,2021.102172984517,0.88132837023516886,0.8,"konecki",null,null,"w przedziale od 30 do 50 minut"]
[null,null,"gminakoneckiStąporków","koneckiStąporków","Stąporków26","konecki","Stąporków","gmina Stąporków",2605083,33691151.649999999,2081.1138211131015,0.90749724420267863,0.7,"konecki",null,null,"w przedziale od 30 do 50 minut"]
[null,null,"gminaopatowskiBaćkowice","opatowskiBaćkowice","Baćkowice26","opatowski","Baćkowice","gmina Baćkowice",2606012,10887025.92,2267.1857392753018,0.98863636847478931,0.7,"opatowski",null,null,"w przedziale od 30 do 50 minut"]
[null,null,"gminaopatowskiIwaniska","opatowskiIwaniska","Iwaniska26","opatowski","Iwaniska","gmina Iwaniska",2606022,12870223.870000001,2001.2787855698959,0.87268411960984327,0.8,"opatowski",null,null,"w przedziale od 30 do 50 minut"]
[null,null,{"$f":"IF(F316=\"\",_xlfn.CONCAT(\"powiat\",D316),_xlfn.CONCAT(\"gmina\",D316))","v":"gminaopatowskiLipnik"},"opatowskiLipnik","Lipnik26","opatowski","Lipnik","gmina Lipnik",2606032,10218875.010000002,2020.7385821633384,0.88116982164215607,0.8,"opatowski",null,null,{"$f":"VLOOKUP($H316,$F$372:$O$473,9,0)","v":"w przedziale od 30 do 50 minut"}]
[null,null,"gminaopatowskiOpatów","opatowskiOpatów","Opatów26","opatowski","Opatów","gmina Opatów",2606043,22618442.800000001,1993.3412179430686,0.8692228381201238,0.8,"opatowski",null,null,"w przedziale od 30 do 50 minut"]
[null,null,"gminaopatowskiOżarów","opatowskiOżarów","Ożarów26","opatowski","Ożarów","gmina Ożarów",2606053,38264204.350000001,3659.8952032520328,1.5959457754431579,0.7,"opatowski",null,null,"większy niż 50 minut"]
[null,null,"gminaopatowskiSadowie","opatowskiSadowie","Sadowie26","opatowski","Sadowie","gmina Sadowie",2606062,8242427.9299999997,2153.7569715181603,0.93917425203088656,0.7,"opatowski",null,null,"w przedziale od 30 do 50 minut"]
[null,null,"gminaopatowskiTarłów","opatowskiTarłów","Tarłów26","opatowski","Tarłów","gmina Tarłów",2606072,10455472.68,2104.5637439613524,0.9177228936340831,0.7,"opatowski",null,null,"większy niż 50 minut"]
[null,null,"gminaopatowskiWojciechowice","opatowskiWojciechowice","Wojciechowice26","opatowski","Wojciechowice","gmina Wojciechowice",2606082,8461568.2800000012,2141.0850910931176,0.93364851074373234,0.7,"opatowski",null,null,"w przedziale od 30 do 50 minut"]
[null,null,"gminaostrowieckiBałtów","ostrowieckiBałtów","Bałtów26","ostrowiecki","Bałtów","gmina Bałtów",2607022,6902396.0599999996,2078.4089310448658,0.90631774106455509,0.7,"ostrowiecki",null,null,"większy niż 50 minut"]
[null,null,"gminaostrowieckiBodzechów","ostrowieckiBodzechów","Bodzechów26","ostrowiecki","Bodzechów","gmina Bodzechów",2607032,24502147.420000002,1867.9688511092477,0.81455255711646091,0.8,"ostrowiecki",null,null,"większy niż 50 minut"]
[null,null,"gminaostrowieckiĆmielów","ostrowieckiĆmielów","Ćmielów26","ostrowiecki","Ćmielów","gmina Ćmielów",2607043,15572461.17,2163.1422655924434,0.9432668338118716,0.7,"ostrowiecki",null,null,"większy niż 50 minut"]
[null,null,"gminaostrowieckiKunów","ostrowieckiKunów","Kunów26","ostrowiecki","Kunów","gmina Kunów",2607053,15192831.32,1573.4083802816901,0.68610556261998623,0.8,"ostrowiecki",null,null,"większy niż 50 minut"]
[null,null,"gminaostrowieckiOstrowiec Świętokrzyski","ostrowieckiOstrowiec Świętokrzyski","Ostrowiec Świętokrzyski26","ostrowiecki","Ostrowiec Świętokrzyski","gmina Ostrowiec Świętokrzyski",2607011,132384003,1998.0078330163906,0.87125777742802257,0.8,"ostrowiecki",null,null,"w przedziale od 30 do 50 minut"]
[null,null,"gminaostrowieckiWaśniów","ostrowieckiWaśniów","Waśniów26","ostrowiecki","Waśniów","gmina Waśniów",2607062,13178873.6,1975.8431184407796,0.86159256008534613,0.8,"ostrowiecki",null,null,"w przedziale od 30 do 50 minut"]
[null,null,"gminapińczowskiDziałoszyce",{"$f":"CONCATENATE(F328&G328)","v":"pińczowskiDziałoszyce"},"Działoszyce26","pińczowski","Działoszyce","gmina Działoszyce",2608013,9997554.8999999985,2106.9662592202317,0.91877054223190058,0.7,"pińczowski",null,null,"w przedziale od 30 do 50 minut"]
[null,null,"gminapińczowskiKije","pińczowskiKije","Kije26","pińczowski","Kije","gmina Kije",2608022,12908967.84,3014.7052405418031,1.3146021472346832,0.7,"pińczowski",null,null,"w przedziale od 30 do 50 minut"]
[null,null,"gminapińczowskiMichałów","pińczowskiMichałów","Michałów26","pińczowski","Michałów","gmina Michałów",2608032,9359123.8000000007,2098.4582511210765,0.91506051261924448,0.7,"pińczowski",null,null,"w przedziale od 30 do 50 minut"]
[null,null,"gminapińczowskiPińczów","pińczowskiPińczów","Pińczów26","pińczowski","Pińczów","gmina Pińczów",2608043,43987158,2180.2804460966545,0.95074016440072961,0.7,"pińczowski",null,null,"w przedziale od 30 do 50 minut"]
[null,null,"gminapińczowskiZłota","pińczowskiZłota","Złota26","pińczowski","Złota","gmina Złota",2608052,8755118.8000000007,2002.5431838975298,0.87323547724644224,0.8,"pińczowski",null,null,"większy niż 50 minut"]
[null,null,"gminasandomierskiDwikozy","sandomierskiDwikozy","Dwikozy26","sandomierski","Dwikozy","gmina Dwikozy",2609022,15871374.800000001,1850.4575958960011,0.80691654235968446,0.8,"sandomierski",null,null,"w przedziale od 30 do 50 minut"]
[null,null,"gminasandomierskiKlimontów","sandomierskiKlimontów","Klimontów26","sandomierski","Klimontów","gmina Klimontów",2609033,15423593.140000001,1960.0448773668827,0.8547035278313857,0.8,"sandomierski",null,null,"w przedziale od 30 do 50 minut"]
[null,null,"gminasandomierskiKoprzywnica","sandomierskiKoprzywnica","Koprzywnica26","sandomierski","Koprzywnica","gmina Koprzywnica",2609043,12119962.84,1869.2108019740901,0.81509412623961297,0.8,"sandomierski",null,null,"w przedziale od 30 do 50 minut"]
[null,null,"gminasandomierskiŁoniów","sandomierskiŁoniów","Łoniów26","sandomierski","Łoniów","gmina Łoniów",2609052,14494426.640000001,1963.4823408290438,0.85620247930021509,0.8,"sandomierski",null,null,"w przedziale od 30 do 50 minut"]
[null,null,"gminasandomierskiObrazów","sandomierskiObrazów","Obrazów26","sandomierski","Obrazów","gmina Obrazów",2609062,12373955.24,1956.6659139784947,0.85323008609450668,0.8,"sandomierski",null,null,"w przedziale od 30 do 50 minut"]
[null,null,"gminasandomierskiSamborzec","sandomierskiSamborzec","Samborzec26","sandomierski","Samborzec","gmina Samborzec",2609072,15517280.959999999,1863.2662055715657,0.8125019062473865,0.8,"sandomierski",null,null,"w przedziale od 30 do 50 minut"]
[null,null,"gminasandomierskiSandomierz","sandomierskiSandomierz","Sandomierz26","sandomierski","Sandomierz","gmina Sandomierz",2609011,50401168.159999996,2224.8242323651452,0.9701640723460373,0.7,"sandomierski",null,null,"w przedziale od 30 do 50 minut"]
[null,null,"gminasandomierskiWilczyce","sandomierskiWilczyce","Wilczyce26","sandomierski","Wilczyce","gmina Wilczyce",2609082,7340948.8799999999,2046.5427599665459,0.8924220751266877,0.8,"sandomierski",null,null,"w przedziale od 30 do 50 minut"]
[null,null,"gminasandomierskiZawichost","sandomierskiZawichost","Zawichost26","sandomierski","Zawichost","gmina Zawichost",2609093,8720961.9699999988,2034.2808420807089,0.88707510343434415,0.8,"sandomierski",null,null,"większy niż 50 minut"]
[null,null,"gminaskarżyskiBliżyn","skarżyskiBliżyn","Bliżyn26","skarżyski","Bliżyn","gmina Bliżyn",2610022,15825855.32,1992.6788365650971,0.86893399794760562,0.8,"skarżyski",null,null,"w przedziale od 30 do 50 minut"]
[null,null,"gminaskarżyskiŁączna","skarżyskiŁączna","Łączna26","skarżyski","Łączna","gmina Łączna",2610032,10478000.34,2159.9670871985159,0.94188225522077851,0.7,"skarżyski",null,null,"mniejszy niż 30 minut"]
[null,null,"gminaskarżyskiSkarżysko-Kamienna","skarżyskiSkarżysko-Kamienna","Skarżysko-Kamienna26","skarżyski","Skarżysko-Kamienna","gmina Skarżysko-Kamienna",2610011,87323051.5,2011.032460503892,0.87693733874358393,0.8,"skarżyski",null,null,"w przedziale od 30 do 50 minut"]
[null,null,"gminaskarżyskiSkarżysko Kościelne","skarżyskiSkarżysko Kościelne","Skarżysko Kościelne26","skarżyski","Skarżysko Kościelne","gmina Skarżysko Kościelne",2610042,11085725.359999999,1893.0541939890709,0.82549135311232003,0.8,"skarżyski",null,null,"w przedziale od 30 do 50 minut"]
[null,null,"gminaskarżyskiSuchedniów","skarżyskiSuchedniów","Suchedniów26","skarżyski","Suchedniów","gmina Suchedniów",2610053,18581496.649999999,1879.76698533131,0.81969728979981238,0.8,"skarżyski",null,null,"w przedziale od 30 do 50 minut"]
[null,null,"gminastarachowickiBrody","starachowickiBrody","Brody26","starachowicki","Brody","gmina Brody",2611022,21502670,2023.780705882353,0.88249637998006225,0.8,"starachowicki",null,null,"w przedziale od 30 do 50 minut"]
[null,null,"gminastarachowickiMirzec","starachowickiMirzec","Mirzec26","starachowicki","Mirzec","gmina Mirzec",2611032,16004737.620000001,1961.6052972177965,0.85538396957375329,0.8,"starachowicki",null,null,{"$f":"VLOOKUP($H348,$F$372:$O$473,9,0)","v":"w przedziale od 30 do 50 minut"}]
[null,null,"gminastarachowickiPawłów","starachowickiPawłów","Pawłów26","starachowicki","Pawłów","gmina Pawłów",2611042,28155229.280000001,1861.0105942230155,0.81151831704527988,0.8,"starachowicki",null,null,"w przedziale od 30 do 50 minut"]
[null,null,"gminastarachowickiStarachowice","starachowickiStarachowice","Starachowice26","starachowicki","Starachowice","gmina Starachowice",2611011,95266694.629999995,2032.1827391795898,0.88616019787679956,0.8,"starachowicki",null,null,"w przedziale od 30 do 50 minut"]
[null,null,"gminastarachowickiWąchock","starachowickiWąchock","Wąchock26","starachowicki","Wąchock","gmina Wąchock",2611053,13296961.83,1994.4445522723863,0.86970396166710717,0.8,"starachowicki",null,null,"w przedziale od 30 do 50 minut"]
[null,null,"gminastaszowskiBogoria","staszowskiBogoria","Bogoria26","staszowski","Bogoria","gmina Bogoria",2612012,16746370.92,2196.5334365162644,0.9578274961296398,0.7,"staszowski",null,null,"w przedziale od 30 do 50 minut"]
[null,null,"gminastaszowskiŁubnice","staszowskiŁubnice","Łubnice26","staszowski","Łubnice","gmina Łubnice",2612022,8231249.5899999999,2027.900859817689,0.88429302767134921,0.8,"staszowski",null,null,"większy niż 50 minut"]
[null,null,"gminastaszowskiOleśnica","staszowskiOleśnica","Oleśnica26","staszowski","Oleśnica","gmina Oleśnica",2612033,7437441.5499999998,1942.3978976234002,0.8470083285956489,0.8,"staszowski",null,null,"większy niż 50 minut"]
[null,null,"gminastaszowskiOsiek","staszowskiOsiek","Osiek26","staszowski","Osiek","gmina Osiek",2612043,16400607.84,2156.8395370857443,0.94051844557247788,0.7,"staszowski",null,null,"w przedziale od 30 do 50 minut"]
[null,null,"gminastaszowskiPołaniec","staszowskiPołaniec","Połaniec26","staszowski","Połaniec","gmina Połaniec",2612053,37518216.899999999,3256.5069785608885,1.4200429975474123,0.7,"staszowski",null,null,"większy niż 50 minut"]
[null,null,"gminastaszowskiRytwiany","staszowskiRytwiany","Rytwiany26","staszowski","Rytwiany","gmina Rytwiany",2612062,13619897.310000001,2152.6627643432907,0.93869710850048138,0.7,"staszowski",null,null,"w przedziale od 30 do 50 minut"]
[null,null,"gminastaszowskiStaszów","staszowskiStaszów","Staszów26","staszowski","Staszów","gmina Staszów",2612073,48571952,1927.4584126984128,0.84049376833388378,0.8,"staszowski",null,null,"w przedziale od 30 do 50 minut"]
[null,null,"gminastaszowskiSzydłów","staszowskiSzydłów","Szydłów26","staszowski","Szydłów","gmina Szydłów",2612083,9659978.6999999993,2139.5301661129565,0.93297046511253112,0.7,"staszowski",null,null,"w przedziale od 30 do 50 minut"]
[null,null,"gminawłoszczowskiKluczewsko",{"$f":"CONCATENATE(F360&G360)","v":"włoszczowskiKluczewsko"},"Kluczewsko26","włoszczowski","Kluczewsko","gmina Kluczewsko",2613012,10772689.649999999,2106.9215040093877,0.91875102612946902,0.7,"włoszczowski",null,null,"w przedziale od 30 do 50 minut"]
[null,null,"gminawłoszczowskiKrasocin","włoszczowskiKrasocin","Krasocin26","włoszczowski","Krasocin","gmina Krasocin",2613022,23663009.540000003,2235.3116890232386,0.97473726671885852,0.7,"włoszczowski",null,null,"w przedziale od 30 do 50 minut"]
[null,null,"gminawłoszczowskiMoskorzew","włoszczowskiMoskorzew","Moskorzew26","włoszczowski","Moskorzew","gmina Moskorzew",2613032,5570298.2300000004,2141.5987043444829,0.93387247860434197,0.7,"włoszczowski",null,null,"większy niż 50 minut"]
[null,null,"gminawłoszczowskiRadków","włoszczowskiRadków","Radków26","włoszczowski","Radków","gmina Radków",2613042,5298057,2154.5575437169582,0.93952335214104099,0.7,"włoszczowski",null,null,"w przedziale od 30 do 50 minut"]
[null,null,"gminawłoszczowskiSecemin","włoszczowskiSecemin","Secemin26","włoszczowski","Secemin","gmina Secemin",2613052,10046615.48,2148.5490761334477,0.93690328027442848,0.7,"włoszczowski",null,null,"większy niż 50 minut"]
[null,null,"gminawłoszczowskiWłoszczowa","włoszczowskiWłoszczowa","Włoszczowa26","włoszczowski","Włoszczowa","gmina Włoszczowa",2613063,40761971,2147.6275553213909,0.93650143891960547,0.7,"włoszczowski",null,null,"w przedziale od 30 do 50 minut"]
[]
[]
[null,null,null,null,null,null,null,"Gmina",null,"Dostępność czasowa"]
[null,null,null,null,null,null,null,null,"Dostępność czasowa","do 30 minut","od 30 minut do 50 minut","> 50 minut",null,null,null,null,null,null,null,null,null,"JST"]
[null,null,null,null,null,null,null,null,null,"Liczba przyznanych punktów",null,null,null,null,null,null,null,null,null,null,null,"powiat buski"]
[null,null,null,null,null,null,null,2,null,3,4,5,"peryferyjność",null,null,null,null,null,null,null,null,"powiat jędrzejowski"]
[null,null,null,null,null,{"$f":"_xlfn.CONCAT(G372,\" \",H372)","v":"gmina Baćkowice"},"gmina","Baćkowice","35-40",null,1,null,{"$f":"J372+K372+L372","v":1},{"$f":"IF(M372=0,\"mniejszy niż 30 minut\",IF(M372=1,\"w przedziale od 30 do 50 minut\",\"większy niż 50 minut\"))","v":"w przedziale od 30 do 50 minut"},null,null,null,null,null,null,null,"powiat kazimierski"]
[null,null,null,null,null,{"$f":"_xlfn.CONCAT(G373,\" \",H373)","v":"gmina Bałtów"},"gmina","Bałtów","60-65",null,null,2,{"$f":"J373+K373+L373","v":2},{"$f":"IF(M373=0,\"mniejszy niż 30 minut\",IF(M373=1,\"w przedziale od 30 do 50 minut\",\"większy niż 50 minut\"))","v":"większy niż 50 minut"},null,null,null,null,null,null,null,"powiat kielecki"]
[null,null,null,null,null,"gmina Bejsce","gmina","Bejsce","45-50",null,1,null,1,"w przedziale od 30 do 50 minut",null,null,null,null,null,null,null,"powiat konecki"]
[null,null,null,null,null,"gmina Bieliny","gmina","Bieliny","35-40",null,1,null,1,"w przedziale od 30 do 50 minut",null,null,null,null,null,null,null,"powiat opatowski"]
[null,null,null,null,null,"gmina Bliżyn","gmina","Bliżyn","30-35",null,1,null,1,"w przedziale od 30 do 50 minut",null,null,null,null,null,null,null,"powiat ostrowiecki"]
[null,null,null,null,null,"gmina Bodzechów","gmina","Bodzechów","50-55",null,null,2,2,"większy niż 50 minut",null,null,null,null,null,null,null,"powiat pińczowski"]
[null,null,null,null,null,"gmina Bodzentyn","gmina","Bodzentyn","35-40",null,1,null,1,"w przedziale od 30 do 50 minut",null,null,null,null,null,null,null,"powiat sandomierski"]
[null,null,null,null,null,"gmina Bogoria","gmina","Bogoria","40-45",null,1,null,1,"w przedziale od 30 do 50 minut",null,null,null,null,null,null,null,"powiat skarżyski"]
[null,null,null,null,null,"gmina Brody","gmina","Brody","45-50",null,1,null,1,"w przedziale od 30 do 50 minut",null,null,null,null,null,null,null,"powiat starachowicki"]
[null,null,null,null,null,{"$f":"_xlfn.CONCAT(G381,\" \",H381)","v":"gmina Busko-Zdrój"},"gmina","Busko-Zdrój","35-40",null,1,null,1,"w przedziale od 30 do 50 minut",null,null,null,null,null,null,null,"powiat staszowski"]
[null,null,null,null,null,"gmina Chęciny","gmina","Chęciny","20-30",0,null,null,0,"mniejszy niż 30 minut",null,null,null,null,null,null,null,"powiat włoszczowski"]
[null,null,null,null,null,"gmina Chmielnik","gmina","Chmielnik","30-35",null,1,null,1,"w przedziale od 30 do 50 minut",null,null,null,null,null,null,null,"gmina Busko-Zdrój"]
[null,null,null,null,null,"gmina Czarnocin","gmina","Czarnocin","50-55",null,null,2,2,"większy niż 50 minut",null,null,null,null,null,null,null,"gmina Gnojno"]
[null,null,null,null,null,"gmina Ćmielów","gmina","Ćmielów","50-55",null,null,2,2,"większy niż 50 minut",null,null,null,null,null,null,null,"gmina Nowy Korczyn"]
[null,null,null,null,null,"gmina Daleszyce","gmina","Daleszyce","30-35",null,1,null,1,"w przedziale od 30 do 50 minut",null,null,null,null,null,null,null,"gmina Pacanów"]
[null,null,null,null,null,"gmina Dwikozy","gmina","Dwikozy","45-50",null,1,null,1,"w przedziale od 30 do 50 minut",null,null,null,null,null,null,null,"gmina Solec-Zdrój"]
[null,null,null,null,null,"gmina Działoszyce","gmina","Działoszyce","45-50",null,1,null,1,"w przedziale od 30 do 50 minut",null,null,null,null,null,null,null,"gmina Stopnica"]
[null,null,null,null,null,"gmina Fałków","gmina","Fałków","45-50",null,1,null,1,"w przedziale od 30 do 50 minut",null,null,null,null,null,null,null,"gmina Tuczępy"]
[null,null,null,null,null,"gmina Gnojno","gmina","Gnojno","40-45",null,1,null,1,"w przedziale od 30 do 50 minut",null,null,null,null,null,null,null,"gmina Wiślica"]
[null,null,null,null,null,"gmina Gowarczów","gmina","Gowarczów","45-50",null,1,null,1,"w przedziale od 30 do 50 minut",null,null,null,null,null,null,null,"gmina Imielno"]
[null,null,null,null,null,"gmina Górno","gmina","Górno","20-30",0,null,null,0,"mniejszy niż 30 minut",null,null,null,null,null,null,null,"gmina Jędrzejów"]
[null,null,null,null,null,"gmina Imielno","gmina","Imielno","35-40",null,1,null,1,"w przedziale od 30 do 50 minut",null,null,null,null,null,null,null,"gmina Małogoszcz"]
[null,null,null,null,null,"gmina Iwaniska","gmina","Iwaniska","35-40",null,1,null,1,"w przedziale od 30 do 50 minut",null,null,null,null,null,null,null,"gmina Nagłowice"]
[null,null,null,null,null,"gmina Jędrzejów","gmina","Jędrzejów","30-35",null,1,null,1,"w przedziale od 30 do 50 minut",null,null,null,null,null,null,null,"gmina Oksa"]
[null,null,null,null,null,"gmina Kazimierza Wielka","gmina","Kazimierza Wielka","45-50",null,1,null,1,"w przedziale od 30 do 50 minut",null,null,null,null,null,null,null,"gmina Sędziszów"]
[null,null,null,null,null,"gmina Kielce","gmina","Kielce",null,null,null,null,null,null,null,null,null,null,null,null,null,"gmina Słupia Jędrzejowska"]
[null,null,null,null,null,"gmina Kije","gmina","Kije","30-35",null,1,null,1,"w przedziale od 30 do 50 minut",null,null,null,null,null,null,null,"gmina Sobków"]
[null,null,null,null,null,"gmina Klimontów","gmina","Klimontów","40-45",null,1,null,1,"w przedziale od 30 do 50 minut",null,null,null,null,null,null,null,"gmina Wodzisław"]
[null,null,null,null,null,"gmina Kluczewsko","gmina","Kluczewsko","45-50",null,1,null,1,"w przedziale od 30 do 50 minut",null,null,null,null,null,null,null,"gmina Bejsce"]
[null,null,null,null,null,"gmina Końskie","gmina","Końskie","35-40",null,1,null,1,"w przedziale od 30 do 50 minut",null,null,null,null,null,null,null,"gmina Czarnocin"]
[null,null,null,null,null,"gmina Koprzywnica","gmina","Koprzywnica","40-45",null,1,null,1,"w przedziale od 30 do 50 minut",null,null,null,null,null,null,null,"gmina Kazimierza Wielka"]
[null,null,null,null,null,"gmina Krasocin","gmina","Krasocin","40-45",null,1,null,1,"w przedziale od 30 do 50 minut",null,null,null,null,null,null,null,"gmina Opatowiec"]
[null,null,null,null,null,"gmina Kunów","gmina","Kunów","50-55",null,null,2,2,"większy niż 50 minut",null,null,null,null,null,null,null,"gmina Skalbmierz"]
[null,null,null,null,null,"gmina Lipnik","gmina","Lipnik","40-45",null,1,null,1,"w przedziale od 30 do 50 minut",null,null,null,null,null,null,null,"gmina Bieliny"]
[null,null,null,null,null,"gmina Łagów","gmina","Łagów","35-40",null,1,null,1,"w przedziale od 30 do 50 minut",null,null,null,null,null,null,null,"gmina Bodzentyn"]
[null,null,null,null,null,"gmina Łączna","gmina","Łączna","20-30",0,null,null,0,"mniejszy niż 30 minut",null,null,null,null,null,null,null,"gmina Chęciny"]
[null,null,null,null,null,"gmina Łoniów","gmina","Łoniów","40-45",null,1,null,1,"w przedziale od 30 do 50 minut",null,null,null,null,null,null,null,"gmina Chmielnik"]
[null,null,null,null,null,"gmina Łopuszno","gmina","Łopuszno","35-40",null,1,null,1,"w przedziale od 30 do 50 minut",null,null,null,null,null,null,null,"gmina Daleszyce"]
[null,null,null,null,null,"gmina Łubnice","gmina","Łubnice","55-60",null,null,2,2,"większy niż 50 minut",null,null,null,null,null,null,null,"gmina Górno"]
[null,null,null,null,null,"gmina Małogoszcz","gmina","Małogoszcz","35-40",null,1,null,1,"w przedziale od 30 do 50 minut",null,null,null,null,null,null,null,"gmina Kielce"]
[null,null,null,null,null,"gmina Masłów","gmina","Masłów","20-30",0,null,null,0,"mniejszy niż 30 minut",null,null,null,null,null,null,null,"gmina Łagów"]
[null,null,null,null,null,"gmina Michałów","gmina","Michałów","40-45",null,1,null,1,"w przedziale od 30 do 50 minut",null,null,null,null,null,null,null,"gmina Łopuszno"]
[null,null,null,null,null,"gmina Miedziana Góra","gmina","Miedziana Góra","20-30",0,null,null,0,"mniejszy niż 30 minut",null,null,null,null,null,null,null,"gmina Masłów"]
[null,null,null,null,null,"gmina Mirzec","gmina","Mirzec","40-45",null,1,null,1,"w przedziale od 30 do 50 minut",null,null,null,null,null,null,null,"gmina Miedziana Góra"]
[null,null,null,null,null,"gmina Mniów","gmina","Mniów","30-35",null,1,null,1,"w przedziale od 30 do 50 minut",null,null,null,null,null,null,null,"gmina Mniów"]
[null,null,null,null,null,"gmina Morawica","gmina","Morawica","20-30",0,null,null,0,"mniejszy niż 30 minut",null,null,null,null,null,null,null,"gmina Morawica"]
[null,null,null,null,null,"gmina Moskorzew","gmina","Moskorzew","50-55",null,null,2,2,"większy niż 50 minut",null,null,null,null,null,null,null,"gmina Nowa Słupia"]
[null,null,null,null,null,"gmina Nagłowice","gmina","Nagłowice","40-45",null,1,null,1,"w przedziale od 30 do 50 minut",null,null,null,null,null,null,null,"gmina Nowiny"]
[null,null,null,null,null,"gmina Nowa Słupia","gmina","Nowa Słupia","40-45",null,1,null,1,"w przedziale od 30 do 50 minut",null,null,null,null,null,null,null,"gmina Piekoszów"]
[null,null,null,null,null,"gmina Nowy Korczyn","gmina","Nowy Korczyn","50-55",null,null,2,2,"większy niż 50 minut",null,null,null,null,null,null,null,"gmina Pierzchnica"]
[null,null,null,null,null,"gmina Obrazów","gmina","Obrazów","40-45",null,1,null,1,"w przedziale od 30 do 50 minut",null,null,null,null,null,null,null,"gmina Raków"]
[null,null,null,null,null,"gmina Oksa","gmina","Oksa","40-45",null,1,null,1,"w przedziale od 30 do 50 minut",null,null,null,null,null,null,null,"gmina Strawczyn"]
[null,null,null,null,null,"gmina Oleśnica","gmina","Oleśnica","50-55",null,null,2,2,"większy niż 50 minut",null,null,null,null,null,null,null,"gmina Zagnańsk"]
[null,null,null,null,null,"gmina Opatowiec","gmina","Opatowiec","50-55",null,null,2,2,"większy niż 50 minut",null,null,null,null,null,null,null,"gmina Fałków"]
[null,null,null,null,null,"gmina Opatów","gmina","Opatów","35-40",null,1,null,1,"w przedziale od 30 do 50 minut",null,null,null,null,null,null,null,"gmina Gowarczów"]
[null,null,null,null,null,"gmina Osiek","gmina","Osiek","45-50",null,1,null,1,"w przedziale od 30 do 50 minut",null,null,null,null,null,null,null,"gmina Końskie"]
[null,null,null,null,null,"gmina Ostrowiec Świętokrzyski","gmina","Ostrowiec Świętokrzyski","45-50",null,1,null,1,"w przedziale od 30 do 50 minut",null,null,null,null,null,null,null,"gmina Radoszyce"]
[null,null,null,null,null,"gmina Ożarów","gmina","Ożarów","50-55",null,null,2,2,"większy niż 50 minut",null,null,null,null,null,null,null,"gmina Ruda Maleniecka"]
[null,null,null,null,null,"gmina Pacanów","gmina","Pacanów","50-55",null,null,2,2,"większy niż 50 minut",null,null,null,null,null,null,null,"gmina Słupia Konecka"]
[null,null,null,null,null,"gmina Pawłów","gmina","Pawłów","40-45",null,1,null,1,"w przedziale od 30 do 50 minut",null,null,null,null,null,null,null,"gmina Smyków"]
[null,null,null,null,null,"gmina Piekoszów","gmina","Piekoszów","20-30",0,null,null,0,"mniejszy niż 30 minut",null,null,null,null,null,null,null,"gmina Stąporków"]
[null,null,null,null,null,"gmina Pierzchnica","gmina","Pierzchnica","30-35",null,1,null,1,"w przedziale od 30 do 50 minut",null,null,null,null,null,null,null,"gmina Baćkowice"]
[null,null,null,null,null,"gmina Pińczów","gmina","Pińczów","40-45",null,1,null,1,"w przedziale od 30 do 50 minut",null,null,null,null,null,null,null,"gmina Iwaniska"]
[null,null,null,null,null,"gmina Połaniec","gmina","Połaniec","50-55",null,null,2,2,"większy niż 50 minut",null,null,null,null,null,null,null,"gmina Lipnik"]
[null,null,null,null,null,"gmina Radków","gmina","Radków","45-50",null,1,null,1,"w przedziale od 30 do 50 minut",null,null,null,null,null,null,null,"gmina Opatów"]
[null,null,null,null,null,{"$f":"_xlfn.CONCAT(G437,\" \",H437)","v":"gmina Radoszyce"},"gmina","Radoszyce","35-40",null,1,null,{"$f":"J437+K437+L437","v":1},{"$f":"IF(M437=0,\"mniejszy niż 30 minut\",IF(M437=1,\"w przedziale od 30 do 50 minut\",\"większy niż 50 minut\"))","v":"w przedziale od 30 do 50 minut"},null,null,null,null,null,null,null,"gmina Ożarów"]
[null,null,null,null,null,"gmina Raków","gmina","Raków","35-40",null,1,null,1,"w przedziale od 30 do 50 minut",null,null,null,null,null,null,null,"gmina Sadowie"]
[null,null,null,null,null,"gmina Ruda Maleniecka","gmina","Ruda Maleniecka","35-40",null,1,null,1,"w przedziale od 30 do 50 minut",null,null,null,null,null,null,null,"gmina Tarłów"]
[null,null,null,null,null,"gmina Rytwiany","gmina","Rytwiany","45-50",null,1,null,1,"w przedziale od 30 do 50 minut",null,null,null,null,null,null,null,"gmina Wojciechowice"]
[null,null,null,null,null,"gmina Sadowie","gmina","Sadowie","40-45",null,1,null,1,"w przedziale od 30 do 50 minut",null,null,null,null,null,null,null,"gmina Bałtów"]
[null,null,null,null,null,"gmina Samborzec","gmina","Samborzec","40-45",null,1,null,1,"w przedziale od 30 do 50 minut",null,null,null,null,null,null,null,"gmina Bodzechów"]
[null,null,null,null,null,"gmina Sandomierz","gmina","Sandomierz","40-45",null,1,null,1,"w przedziale od 30 do 50 minut",null,null,null,null,null,null,null,"gmina Ćmielów"]
[null,null,null,null,null,"gmina Secemin","gmina","Secemin","50-55",null,null,2,2,"większy niż 50 minut",null,null,null,null,null,null,null,"gmina Kunów"]
[null,null,null,null,null,"gmina Sędziszów","gmina","Sędziszów","50-55",null,null,2,2,"większy niż 50 minut",null,null,null,null,null,null,null,"gmina Ostrowiec Świętokrzyski"]
[null,null,null,null,null,"gmina Nowiny","gmina","Nowiny","20-30",0,null,null,0,"mniejszy niż 30 minut",null,null,null,null,null,null,null,"gmina Waśniów"]
[null,null,null,null,null,"gmina Skalbmierz","gmina","Skalbmierz","45-50",null,1,null,1,"w przedziale od 30 do 50 minut",null,null,null,null,null,null,null,"gmina Działoszyce"]
[null,null,null,null,null,"gmina Skarżysko Kościelne","gmina","Skarżysko Kościelne","40-45",null,1,null,1,"w przedziale od 30 do 50 minut",null,null,null,null,null,null,null,"gmina Kije"]
[null,null,null,null,null,"gmina Skarżysko-Kamienna","gmina","Skarżysko-Kamienna","30-35",null,1,null,1,"w przedziale od 30 do 50 minut",null,null,null,null,null,null,null,"gmina Michałów"]
[null,null,null,null,null,"gmina Słupia Jędrzejowska","gmina","Słupia Jędrzejowska","50-55",null,null,2,2,"większy niż 50 minut",null,null,null,null,null,null,null,"gmina Pińczów"]
[null,null,null,null,null,"gmina Słupia Konecka","gmina","Słupia Konecka","40-45",null,1,null,1,"w przedziale od 30 do 50 minut",null,null,null,null,null,null,null,"gmina Złota"]
[null,null,null,null,null,"gmina Smyków","gmina","Smyków","30-35",null,1,null,1,"w przedziale od 30 do 50 minut",null,null,null,null,null,null,null,"gmina Dwikozy"]
[null,null,null,null,null,"gmina Sobków","gmina","Sobków","20-30",0,null,null,0,"mniejszy niż 30 minut",null,null,null,null,null,null,null,"gmina Klimontów"]
[null,null,null,null,null,"gmina Solec-Zdrój","gmina","Solec-Zdrój","50-55",null,null,2,2,"większy niż 50 minut",null,null,null,null,null,null,null,"gmina Koprzywnica"]
[null,null,null,null,null,"gmina Starachowice","gmina","Starachowice","40-45",null,1,null,1,"w przedziale od 30 do 50 minut",null,null,null,null,null,null,null,"gmina Łoniów"]
[null,null,null,null,null,"gmina Staszów","gmina","Staszów","40-45",null,1,null,1,"w przedziale od 30 do 50 minut",null,null,null,null,null,null,null,"gmina Obrazów"]
[null,null,null,null,null,"gmina Stąporków","gmina","Stąporków","35-40",null,1,null,1,"w przedziale od 30 do 50 minut",null,null,null,null,null,null,null,"gmina Samborzec"]
[null,null,null,null,null,"gmina Stopnica","gmina","Stopnica","45-50",null,1,null,1,"w przedziale od 30 do 50 minut",null,null,null,null,null,null,null,"gmina Sandomierz"]
[null,null,null,null,null,"gmina Strawczyn","gmina","Strawczyn","30-35",null,1,null,1,"w przedziale od 30 do 50 minut",null,null,null,null,null,null,null,"gmina Wilczyce"]
[null,null,null,null,null,"gmina Suchedniów","gmina","Suchedniów","30-35",null,1,null,1,"w przedziale od 30 do 50 minut",null,null,null,null,null,null,null,"gmina Zawichost"]
[null,null,null,null,null,"gmina Szydłów","gmina","Szydłów","40-45",null,1,null,1,"w przedziale od 30 do 50 minut",null,null,null,null,null,null,null,"gmina Bliżyn"]
[null,null,null,null,null,"gmina Tarłów","gmina","Tarłów","60-65",null,null,2,2,"większy niż 50 minut",null,null,null,null,null,null,null,"gmina Łączna"]
[null,null,null,null,null,"gmina Tuczępy","gmina","Tuczępy","45-50",null,1,null,1,"w przedziale od 30 do 50 minut",null,null,null,null,null,null,null,"gmina Skarżysko-Kamienna"]
[null,null,null,null,null,"gmina Waśniów","gmina","Waśniów","40-45",null,1,null,1,"w przedziale od 30 do 50 minut",null,null,null,null,null,null,null,"gmina Skarżysko Kościelne"]
[null,null,null,null,null,"gmina Wąchock","gmina","Wąchock","35-40",null,1,null,1,"w przedziale od 30 do 50 minut",null,null,null,null,null,null,null,"gmina Suchedniów"]
[null,null,null,null,null,"gmina Wilczyce","gmina","Wilczyce","45-50",null,1,null,1,"w przedziale od 30 do 50 minut",null,null,null,null,null,null,null,"gmina Brody"]
[null,null,null,null,null,"gmina Wiślica","gmina","Wiślica","45-50",null,1,null,1,"w przedziale od 30 do 50 minut",null,null,null,null,null,null,null,"gmina Mirzec"]
[null,null,null,null,null,"gmina Włoszczowa","gmina","Włoszczowa","45-50",null,1,null,1,"w przedziale od 30 do 50 minut",null,null,null,null,null,null,null,"gmina Pawłów"]
[null,null,null,null,null,"gmina Wodzisław","gmina","Wodzisław","40-45",null,1,null,1,"w przedziale od 30 do 50 minut",null,null,null,null,null,null,null,"gmina Starachowice"]
[null,null,null,null,null,"gmina Wojciechowice","gmina","Wojciechowice","45-50",null,1,null,1,"w przedziale od 30 do 50 minut",null,null,null,null,null,null,null,"gmina Wąchock"]
[null,null,null,null,null,"gmina Zagnańsk","gmina","Zagnańsk","20-30",0,null,null,0,"mniejszy niż 30 minut",null,null,null,null,null,null,null,"gmina Bogoria"]
[null,null,null,null,null,"gmina Zawichost","gmina","Zawichost","50-55",null,null,2,2,"większy niż 50 minut",null,null,null,null,null,null,null,"gmina Łubnice"]
[null,null,null,null,null,"gmina Złota","gmina","Złota","50-55",null,null,2,2,"większy niż 50 minut",null,null,null,null,null,null,null,"gmina Oleśnica"]
[null,null,null,null,null,null,null,null,null,null,null,null,null,null,null,null,null,null,null,null,null,"gmina Osiek"]
[null,null,null,null,null,null,null,null,null,null,null,null,null,null,null,null,null,null,null,null,null,"gmina Połaniec"]
[null,null,null,null,null,null,null,null,"Kryterium - wypadki ogółem, ofiary śmiertelne i ciężko ranne - 3 pkt",null,null,"Kryterium - wypadki z udziałem pieszych - 3 pkt",null,null,"Kryterium - wypadki spowodowane zbyt dużą prędkością - 3 pkt",null,null,"Łączna liczba przyznanych punktów w kryterium 1",null,null,null,"gmina Rytwiany"]
[null,null,null,null,null,null,null,"Nazwa","Ofiary śmiertelne i ciężko ranni",null,"Liczba przyznanych punktów","Ofiary śmiertelne i ciężko ranni",null,"Liczba przyznanych punktów","Ofiary śmiertelne i ciężko ranni",null,"Liczba przyznanych punktów",null,null,null,null,"gmina Staszów"]
[null,null,null,null,null,null,null,null,"Klasa ryzyka","Poziom ryzyka",null,"Klasa ryzyka","Poziom ryzyka",null,"Klasa ryzyka","Poziom ryzyka",null,null,null,null,null,"gmina Szydłów"]
[null,null,null,null,null,null,null,null,null,null,null,null,null,null,null,null,null,null,null,null,null,"gmina Kluczewsko"]
[null,null,null,null,null,null,null,"buski","B","Małe",0,"B","Małe",0,"C","Średnie",0,{"$f":"K480+N480+Q480","v":0},null,null,null,"gmina Krasocin"]
[null,null,null,null,null,null,null,"jędrzejowski","D","Duże",1,"C","Średnie",0,"D","Duże",1,{"$f":"K481+N481+Q481","v":2},null,null,null,"gmina Moskorzew"]
[null,null,null,null,null,null,null,"kazimierski","A","Bardzo małe",0,"A","Bardzo małe",0,"B","Małe",0,0,null,null,null,"gmina Radków"]
[null,null,null,null,null,null,null,"kielecki","E","Bardzo duże",1,"E","Bardzo duże",1,"E","Bardzo duże",1,3,null,null,null,"gmina Secemin"]
[null,null,null,null,null,null,null,"konecki","D","Duże",1,"D","Duże",1,"C","Średnie",0,2,null,null,null,"gmina Włoszczowa"]
[null,null,null,null,null,null,null,"opatowski","D","Duże",1,"D","Duże",1,"D","Duże",1,3]
[null,null,null,null,null,null,null,"ostrowiecki","B","Małe",0,"D","Duże",1,"A","Bardzo małe",0,1]
[null,null,null,null,null,null,null,"pińczowski","A","Bardzo małe",0,"B","Małe",0,"A","Bardzo małe",0,0]
[null,null,null,null,null,null,null,"sandomierski","D","Duże",1,"D","Duże",1,"C","Średnie",0,2]
[null,null,null,null,null,null,null,"skarżyski","A","Bardzo małe",0,"C","Średnie",0,"A","Bardzo małe",0,0]
[null,null,null,null,null,null,null,"starachowicki","A","Bardzo małe",0,"C","Średnie",0,"A","Bardzo małe",0,0]
[null,null,null,null,null,null,null,"staszowski","A","Bardzo małe",0,"A","Bardzo małe",0,"B","Małe",0,0]
[null,null,null,null,null,null,null,"włoszczowski","B","Małe",0,"A","Bardzo małe",0,"B","Małe",0,0]
[]
[]
[null,null,null,null,"DROGI POWIATOWE I GMINNE",null,"RFRD - KRYTERIUM 1 - ",null,"poziom ryzyka społecznego uwzgledniającego liczbę wypadków drogowych, \nw tym z udziałem pieszych oraz liczbę ofiar śmiertelnych "]
[null,null,null,null,null,null,"Lp.","Nazwa jst","Liczba przyznanych punktów - wypadki drogowe ogółem na 100 tys. ludności","Liczba przyznanych punktów - wypadki drogowe z udziałem pieszych na 100 tys. ludności","Liczba przyznanych punktów - ofiary śmiertelne na 100 tys. ludności","Łączna liczba przyznanych punktów \nw kryterium 1","Liczba przyznanych punktów - wypadki drogowe ogółem na 100 tys. ludności","Liczba przyznanych punktów - wypadki drogowe z udziałem pieszych na 100 tys. ludności","Liczba przyznanych punktów - ofiary śmiertelne na 100 tys. ludności"]
[null,null,null,null,null,"buski",1,"Powiat buski",0,1,0,1,{"$f":"IF(I497=0,\"NIE\",\"TAK\")","v":"NIE"},{"$f":"IF(J497=0,\"NIE\",\"TAK\")","v":"TAK"},"NIE"]
[null,null,null,null,null,"jędrzejowski",2,"Powiat jędrzejowski",1,1,1,3,{"$f":"IF(I498=0,\"NIE\",\"TAK\")","v":"TAK"},"TAK","TAK"]
[null,null,null,null,null,"kazimierski",3,"Powiat kazimierski",1,1,1,3,"TAK","TAK","TAK"]
[null,null,null,null,null,"kielecki",4,"Powiat kielecki",1,1,1,3,"TAK","TAK","TAK"]
[null,null,null,null,null,"konecki",5,"Powiat konecki",1,1,1,3,"TAK","TAK","TAK"]
[null,null,null,null,null,"opatowski",6,"Powiat opatowski",1,1,1,3,"TAK","TAK","TAK"]
[null,null,null,null,null,"ostrowiecki",7,"Powiat ostrowiecki",0,1,0,1,"NIE","TAK","NIE"]
[null,null,null,null,null,"pińczowski",8,"Powiat pińczowski",1,1,1,3,"TAK","TAK","TAK"]
[null,null,null,null,null,"sandomierski",9,"Powiat sandomierski",1,1,1,3,"TAK","TAK","TAK"]
[null,null,null,null,null,"skarżyski",10,"Powiat skarżyski",1,1,0,2,"TAK","TAK","NIE"]
[null,null,null,null,null,"starachowicki",11,"Powiat starachowicki",1,1,0,2,"TAK","TAK","NIE"]
[null,null,null,null,null,"staszowski",12,"Powiat staszowski",1,1,1,3,"TAK","TAK","TAK"]
[null,null,null,null,null,"włoszczowski",13,"Powiat włoszczowski",1,1,1,3,"TAK","TAK","TAK"]
[null,null,null,null,null,null,null,null,null,null,null,0,{"$f":"COUNTIF($L$497:$L$509,L510)","v":0}]
[null,null,null,null,null,null,null,null,null,null,null,1,{"$f":"COUNTIF($L$497:$L$509,L511)","v":2}]
[null,null,null,null,null,null,null,null,null,null,null,2,2]
[null,null,null,null,null,null,null,null,null,null,null,3,9]
[]
[null,null,null,null,"POWIATY - DROGI POWIATOWE",null,"RFRD - KRYTERIUM 1 - ",null,"poziom ryzyka społecznego uwzgledniającego liczbę wypadków drogowych, \nw tym z udziałem pieszych oraz liczbę ofiar śmiertelnych "]
[null,null,null,null,null,null,"Lp.","Nazwa jst","Liczba przyznanych punktów - wypadki drogowe ogółem na 100 tys. ludności","Liczba przyznanych punktów - wypadki drogowe z udziałem pieszych na 100 tys. ludności","Liczba przyznanych punktów - ofiary śmiertelne na 100 tys. ludności","Łączna liczba przyznanych punktów \nw kryterium 1","Liczba przyznanych punktów - wypadki drogowe ogółem na 100 tys. ludności","Liczba przyznanych punktów - wypadki drogowe z udziałem pieszych na 100 tys. ludności","Liczba przyznanych punktów - ofiary śmiertelne na 100 tys. ludności"]
[null,null,null,null,null,"buski",1,"Powiat buski",0,0,0,0,{"$f":"IF(I517=0,\"NIE\",\"TAK\")","v":"NIE"},{"$f":"IF(J517=0,\"NIE\",\"TAK\")","v":"NIE"},{"$f":"IF(K517=0,\"NIE\",\"TAK\")","v":"NIE"}]
[null,null,null,null,null,"jędrzejowski",2,"Powiat jędrzejowski",1,1,1,3,{"$f":"IF(I518=0,\"NIE\",\"TAK\")","v":"TAK"},"TAK","TAK"]
[null,null,null,null,null,"kazimierski",3,"Powiat kazimierski",1,0,1,2,"TAK","NIE","TAK"]
[null,null,null,null,null,"kielecki",4,"Powiat kielecki",1,1,1,3,"TAK","TAK","TAK"]
[null,null,null,null,null,"konecki",5,"Powiat konecki",0,1,0,1,"NIE","TAK","NIE"]
[null,null,null,null,null,"opatowski",6,"Powiat opatowski",1,1,1,3,"TAK","TAK","TAK"]
[null,null,null,null,null,"ostrowiecki",7,"Powiat ostrowiecki",0,0,0,0,"NIE","NIE","NIE"]
[null,null,null,null,null,"pińczowski",8,"Powiat pińczowski",1,0,1,2,"TAK","NIE","TAK"]
[null,null,null,null,null,"sandomierski",9,"Powiat sandomierski",0,0,0,0,"NIE","NIE","NIE"]
[null,null,null,null,null,"skarżyski",10,"Powiat skarżyski",0,1,0,1,"NIE","TAK","NIE"]
[null,null,null,null,null,"starachowicki",11,"Powiat starachowicki",0,0,0,0,"NIE","NIE","NIE"]
[null,null,null,null,null,"staszowski",12,"Powiat staszowski",1,1,1,3,"TAK","TAK","TAK"]
[null,null,null,null,null,"włoszczowski",13,"Powiat włoszczowski",1,1,1,3,"TAK","TAK","TAK"]
[null,null,null,null,null,null,null,null,null,null,null,0,{"$f":"COUNTIF($L$517:$L$529,L530)","v":4}]
[null,null,null,null,null,null,null,null,null,null,null,1,{"$f":"COUNTIF($L$517:$L$529,L531)","v":2}]
[null,null,null,null,null,null,null,null,null,null,null,2,2]
[null,null,null,null,null,null,null,null,null,null,null,3,5]
[]
[null,null,null,null,"GMINY - DROGI GMINNE",null,"RFRD - KRYTERIUM 1 - ",null,"poziom ryzyka społecznego uwzgledniającego liczbę wypadków drogowych, \nw tym z udziałem pieszych oraz liczbę ofiar śmiertelnych "]
[null,null,null,null,null,null,"Lp.","Nazwa jst","Liczba przyznanych punktów - wypadki drogowe ogółem na 100 tys. ludności","Liczba przyznanych punktów - wypadki drogowe z udziałem pieszych na 100 tys. ludności","Liczba przyznanych punktów - ofiary śmiertelne na 100 tys. ludności","Łączna liczba przyznanych punktów \nw kryterium 1","Liczba przyznanych punktów - wypadki drogowe ogółem na 100 tys. ludności","Liczba przyznanych punktów - wypadki drogowe z udziałem pieszych na 100 tys. ludności","Liczba przyznanych punktów - ofiary śmiertelne na 100 tys. ludności"]
[null,null,null,null,null,{"$f":"VLOOKUP(H537,$G$264:$N$365,8,0)","v":"buski"},1,"Busko-Zdrój",0,1,0,1,{"$f":"IF(I537=0,\"NIE\",\"TAK\")","v":"NIE"},{"$f":"IF(J537=0,\"NIE\",\"TAK\")","v":"TAK"},{"$f":"IF(K537=0,\"NIE\",\"TAK\")","v":"NIE"}]
[null,null,null,null,null,{"$f":"VLOOKUP(H538,$G$264:$N$365,8,0)","v":"buski"},2,"Gnojno",0,0,0,0,{"$f":"IF(I538=0,\"NIE\",\"TAK\")","v":"NIE"},"NIE","NIE"]
[null,null,null,null,null,{"$f":"VLOOKUP(H539,$G$264:$N$365,8,0)","v":"buski"},3,"Nowy Korczyn",0,0,0,0,"NIE","NIE","NIE"]
[null,null,null,null,null,"buski",4,"Pacanów",0,1,0,1,"NIE","TAK","NIE"]
[null,null,null,null,null,"buski",5,"Solec-Zdrój",0,0,0,0,"NIE","NIE","NIE"]
[null,null,null,null,null,"buski",6,"Stopnica",0,1,0,1,"NIE","TAK","NIE"]
[null,null,null,null,null,"buski",7,"Tuczępy",0,0,0,0,"NIE","NIE","NIE"]
[null,null,null,null,null,"buski",8,"Wiślica",0,0,0,0,"NIE","NIE","NIE"]
[null,null,null,null,null,"jędrzejowski",9,"Imielno",1,0,0,1,"TAK","NIE","NIE"]
[null,null,null,null,null,"jędrzejowski",10,"Jędrzejów",1,1,0,2,"TAK","TAK","NIE"]
[null,null,null,null,null,"jędrzejowski",11,"Małogoszcz",1,1,1,3,"TAK","TAK","TAK"]
[null,null,null,null,null,"jędrzejowski",12,"Nagłowice",1,1,0,2,"TAK","TAK","NIE"]
[null,null,null,null,null,"jędrzejowski",13,"Oksa",0,0,0,0,"NIE","NIE","NIE"]
[null,null,null,null,null,"jędrzejowski",14,"Sędziszów",0,1,1,2,{"$f":"IF(I550=0,\"NIE\",\"TAK\")","v":"NIE"},{"$f":"IF(J550=0,\"NIE\",\"TAK\")","v":"TAK"},{"$f":"IF(K550=0,\"NIE\",\"TAK\")","v":"TAK"}]
[null,null,null,null,null,"jędrzejowski",15,"Słupia jędrzejowska",0,0,0,0,"NIE","NIE","NIE"]
[null,null,null,null,null,"jędrzejowski",16,"Sobków",0,0,0,0,"NIE","NIE","NIE"]
[null,null,null,null,null,"jędrzejowski",17,"Wodzisław",0,0,0,0,"NIE","NIE","NIE"]
[null,null,null,null,null,"kazimierski",18,"Bejsce",0,0,0,0,"NIE","NIE","NIE"]
[null,null,null,null,null,"kazimierski",19,"Czarnocin",0,0,0,0,"NIE","NIE","NIE"]
[null,null,null,null,null,"kazimierski",20,"Kazimierza Wielka",0,1,0,1,{"$f":"IF(I556=0,\"NIE\",\"TAK\")","v":"NIE"},"TAK","NIE"]
[null,null,null,null,null,"kazimierski",21,"Opatowiec",0,0,0,0,{"$f":"IF(I557=0,\"NIE\",\"TAK\")","v":"NIE"},{"$f":"IF(J557=0,\"NIE\",\"TAK\")","v":"NIE"},{"$f":"IF(K557=0,\"NIE\",\"TAK\")","v":"NIE"}]
[null,null,null,null,null,"kazimierski",22,"Skalbmierz",0,0,0,0,"NIE","NIE","NIE"]
[null,null,null,null,null,"kielecki",23,"Bieliny",0,0,0,0,"NIE","NIE","NIE"]
[null,null,null,null,null,"kielecki",24,"Bodzentyn",0,0,0,0,"NIE","NIE","NIE"]
[null,null,null,null,null,"kielecki",25,"Chęciny",0,0,0,0,"NIE","NIE","NIE"]
[null,null,null,null,null,"kielecki",26,"Chmielnik",0,0,1,1,"NIE","NIE","TAK"]
[null,null,null,null,null,"kielecki",27,"Daleszyce",0,0,0,0,"NIE","NIE","NIE"]
[null,null,null,null,null,"kielecki",28,"Górno",0,0,0,0,"NIE","NIE","NIE"]
[null,null,null,null,null,"kielecki",29,"Łagów",0,0,0,0,"NIE","NIE","NIE"]
[null,null,null,null,null,"kielecki",30,"Łopuszno",0,0,0,0,"NIE","NIE","NIE"]
[null,null,null,null,null,"kielecki",31,"Masłów",0,0,0,0,"NIE","NIE","NIE"]
[null,null,null,null,null,"kielecki",32,"Miedziana Góra",0,0,0,0,"NIE","NIE","NIE"]
[null,null,null,null,null,"kielecki",33,"Mniów",0,0,0,0,"NIE","NIE","NIE"]
[null,null,null,null,null,"kielecki",34,"Morawica",0,1,0,1,"NIE","TAK","NIE"]
[null,null,null,null,null,"kielecki",35,"Nowa Słupia",0,0,0,0,"NIE","NIE","NIE"]
[null,null,null,null,null,"kielecki",36,"Piekoszów",0,0,0,0,"NIE","NIE","NIE"]
[null,null,null,null,null,"kielecki",37,"Pierzchnica",0,0,0,0,"NIE","NIE","NIE"]
[null,null,null,null,null,"kielecki",38,"Raków",0,0,0,0,"NIE","NIE","NIE"]
[null,null,null,null,null,"kielecki",39,"Nowiny",0,0,0,0,"NIE","NIE","NIE"]
[null,null,null,null,null,"kielecki",40,"Strawczyn",0,0,0,0,"NIE","NIE","NIE"]
[null,null,null,null,null,"kielecki",41,"Zagnańsk",0,0,0,0,"NIE","NIE","NIE"]
[null,null,null,null,null,"konecki",42,"Fałków",0,0,0,0,"NIE","NIE","NIE"]
[null,null,null,null,null,"konecki",43,"Gowarczów",0,0,0,0,"NIE","NIE","NIE"]
[null,null,null,null,null,"konecki",44,"Końskie",0,1,0,1,"NIE","TAK","NIE"]
[null,null,null,null,null,"konecki",45,"Radoszyce",0,0,0,0,"NIE","NIE","NIE"]
[null,null,null,null,null,"konecki",46,"Ruda Maleniecka",0,0,0,0,"NIE","NIE","NIE"]
[null,null,null,null,null,"konecki",47,"Słupia Konecka",0,0,0,0,"NIE","NIE","NIE"]
[null,null,null,null,null,"konecki",48,"Smyków",0,0,0,0,"NIE","NIE","NIE"]
[null,null,null,null,null,"konecki",49,"Stąporków",0,0,0,0,"NIE","NIE","NIE"]
[null,null,null,null,null,"opatowski",50,"Baćkowice",0,0,0,0,"NIE","NIE","NIE"]
[null,null,null,null,null,"opatowski",51,"Iwaniska",0,1,0,1,"NIE","TAK","NIE"]
[null,null,null,null,null,"opatowski",52,"Lipnik",0,1,0,1,"NIE","TAK","NIE"]
[null,null,null,null,null,"opatowski",53,"Opatów",0,0,0,0,"NIE","NIE","NIE"]
[null,null,null,null,null,"opatowski",54,"Ożarów",0,1,0,1,"NIE","TAK","NIE"]
[null,null,null,null,null,"opatowski",55,"Sadowie",0,0,0,0,"NIE","NIE","NIE"]
[null,null,null,null,null,"opatowski",56,"Tarłów",1,0,0,1,"TAK","NIE","NIE"]
[null,null,null,null,null,"opatowski",57,"Wojciechowice",0,1,1,2,"NIE","TAK","TAK"]
[null,null,null,null,null,"ostrowiecki",58,"Ostrowiec Świętokrzyski",0,0,0,0,"NIE","NIE","NIE"]
[null,null,null,null,null,"ostrowiecki",59,"Bałtów",0,0,0,0,"NIE","NIE","NIE"]
[null,null,null,null,null,"ostrowiecki",60,"Bodzechów",0,0,0,0,"NIE","NIE","NIE"]
[null,null,null,null,null,"ostrowiecki",61,"Ćmielów",0,1,0,1,"NIE","TAK","NIE"]
[null,null,null,null,null,"ostrowiecki",62,"Kunów",0,0,0,0,"NIE","NIE","NIE"]
[null,null,null,null,null,"ostrowiecki",63,"Waśniów",0,1,0,1,"NIE","TAK","NIE"]
[null,null,null,null,null,"pińczowski",64,"Działoszyce",0,0,0,0,"NIE","NIE","NIE"]
[null,null,null,null,null,"pińczowski",65,"Kije",0,0,0,0,"NIE","NIE","NIE"]
[null,null,null,null,null,"pińczowski",66,"Michałów",0,0,0,0,"NIE","NIE","NIE"]
[null,null,null,null,null,{"$f":"VLOOKUP(H603,$G$264:$N$365,8,0)","v":"pińczowski"},67,"Pińczów",0,1,0,1,"NIE","TAK","NIE"]
[null,null,null,null,null,"pińczowski",68,"Złota",0,0,0,0,"NIE","NIE","NIE"]
[null,null,null,null,null,"sandomierski",69,"Sandomierz",0,1,0,1,"NIE","TAK","NIE"]
[null,null,null,null,null,"sandomierski",70,"Dwikozy",0,0,0,0,"NIE","NIE","NIE"]
[null,null,null,null,null,"sandomierski",71,"Klimontów",0,1,1,2,"NIE","TAK","TAK"]
[null,null,null,null,null,"sandomierski",72,"Koprzywnica",0,0,0,0,"NIE","NIE","NIE"]
[null,null,null,null,null,"sandomierski",73,"Łoniów",0,0,0,0,"NIE","NIE","NIE"]
[null,null,null,null,null,"sandomierski",74,"Obrazów",0,1,0,1,"NIE","TAK","NIE"]
[null,null,null,null,null,"sandomierski",75,"Samborzec",0,0,0,0,"NIE","NIE","NIE"]
[null,null,null,null,null,"sandomierski",76,"Wilczyce",0,0,0,0,"NIE","NIE","NIE"]
[null,null,null,null,null,"sandomierski",77,"Zawichost",0,0,0,0,"NIE","NIE","NIE"]
[null,null,null,null,null,"skarżyski",78,"Skarżysko-Kamienna",0,1,0,1,"NIE","TAK","NIE"]
[null,null,null,null,null,"skarżyski",79,"Bliżyn",0,0,0,0,"NIE","NIE","NIE"]
[null,null,null,null,null,"skarżyski",80,"Łączna",0,0,0,0,"NIE","NIE","NIE"]
[null,null,null,null,null,"skarżyski",81,"Skarżysko Kościelne",0,0,0,0,"NIE","NIE","NIE"]
[null,null,null,null,null,"skarżyski",82,"Suchedniów",0,0,0,0,"NIE","NIE","NIE"]
[null,null,null,null,null,"starachowicki",83,"Starachowice",0,1,0,1,"NIE","TAK","NIE"]
[null,null,null,null,null,"starachowicki",84,"Brody",0,0,1,1,"NIE","NIE","TAK"]
[null,null,null,null,null,"starachowicki",85,"Mirzec",0,1,0,1,{"$f":"IF(I621=0,\"NIE\",\"TAK\")","v":"NIE"},{"$f":"IF(J621=0,\"NIE\",\"TAK\")","v":"TAK"},{"$f":"IF(K621=0,\"NIE\",\"TAK\")","v":"NIE"}]
[null,null,null,null,null,"starachowicki",86,"Pawłów",0,0,0,0,"NIE","NIE","NIE"]
[null,null,null,null,null,"starachowicki",87,"Wąchock",0,1,0,1,"NIE","TAK","NIE"]
[null,null,null,null,null,"staszowski",88,"Bogoria",0,0,0,0,"NIE","NIE","NIE"]
[null,null,null,null,null,"staszowski",89,"Łubnice",0,0,0,0,"NIE","NIE","NIE"]
[null,null,null,null,null,"staszowski",90,"Oleśnica",0,0,0,0,"NIE","NIE","NIE"]
[null,null,null,null,null,"staszowski",91,"Osiek",0,1,1,2,"NIE","TAK","TAK"]
[null,null,null,null,null,"staszowski",92,"Połaniec",0,0,0,0,"NIE","NIE","NIE"]
[null,null,null,null,null,"staszowski",93,"Rytwiany",0,0,0,0,"NIE","NIE","NIE"]
[null,null,null,null,null,"staszowski",94,"Staszów",0,0,0,0,"NIE","NIE","NIE"]
[null,null,null,null,null,"staszowski",95,"Szydłów",0,0,0,0,"NIE","NIE","NIE"]
[null,null,null,null,null,"włoszczowski",96,"Kluczewsko",0,0,0,0,"NIE","NIE","NIE"]
[null,null,null,null,null,"włoszczowski",97,"Krasocin",0,0,0,0,"NIE","NIE","NIE"]
[null,null,null,null,null,"włoszczowski",98,"Moskorzew",0,0,0,0,"NIE","NIE","NIE"]
[null,null,null,null,null,"włoszczowski",99,"Radków",0,0,0,0,"NIE","NIE","NIE"]
[null,null,null,null,null,"włoszczowski",100,"Secemin",0,0,0,0,"NIE","NIE","NIE"]
[null,null,null,null,null,"włoszczowski",101,"Włoszczowa",0,0,0,0,"NIE","NIE","NIE"]
[null,null,null,null,null,null,null,null,null,null,null,0,{"$f":"COUNTIF($L$537:$L$637,L638)","v":72}]
[null,null,null,null,null,null,null,null,null,null,null,1,{"$f":"COUNTIF($L$537:$L$637,L639)","v":22}]
[null,null,null,null,null,null,null,null,null,null,null,2,6]
[null,null,null,null,null,null,null,null,null,null,null,3,1]

{"sheet":"DANE - TERC","index":3,"n_rows":119,"n_cols":12,"rows_kept":119,"cut":false,"hidden":false,"merged":[[3,8,3,11],[3,4,3,7],[1,1,1,10]]}
[null,"DANE DO WNIOSKU"]
[null,"Numery Teryt/TERC jednostek samorządu terytorialnego województwa świętokrzyskiego"]
[]
[null,null,null,null,2023,null,null,null,2024]
[null,"powiat","gmina","JST","Teryt\nTERC","typ JST","SKRÓT - typ JST","uwagi","Teryt\nTERC","typ JST","SKRÓT - typ JST","uwagi"]
[null,"buski",null,"powiat buski",2601,"powiat ziemski","PZ","",2601,"powiat ziemski","PZ",""]
[null,"jędrzejowski",null,"powiat jędrzejowski",2602,"powiat ziemski","PZ","",2602,"powiat ziemski","PZ",""]
[null,"kazimierski",null,"powiat kazimierski",2603,"powiat ziemski","PZ","",2603,"powiat ziemski","PZ",""]
[null,"kielecki",null,"powiat kielecki",2604,"powiat ziemski","PZ","",2604,"powiat ziemski","PZ",""]
[null,"konecki",null,"powiat konecki",2605,"powiat ziemski","PZ","",2605,"powiat ziemski","PZ",""]
[null,"opatowski",null,"powiat opatowski",2606,"powiat ziemski","PZ","",2606,"powiat ziemski","PZ",""]
[null,"ostrowiecki",null,"powiat ostrowiecki",2607,"powiat ziemski","PZ","",2607,"powiat ziemski","PZ",""]
[null,"pińczowski",null,"powiat pińczowski",2608,"powiat ziemski","PZ","",2608,"powiat ziemski","PZ",""]
[null,"sandomierski",null,"powiat sandomierski",2609,"powiat ziemski","PZ","",2609,"powiat ziemski","PZ",""]
[null,"skarżyski",null,"powiat skarżyski",2610,"powiat ziemski","PZ","",2610,"powiat ziemski","PZ",""]
[null,"starachowicki",null,"powiat starachowicki",2611,"powiat ziemski","PZ","",2611,"powiat ziemski","PZ",""]
[null,"staszowski",null,"powiat staszowski",2612,"powiat ziemski","PZ","",2612,"powiat ziemski","PZ",""]
[null,"włoszczowski",null,"powiat włoszczowski",2613,"powiat ziemski","PZ","",2613,"powiat ziemski","PZ",""]
[null,"buski","Busko-Zdrój","gmina Busko-Zdrój",2601013,"gmina miejsko-wiejska","GM-W","",2601013,"gmina miejsko-wiejska","GM-W",""]
[null,"buski","Gnojno","gmina Gnojno",2601022,"gmina wiejska","GW","",2601022,"gmina wiejska","GW",""]
[null,"buski","Nowy Korczyn","gmina Nowy Korczyn",2601033,"gmina miejsko-wiejska","GM-W","",2601033,"gmina miejsko-wiejska","GM-W",""]
[null,"buski","Pacanów","gmina Pacanów",2601043,"gmina miejsko-wiejska","GM-W","",2601043,"gmina miejsko-wiejska","GM-W",""]
[null,"buski","Solec-Zdrój","gmina Solec-Zdrój",2601052,"gmina wiejska","GW","",2601052,"gmina wiejska","GW",""]
[null,"buski","Stopnica","gmina Stopnica",2601063,"gmina miejsko-wiejska","GM-W","",2601063,"gmina miejsko-wiejska","GM-W",""]
[null,"buski","Tuczępy","gmina Tuczępy",2601072,"gmina wiejska","GW","",2601072,"gmina wiejska","GW",""]
[null,"buski","Wiślica","gmina Wiślica",2601083,"gmina miejsko-wiejska","GM-W","",2601083,"gmina miejsko-wiejska","GM-W",""]
[null,"jędrzejowski","Imielno","gmina Imielno",2602012,"gmina wiejska","GW","",2602012,"gmina wiejska","GW",""]
[null,"jędrzejowski","Jędrzejów","gmina Jędrzejów",2602023,"gmina miejsko-wiejska","GM-W","",2602023,"gmina miejsko-wiejska","GM-W",""]
[null,"jędrzejowski","Małogoszcz","gmina Małogoszcz",2602033,"gmina miejsko-wiejska","GM-W","",2602033,"gmina miejsko-wiejska","GM-W",""]
[null,"jędrzejowski","Nagłowice","gmina Nagłowice",2602042,"gmina wiejska","GW","",2602042,"gmina wiejska","GW",""]
[null,"jędrzejowski","Oksa","gmina Oksa",2602052,"gmina wiejska","GW","",2602052,"gmina wiejska","GW",""]
[null,"jędrzejowski","Sędziszów","gmina Sędziszów",2602063,"gmina miejsko-wiejska","GM-W","",2602063,"gmina miejsko-wiejska","GM-W",""]
[null,"jędrzejowski","Słupia Jędrzejowska","gmina Słupia Jędrzejowska",2602072,"gmina wiejska","GW","",2602072,"gmina wiejska","GW",""]
[null,"jędrzejowski","Sobków","gmina Sobków",2602082,"gmina wiejska","GW","",2602082,"gmina wiejska","GW",""]
[null,"jędrzejowski","Wodzisław","gmina Wodzisław",2602093,"gmina miejsko-wiejska","GM-W","",2602093,"gmina miejsko-wiejska","GM-W",""]
[null,"kazimierski","Bejsce","gmina Bejsce",2603012,"gmina wiejska","GW","",2603012,"gmina wiejska","GW",""]
[null,"kazimierski","Czarnocin","gmina Czarnocin",2603022,"gmina wiejska","GW","",2603022,"gmina wiejska","GW",""]
[null,"kazimierski","Kazimierza Wielka","gmina Kazimierza Wielka",2603033,"gmina miejsko-wiejska","GM-W","",2603033,"gmina miejsko-wiejska","GM-W",""]
[null,"kazimierski","Opatowiec","gmina Opatowiec",2603043,"gmina miejsko-wiejska","GM-W","",2603043,"gmina miejsko-wiejska","GM-W",""]
[null,"kazimierski","Skalbmierz","gmina Skalbmierz",2603053,"gmina miejsko-wiejska","GM-W","",2603053,"gmina miejsko-wiejska","GM-W",""]
[null,"kielecki","Bieliny","gmina Bieliny",2604012,"gmina wiejska","GW","",2604012,"gmina wiejska","GW",""]
[null,"kielecki","Bodzentyn","gmina Bodzentyn",2604023,"gmina miejsko-wiejska","GM-W","",2604023,"gmina miejsko-wiejska","GM-W",""]
[null,"kielecki","Chęciny","gmina Chęciny",2604033,"gmina miejsko-wiejska","GM-W","",2604033,"gmina miejsko-wiejska","GM-W",""]
[null,"kielecki","Chmielnik","gmina Chmielnik",2604043,"gmina miejsko-wiejska","GM-W","",2604043,"gmina miejsko-wiejska","GM-W",""]
[null,"kielecki","Daleszyce","gmina Daleszyce",2604053,"gmina miejsko-wiejska","GM-W","",2604053,"gmina miejsko-wiejska","GM-W",""]
[null,"kielecki","Górno","gmina Górno",2604062,"gmina wiejska","GW","",2604062,"gmina wiejska","GW",""]
[null,"kielecki","Łagów","gmina Łagów",2604073,"gmina miejsko-wiejska","GM-W","",2604073,"gmina miejsko-wiejska","GM-W",""]
[null,"kielecki","Łopuszno","gmina Łopuszno",2604082,"gmina wiejska","GW","zmiana od 2023 \n(stary teryt 2604082 - gmina wiejska; \n nowy teryt 2604083 - gmina miejsko-wiejska) \nZMIANA NIE ZOSTAŁA UWZGLĘDNIONA na listach z 2023 oraz na liście z 2024",2604083,"gmina miejsko-wiejska","GM-W","zmiana od 2023 \n(stary teryt 2604082 - gmina wiejska; \n nowy teryt 2604083 - gmina miejsko-wiejska) \nZMIANA NIE ZOSTAŁA UWZGLĘDNIONA na listach z 2023 oraz na liście z 2024"]
[null,"kielecki","Masłów","gmina Masłów",2604092,"gmina wiejska","GW","",2604092,"gmina wiejska","GW",""]
[null,"kielecki","Miedziana Góra","gmina Miedziana Góra",2604102,"gmina wiejska","GW","",2604102,"gmina wiejska","GW",""]
[null,"kielecki","Mniów","gmina Mniów",2604112,"gmina wiejska","GW","",2604112,"gmina wiejska","GW",""]
[null,"kielecki","Morawica","gmina Morawica",2604123,"gmina miejsko-wiejska","GM-W","",2604123,"gmina miejsko-wiejska","GM-W",""]
[null,"kielecki","Nowa Słupia","gmina Nowa Słupia",2604133,"gmina miejsko-wiejska","GM-W","",2604133,"gmina miejsko-wiejska","GM-W",""]
[null,"kielecki","Nowiny","gmina Nowiny",2604172,"gmina wiejska","GW","",2604172,"gmina wiejska","GW",""]
[null,"kielecki","Piekoszów","gmina Piekoszów",2604142,"gmina wiejska","GW","zmiana od 2023 \n(stary teryt 2604142 - gmina wiejska; \n nowy teryt 2604143 - gmina miejsko-wiejska) \nZMIANA NIE ZOSTAŁA UWZGLĘDNIONA na listach z 2023 oraz na liście z 2024",2604143,"gmina miejsko-wiejska","GM-W","zmiana od 2023 \n(stary teryt 2604142 - gmina wiejska; \n nowy teryt 2604143 - gmina miejsko-wiejska) \nZMIANA NIE ZOSTAŁA UWZGLĘDNIONA na listach z 2023 oraz na liście z 2024"]
[null,"kielecki","Pierzchnica","gmina Pierzchnica",2604153,"gmina miejsko-wiejska","GM-W","",2604153,"gmina miejsko-wiejska","GM-W",""]
[null,"kielecki","Raków","gmina Raków",2604162,"gmina wiejska","GW","",2604162,"gmina wiejska","GW",""]
[null,"kielecki","Strawczyn","gmina Strawczyn",2604182,"gmina wiejska","GW","",2604182,"gmina wiejska","GW",""]
[null,"kielecki","Zagnańsk","gmina Zagnańsk",2604192,"gmina wiejska","GW","",2604192,"gmina wiejska","GW",""]
[null,"konecki","Fałków","gmina Fałków",2605012,"gmina wiejska","GW","",2605012,"gmina wiejska","GW",""]
[null,"konecki","Gowarczów","gmina Gowarczów",2605022,"gmina wiejska","GW","będzie zmiana od 2024",2605023,"gmina miejsko-wiejska","GM-W","zmiana od 2024 \n(stary teryt 2605022 - gmina wiejska;\nnowy teryt 2605022 - gmina miejsko-wiejska) \nZMIANA NIE ZOSTAŁA UWZGLĘDNIONA na liście z 2024"]
[null,"konecki","Końskie","gmina Końskie",2605033,"gmina miejsko-wiejska","GM-W","",2605033,"gmina miejsko-wiejska","GM-W",""]
[null,"konecki","Radoszyce","gmina Radoszyce",2605043,"gmina miejsko-wiejska","GM-W","",2605043,"gmina miejsko-wiejska","GM-W",""]
[null,"konecki","Ruda Maleniecka","gmina Ruda Maleniecka",2605052,"gmina wiejska","GW","",2605052,"gmina wiejska","GW",""]
[null,"konecki","Słupia Konecka","gmina Słupia Konecka",2605062,"gmina wiejska","GW","",2605062,"gmina wiejska","GW",""]
[null,"konecki","Smyków","gmina Smyków",2605072,"gmina wiejska","GW","",2605072,"gmina wiejska","GW",""]
[null,"konecki","Stąporków","gmina Stąporków",2605083,"gmina miejsko-wiejska","GM-W","",2605083,"gmina miejsko-wiejska","GM-W",""]
[null,"opatowski","Baćkowice","gmina Baćkowice",2606012,"gmina wiejska","GW","",2606012,"gmina wiejska","GW",""]
[null,"opatowski","Iwaniska","gmina Iwaniska",2606022,"gmina wiejska","GW","zmiana od 2022 (stary teryt 2606022) \n(stary teryt 2606022 - gmina wiejska; \n nowy teryt 2606023 - gmina miejsko-wiejska) \nZMIANA NIE ZOSTAŁA UWZGLĘDNIONA na listach z 2022 i 2023 oraz na liście z 2024 \n\nZmiana nie została również uwzględniona w załączniku dowiadomości e-mail z MI z dnia 27.10.2022 dotyczącej dochodów podatkowych RFRD 2023",2606023,"gmina miejsko-wiejska","GM-W","zmiana od 2022 \n(stary teryt 2606022 - gmina wiejska; \n nowy teryt 2606023 - gmina miejsko-wiejska) \nZMIANA NIE ZOSTAŁA UWZGLĘDNIONA na listach z 2022 i 2023 oraz na liście z 2024\n\nZmiana nie została również uwzględniona w załączniku do widomości e-mail z MI z dnia 27.10.2022 dotyczącego dochodów podatkowych RFRD 2023"]
[null,"opatowski","Lipnik","gmina Lipnik",2606032,"gmina wiejska","GW","",2606032,"gmina wiejska","GW",""]
[null,"opatowski","Opatów","gmina Opatów",2606043,"gmina miejsko-wiejska","GM-W","",2606043,"gmina miejsko-wiejska","GM-W",""]
[null,"opatowski","Ożarów","gmina Ożarów",2606053,"gmina miejsko-wiejska","GM-W","",2606053,"gmina miejsko-wiejska","GM-W",""]
[null,"opatowski","Sadowie","gmina Sadowie",2606062,"gmina wiejska","GW","",2606062,"gmina wiejska","GW",""]
[null,"opatowski","Tarłów","gmina Tarłów",2606072,"gmina wiejska","GW","",2606072,"gmina wiejska","GW",""]
[null,"opatowski","Wojciechowice","gmina Wojciechowice",2606082,"gmina wiejska","GW","",2606082,"gmina wiejska","GW",""]
[null,"ostrowiecki","Bałtów","gmina Bałtów",2607022,"gmina wiejska","GW","",2607022,"gmina wiejska","GW",""]
[null,"ostrowiecki","Bodzechów","gmina Bodzechów",2607032,"gmina wiejska","GW","",2607032,"gmina wiejska","GW",""]
[null,"ostrowiecki","Ćmielów","gmina Ćmielów",2607043,"gmina miejsko-wiejska","GM-W","",2607043,"gmina miejsko-wiejska","GM-W",""]
[null,"ostrowiecki","Kunów","gmina Kunów",2607053,"gmina miejsko-wiejska","GM-W","",2607053,"gmina miejsko-wiejska","GM-W",""]
[null,"ostrowiecki","Ostrowiec Świętokrzyski","gmina Ostrowiec Świętokrzyski",2607011,"gmina miejska","GM","",2607011,"gmina miejska","GM",""]
[null,"ostrowiecki","Waśniów","gmina Waśniów",2607062,"gmina wiejska","GW","",2607062,"gmina wiejska","GW",""]
[null,"pińczowski","Działoszyce","gmina Działoszyce",2608013,"gmina miejsko-wiejska","GM-W","",2608013,"gmina miejsko-wiejska","GM-W",""]
[null,"pińczowski","Kije","gmina Kije",2608022,"gmina wiejska","GW","",2608022,"gmina wiejska","GW",""]
[null,"pińczowski","Michałów","gmina Michałów",2608032,"gmina wiejska","GW","",2608032,"gmina wiejska","GW",""]
[null,"pińczowski","Pińczów","gmina Pińczów",2608043,"gmina miejsko-wiejska","GM-W","",2608043,"gmina miejsko-wiejska","GM-W",""]
[null,"pińczowski","Złota","gmina Złota",2608052,"gmina wiejska","GW","",2608052,"gmina wiejska","GW",""]
[null,"sandomierski","Dwikozy","gmina Dwikozy",2609022,"gmina wiejska","GW","",2609022,"gmina wiejska","GW",""]
[null,"sandomierski","Klimontów","gmina Klimontów",2609033,"gmina miejsko-wiejska","GM-W","",2609033,"gmina miejsko-wiejska","GM-W",""]
[null,"sandomierski","Koprzywnica","gmina Koprzywnica",2609043,"gmina miejsko-wiejska","GM-W","",2609043,"gmina miejsko-wiejska","GM-W",""]
[null,"sandomierski","Łoniów","gmina Łoniów",2609052,"gmina wiejska","GW","",2609052,"gmina wiejska","GW",""]
[null,"sandomierski","Obrazów","gmina Obrazów",2609062,"gmina wiejska","GW","",2609062,"gmina wiejska","GW",""]
[null,"sandomierski","Samborzec","gmina Samborzec",2609072,"gmina wiejska","GW","",2609072,"gmina wiejska","GW",""]
[null,"sandomierski","Sandomierz","gmina Sandomierz",2609011,"gmina miejska","GM","",2609011,"gmina miejska","GM",""]
[null,"sandomierski","Wilczyce","gmina Wilczyce",2609082,"gmina wiejska","GW","",2609082,"gmina wiejska","GW",""]
[null,"sandomierski","Zawichost","gmina Zawichost",2609093,"gmina miejsko-wiejska","GM-W","",2609093,"gmina miejsko-wiejska","GM-W",""]
[null,"skarżyski","Bliżyn","gmina Bliżyn",2610022,"gmina wiejska","GW","",2610022,"gmina wiejska","GW",""]
[null,"skarżyski","Łączna","gmina Łączna",2610032,"gmina wiejska","GW","",2610032,"gmina wiejska","GW",""]
[null,"skarżyski","Skarżysko-Kamienna","gmina Skarżysko-Kamienna",2610011,"gmina miejska","GM","",2610011,"gmina miejska","GM",""]
[null,"skarżyski","Skarżysko Kościelne","gmina Skarżysko Kościelne",2610042,"gmina wiejska","GW","",2610042,"gmina wiejska","GW",""]
[null,"skarżyski","Suchedniów","gmina Suchedniów",2610053,"gmina miejsko-wiejska","GM-W","",2610053,"gmina miejsko-wiejska","GM-W",""]
[null,"starachowicki","Brody","gmina Brody",2611022,"gmina wiejska","GW","",2611022,"gmina wiejska","GW",""]
[null,"starachowicki","Mirzec","gmina Mirzec",2611032,"gmina wiejska","GW","",2611032,"gmina wiejska","GW",""]
[null,"starachowicki","Pawłów","gmina Pawłów",2611042,"gmina wiejska","GW","",2611042,"gmina wiejska","GW",""]
[null,"starachowicki","Starachowice","gmina Starachowice",2611011,"gmina miejska","GM","",2611011,"gmina miejska","GM",""]
[null,"starachowicki","Wąchock","gmina Wąchock",2611053,"gmina miejsko-wiejska","GM-W","",2611053,"gmina miejsko-wiejska","GM-W",""]
[null,"staszowski","Bogoria","gmina Bogoria",2612012,"gmina wiejska","GW","będzie zmiana od 2024",2612013,"gmina miejsko-wiejska","GM-W","zmiana od 2024 \n(stary teryt 2612012 - gmina wiejska;\nnowy teryt 2612013 - gmina miejsko-wiejska) \nZMIANA NIE ZOSTAŁA UWZGLĘDNIONA na liście z 2024"]
[null,"staszowski","Łubnice","gmina Łubnice",2612022,"gmina wiejska","GW","",2612022,"gmina wiejska","GW",""]
[null,"staszowski","Oleśnica","gmina Oleśnica",2612033,"gmina miejsko-wiejska","GM-W","",2612033,"gmina miejsko-wiejska","GM-W",""]
[null,"staszowski","Osiek","gmina Osiek",2612043,"gmina miejsko-wiejska","GM-W","",2612043,"gmina miejsko-wiejska","GM-W",""]
[null,"staszowski","Połaniec","gmina Połaniec",2612053,"gmina miejsko-wiejska","GM-W","",2612053,"gmina miejsko-wiejska","GM-W",""]
[null,"staszowski","Rytwiany","gmina Rytwiany",2612062,"gmina wiejska","GW","",2612062,"gmina wiejska","GW",""]
[null,"staszowski","Staszów","gmina Staszów",2612073,"gmina miejsko-wiejska","GM-W","",2612073,"gmina miejsko-wiejska","GM-W",""]
[null,"staszowski","Szydłów","gmina Szydłów",2612083,"gmina miejsko-wiejska","GM-W","",2612083,"gmina miejsko-wiejska","GM-W",""]
[null,"włoszczowski","Kluczewsko","gmina Kluczewsko",2613012,"gmina wiejska","GW","",2613012,"gmina wiejska","GW",""]
[null,"włoszczowski","Krasocin","gmina Krasocin",2613022,"gmina wiejska","GW","",2613022,"gmina wiejska","GW",""]
[null,"włoszczowski","Moskorzew","gmina Moskorzew",2613032,"gmina wiejska","GW","",2613032,"gmina wiejska","GW",""]
[null,"włoszczowski","Radków","gmina Radków",2613042,"gmina wiejska","GW","",2613042,"gmina wiejska","GW",""]
[null,"włoszczowski","Secemin","gmina Secemin",2613052,"gmina wiejska","GW","",2613052,"gmina wiejska","GW",""]
[null,"włoszczowski","Włoszczowa","gmina Włoszczowa",2613063,"gmina miejsko-wiejska","GM-W","",2613063,"gmina miejsko-wiejska","GM-W",""]

{"sheet":"DANE - K1 lit.A","index":4,"n_rows":120,"n_cols":13,"rows_kept":120,"cut":false,"hidden":false,"merged":[[1,1,1,3],[4,4,4,5]]}
[null,"DANE DO WNIOSKU"]
[null,"Kryterium 1 lit. A — Ryzyko wypadków"]
[]
[]
[null,null,null,null,2024]
[null,"powiat","gmina","JST","Teryt\nTERC","SKRÓT - typ JST","Ryzyko wypadków drogowych z udziałem pieszych na 100 tys. ludności","Ryzyko wypadków drogowych ogółem na 100 tys. ludności","Ryzyko ofiar śmiertelnych na 100 tys. ludności","Liczba przyznanych punktów - wypadki drogowe z udziałem pieszych na 100 tys. ludności","Liczba przyznanych punktów - wypadki drogowe ogółem na 100 tys. ludności","Liczba przyznanych punktów - ofiary śmiertelne na 100 tys. ludności","Łączna liczba przyznanych punktów \nw kryterium 1"]
[null,"buski",null,"powiat buski",2601,"PZ","NIE","NIE","NIE",0,0,0,0]
[null,"jędrzejowski",null,"powiat jędrzejowski",2602,"PZ","TAK","TAK","NIE",2,1,0,3]
[null,"kazimierski",null,"powiat kazimierski",2603,"PZ","NIE","NIE","TAK",0,0,1,1]
[null,"kielecki",null,"powiat kielecki",2604,"PZ","TAK","TAK","TAK",2,1,1,4]
[null,"konecki",null,"powiat konecki",2605,"PZ","TAK","NIE","NIE",2,0,0,2]
[null,"opatowski",null,"powiat opatowski",2606,"PZ","NIE","NIE","TAK",0,0,1,1]
[null,"ostrowiecki",null,"powiat ostrowiecki",2607,"PZ","NIE","NIE","NIE",0,0,0,0]
[null,"pińczowski",null,"powiat pińczowski",2608,"PZ","NIE","TAK","TAK",0,1,1,2]
[null,"sandomierski",null,"powiat sandomierski",2609,"PZ","TAK","TAK","NIE",2,1,0,3]
[null,"skarżyski",null,"powiat skarżyski",2610,"PZ","TAK","TAK","NIE",2,1,0,3]
[null,"starachowicki",null,"powiat starachowicki",2611,"PZ","NIE","NIE","NIE",0,0,0,0]
[null,"staszowski",null,"powiat staszowski",2612,"PZ","TAK","NIE","TAK",2,0,1,3]
[null,"włoszczowski",null,"powiat włoszczowski",2613,"PZ","NIE","TAK","TAK",0,1,1,2]
[null,"buski","Busko-Zdrój","gmina Busko-Zdrój",2601013,"GM-W","TAK","NIE","TAK",2,0,1,3]
[null,"buski","Gnojno","gmina Gnojno",2601022,"GW","NIE","NIE","NIE",0,0,0,0]
[null,"buski","Nowy Korczyn","gmina Nowy Korczyn",2601033,"GM-W","NIE","NIE","NIE",0,0,0,0]
[null,"buski","Pacanów","gmina Pacanów",2601043,"GM-W","TAK","NIE","NIE",2,0,0,2]
[null,"buski","Solec-Zdrój","gmina Solec-Zdrój",2601052,"GW","TAK","TAK","NIE",2,1,0,3]
[null,"buski","Stopnica","gmina Stopnica",2601063,"GM-W","TAK","TAK","NIE",2,1,0,3]
[null,"buski","Tuczępy","gmina Tuczępy",2601072,"GW","NIE","NIE","NIE",0,0,0,0]
[null,"buski","Wiślica","gmina Wiślica",2601083,"GM-W","NIE","NIE","NIE",0,0,0,0]
[null,"jędrzejowski","Imielno","gmina Imielno",2602012,"GW","NIE","NIE","NIE",0,0,0,0]
[null,"jędrzejowski","Jędrzejów","gmina Jędrzejów",2602023,"GM-W","TAK","TAK","TAK",2,1,1,4]
[null,"jędrzejowski","Małogoszcz","gmina Małogoszcz",2602033,"GM-W","TAK","TAK","TAK",2,1,1,4]
[null,"jędrzejowski","Nagłowice","gmina Nagłowice",2602042,"GW","NIE","TAK","NIE",0,1,0,1]
[null,"jędrzejowski","Oksa","gmina Oksa",2602052,"GW","NIE","NIE","NIE",0,0,0,0]
[null,"jędrzejowski","Sędziszów","gmina Sędziszów",2602063,"GM-W","TAK","TAK","TAK",2,1,1,4]
[null,"jędrzejowski","Słupia Jędrzejowska","gmina Słupia Jędrzejowska",2602072,"GW","NIE","NIE","NIE",0,0,0,0]
[null,"jędrzejowski","Sobków","gmina Sobków",2602082,"GW","NIE","TAK","NIE",0,1,0,1]
[null,"jędrzejowski","Wodzisław","gmina Wodzisław",2602093,"GM-W","NIE","NIE","NIE",0,0,0,0]
[null,"kazimierski","Bejsce","gmina Bejsce",2603012,"GW","NIE","NIE","NIE",0,0,0,0]
[null,"kazimierski","Czarnocin","gmina Czarnocin",2603022,"GW","NIE","NIE","NIE",0,0,0,0]
[null,"kazimierski","Kazimierza Wielka","gmina Kazimierza Wielka",2603033,"GM-W","TAK","TAK","NIE",2,1,0,3]
[null,"kazimierski","Opatowiec","gmina Opatowiec",2603043,"GM-W","NIE","NIE","NIE",0,0,0,0]
[null,"kazimierski","Skalbmierz","gmina Skalbmierz",2603053,"GM-W","NIE","NIE","NIE",0,0,0,0]
[null,"kielecki","Bieliny","gmina Bieliny",2604012,"GW","NIE","TAK","NIE",0,1,0,1]
[null,"kielecki","Bodzentyn","gmina Bodzentyn",2604023,"GM-W","NIE","TAK","TAK",0,1,1,2]
[null,"kielecki","Chęciny","gmina Chęciny",2604033,"GM-W","TAK","TAK","NIE",2,1,0,3]
[null,"kielecki","Chmielnik","gmina Chmielnik",2604043,"GM-W","NIE","TAK","TAK",0,1,1,2]
[null,"kielecki","Daleszyce","gmina Daleszyce",2604053,"GM-W","NIE","TAK","NIE",0,1,0,1]
[null,"kielecki","Górno","gmina Górno",2604062,"GW","NIE","TAK","NIE",0,1,0,1]
[null,"kielecki","Łagów","gmina Łagów",2604073,"GM-W","NIE","NIE","NIE",0,0,0,0]
[null,"kielecki","Łopuszno","gmina Łopuszno",2604083,"GM-W","NIE","NIE","NIE",0,0,0,0]
[null,"kielecki","Masłów","gmina Masłów",2604092,"GW","NIE","TAK","NIE",0,1,0,1]
[null,"kielecki","Miedziana Góra","gmina Miedziana Góra",2604102,"GW","NIE","NIE","NIE",0,0,0,0]
[null,"kielecki","Mniów","gmina Mniów",2604112,"GW","NIE","NIE","NIE",0,0,0,0]
[null,"kielecki","Morawica","gmina Morawica",2604123,"GM-W","TAK","TAK","NIE",2,1,0,3]
[null,"kielecki","Nowa Słupia","gmina Nowa Słupia",2604133,"GM-W","NIE","TAK","TAK",0,1,1,2]
[null,"kielecki","Nowiny","gmina Nowiny",2604172,"GW","TAK","TAK","NIE",2,1,0,3]
[null,"kielecki","Piekoszów","gmina Piekoszów",2604143,"GM-W","NIE","TAK","NIE",0,1,0,1]
[null,"kielecki","Pierzchnica","gmina Pierzchnica",2604153,"GM-W","NIE","TAK","NIE",0,1,0,1]
[null,"kielecki","Raków","gmina Raków",2604162,"GW","NIE","NIE","NIE",0,0,0,0]
[null,"kielecki","Strawczyn","gmina Strawczyn",2604182,"GW","NIE","NIE","NIE",0,0,0,0]
[null,"kielecki","Zagnańsk","gmina Zagnańsk",2604192,"GW","NIE","TAK","NIE",0,1,0,1]
[null,"konecki","Fałków","gmina Fałków",2605012,"GW","NIE","NIE","NIE",0,0,0,0]
[null,"konecki","Gowarczów","gmina Gowarczów",2605023,"GM-W","NIE","NIE","NIE",0,0,0,0]
[null,"konecki","Końskie","gmina Końskie",2605033,"GM-W","TAK","TAK","TAK",2,1,1,4]
[null,"konecki","Radoszyce","gmina Radoszyce",2605043,"GM-W","NIE","NIE","NIE",0,0,0,0]
[null,"konecki","Ruda Maleniecka","gmina Ruda Maleniecka",2605052,"GW","NIE","NIE","NIE",0,0,0,0]
[null,"konecki","Słupia Konecka","gmina Słupia Konecka",2605062,"GW","NIE","NIE","NIE",0,0,0,0]
[null,"konecki","Smyków","gmina Smyków",2605072,"GW","NIE","TAK","NIE",0,1,0,1]
[null,"konecki","Stąporków","gmina Stąporków",2605083,"GM-W","TAK","TAK","TAK",2,1,1,4]
[null,"opatowski","Baćkowice","gmina Baćkowice",2606012,"GW","NIE","NIE","NIE",0,0,0,0]
[null,"opatowski","Iwaniska","gmina Iwaniska",2606023,"GM-W","TAK","NIE","NIE",2,0,0,2]
[null,"opatowski","Lipnik","gmina Lipnik",2606032,"GW","TAK","TAK","NIE",2,1,0,3]
[null,"opatowski","Opatów","gmina Opatów",2606043,"GM-W","TAK","NIE","NIE",2,0,0,2]
[null,"opatowski","Ożarów","gmina Ożarów",2606053,"GM-W","TAK","TAK","NIE",2,1,0,3]
[null,"opatowski","Sadowie","gmina Sadowie",2606062,"GW","NIE","NIE","NIE",0,0,0,0]
[null,"opatowski","Tarłów","gmina Tarłów",2606072,"GW","NIE","TAK","NIE",0,1,0,1]
[null,"opatowski","Wojciechowice","gmina Wojciechowice",2606082,"GW","TAK","TAK","TAK",2,1,1,4]
[null,"ostrowiecki","Bałtów","gmina Bałtów",2607022,"GW","NIE","TAK","NIE",0,1,0,1]
[null,"ostrowiecki","Bodzechów","gmina Bodzechów",2607032,"GW","TAK","TAK","TAK",2,1,1,4]
[null,"ostrowiecki","Ćmielów","gmina Ćmielów",2607043,"GM-W","TAK","TAK","NIE",2,1,0,3]
[null,"ostrowiecki","Kunów","gmina Kunów",2607053,"GM-W","NIE","TAK","NIE",0,1,0,1]
[null,"ostrowiecki","Ostrowiec Świętokrzyski","gmina Ostrowiec Świętokrzyski",2607011,"GM","TAK","TAK","TAK",2,1,1,4]
[null,"ostrowiecki","Waśniów","gmina Waśniów",2607062,"GW","TAK","TAK","TAK",2,1,1,4]
[null,"pińczowski","Działoszyce","gmina Działoszyce",2608013,"GM-W","NIE","NIE","NIE",0,0,0,0]
[null,"pińczowski","Kije","gmina Kije",2608022,"GW","NIE","NIE","NIE",0,0,0,0]
[null,"pińczowski","Michałów","gmina Michałów",2608032,"GW","NIE","TAK","NIE",0,1,0,1]
[null,"pińczowski","Pińczów","gmina Pińczów",2608043,"GM-W","TAK","TAK","TAK",2,1,1,4]
[null,"pińczowski","Złota","gmina Złota",2608052,"GW","NIE","NIE","NIE",0,0,0,0]
[null,"sandomierski","Dwikozy","gmina Dwikozy",2609022,"GW","NIE","NIE","NIE",0,0,0,0]
[null,"sandomierski","Klimontów","gmina Klimontów",2609033,"GM-W","TAK","TAK","TAK",2,1,1,4]
[null,"sandomierski","Koprzywnica","gmina Koprzywnica",2609043,"GM-W","NIE","NIE","TAK",0,0,1,1]
[null,"sandomierski","Łoniów","gmina Łoniów",2609052,"GW","NIE","TAK","NIE",0,1,0,1]
[null,"sandomierski","Obrazów","gmina Obrazów",2609062,"GW","NIE","NIE","NIE",0,0,0,0]
[null,"sandomierski","Samborzec","gmina Samborzec",2609072,"GW","NIE","NIE","NIE",0,0,0,0]
[null,"sandomierski","Sandomierz","gmina Sandomierz",2609011,"GM","TAK","NIE","NIE",2,0,0,2]
[null,"sandomierski","Wilczyce","gmina Wilczyce",2609082,"GW","NIE","NIE","NIE",0,0,0,0]
[null,"sandomierski","Zawichost","gmina Zawichost",2609093,"GM-W","NIE","NIE","NIE",0,0,0,0]
[null,"skarżyski","Bliżyn","gmina Bliżyn",2610022,"GW","NIE","NIE","NIE",0,0,0,0]
[null,"skarżyski","Łączna","gmina Łączna",2610032,"GW","NIE","NIE","NIE",0,0,0,0]
[null,"skarżyski","Skarżysko-Kamienna","gmina Skarżysko-Kamienna",2610011,"GM","TAK","TAK","TAK",2,1,1,4]
[null,"skarżyski","Skarżysko Kościelne","gmina Skarżysko Kościelne",2610042,"GW","NIE","TAK","NIE",0,1,0,1]
[null,"skarżyski","Suchedniów","gmina Suchedniów",2610053,"GM-W","TAK","TAK","NIE",2,1,0,3]
[null,"starachowicki","Brody","gmina Brody",2611022,"GW","NIE","TAK","TAK",0,1,1,2]
[null,"starachowicki","Mirzec","gmina Mirzec",2611032,"GW","NIE","NIE","NIE",0,0,0,0]
[null,"starachowicki","Pawłów","gmina Pawłów",2611042,"GW","TAK","TAK","NIE",2,1,0,3]
[null,"starachowicki","Starachowice","gmina Starachowice",2611011,"GM","TAK","NIE","TAK",2,0,1,3]
[null,"starachowicki","Wąchock","gmina Wąchock",2611053,"GM-W","TAK","NIE","NIE",2,0,0,2]
[null,"staszowski","Bogoria","gmina Bogoria",2612013,"GM-W","NIE","TAK","NIE",0,1,0,1]
[null,"staszowski","Łubnice","gmina Łubnice",2612022,"GW","NIE","NIE","NIE",0,0,0,0]
[null,"staszowski","Oleśnica","gmina Oleśnica",2612033,"GM-W","NIE","NIE","NIE",0,0,0,0]
[null,"staszowski","Osiek","gmina Osiek",2612043,"GM-W","TAK","TAK","TAK",2,1,1,4]
[null,"staszowski","Połaniec","gmina Połaniec",2612053,"GM-W","TAK","NIE","NIE",2,0,0,2]
[null,"staszowski","Rytwiany","gmina Rytwiany",2612062,"GW","NIE","NIE","NIE",0,0,0,0]
[null,"staszowski","Staszów","gmina Staszów",2612073,"GM-W","TAK","TAK","TAK",2,1,1,4]
[null,"staszowski","Szydłów","gmina Szydłów",2612083,"GM-W","NIE","TAK","NIE",0,1,0,1]
[null,"włoszczowski","Kluczewsko","gmina Kluczewsko",2613012,"GW","NIE","NIE","NIE",0,0,0,0]
[null,"włoszczowski","Krasocin","gmina Krasocin",2613022,"GW","NIE","NIE","NIE",0,0,0,0]
[null,"włoszczowski","Moskorzew","gmina Moskorzew",2613032,"GW","NIE","TAK","NIE",0,1,0,1]
[null,"włoszczowski","Radków","gmina Radków",2613042,"GW","NIE","NIE","NIE",0,0,0,0]
[null,"włoszczowski","Secemin","gmina Secemin",2613052,"GW","NIE","TAK","NIE",0,1,0,1]
[null,"włoszczowski","Włoszczowa","gmina Włoszczowa",2613063,"GM-W","TAK","TAK","NIE",2,1,0,3]

{"sheet":"DANE - K2 lit.C","index":5,"n_rows":114,"n_cols":11,"rows_kept":114,"cut":false,"hidden":false,"merged":[[9,2,11,2],[9,4,9,6],[9,8,11,8],[11,4,11,6],[1,2,1,8]]}
[null,null,"DANE DO WNIOSKU",null,null,null,null,null,null,"legenda","20-30"]
[null,null,"Kryterium nr 2 lit. C — Peryferyjność",null,null,null,null,null,null,null,"30-35"]
[null,null,null,null,null,null,null,null,null,null,"35-40"]
[null,null,null,null,null,null,null,null,null,null,"40-45"]
[null,null,null,null,null,null,null,null,null,null,"45-50"]
[null,null,null,null,null,null,null,null,null,null,"50-55"]
[null,null,null,null,null,null,null,null,null,null,"55-60"]
[null,null,null,null,null,null,null,null,null,null,"60-65"]
[]
[null,null,"Gmina",null,"Dostępność czasowa",null,null,null,"Peryferyjność"]
[null,null,null,"Dostępność czasowa","do 30 minut","od 30 minut do 50 minut","powyżej \n50 minut"]
[null,null,null,null,"Liczba przyznanych punktów"]
[null,null,1,2,3,4,5,null,6]
[null,"gmina Baćkowice","Baćkowice","35-40",null,1,null,1,"w przedziale od 30 do 50 minut"]
[null,"gmina Bałtów","Bałtów","60-65",null,null,2,2,"większy niż 50 minut"]
[null,"gmina Bejsce","Bejsce","45-50",null,1,null,1,"w przedziale od 30 do 50 minut"]
[null,"gmina Bieliny","Bieliny","35-40",null,1,null,1,"w przedziale od 30 do 50 minut"]
[null,"gmina Bliżyn","Bliżyn","30-35",null,1,null,1,"w przedziale od 30 do 50 minut"]
[null,"gmina Bodzechów","Bodzechów","50-55",null,null,2,2,"większy niż 50 minut"]
[null,"gmina Bodzentyn","Bodzentyn","35-40",null,1,null,1,"w przedziale od 30 do 50 minut"]
[null,"gmina Bogoria","Bogoria","40-45",null,1,null,1,"w przedziale od 30 do 50 minut"]
[null,"gmina Brody","Brody","45-50",null,1,null,1,"w przedziale od 30 do 50 minut"]
[null,"gmina Busko-Zdrój","Busko-Zdrój","35-40",null,1,null,1,"w przedziale od 30 do 50 minut"]
[null,"gmina Chęciny","Chęciny","20-30",0,null,null,0,"mniejszy niż 30 minut"]
[null,"gmina Chmielnik","Chmielnik","30-35",null,1,null,1,"w przedziale od 30 do 50 minut"]
[null,"gmina Czarnocin","Czarnocin","50-55",null,null,2,2,"większy niż 50 minut"]
[null,"gmina Ćmielów","Ćmielów","50-55",null,null,2,2,"większy niż 50 minut"]
[null,"gmina Daleszyce","Daleszyce","30-35",null,1,null,1,"w przedziale od 30 do 50 minut"]
[null,"gmina Dwikozy","Dwikozy","45-50",null,1,null,1,"w przedziale od 30 do 50 minut"]
[null,"gmina Działoszyce","Działoszyce","45-50",null,1,null,1,"w przedziale od 30 do 50 minut"]
[null,"gmina Fałków","Fałków","45-50",null,1,null,1,"w przedziale od 30 do 50 minut"]
[null,"gmina Gnojno","Gnojno","40-45",null,1,null,1,"w przedziale od 30 do 50 minut"]
[null,"gmina Gowarczów","Gowarczów","45-50",null,1,null,1,"w przedziale od 30 do 50 minut"]
[null,"gmina Górno","Górno","20-30",0,null,null,0,"mniejszy niż 30 minut"]
[null,"gmina Imielno","Imielno","35-40",null,1,null,1,"w przedziale od 30 do 50 minut"]
[null,"gmina Iwaniska","Iwaniska","35-40",null,1,null,1,"w przedziale od 30 do 50 minut"]
[null,"gmina Jędrzejów","Jędrzejów","30-35",null,1,null,1,"w przedziale od 30 do 50 minut"]
[null,"gmina Kazimierza Wielka","Kazimierza Wielka","45-50",null,1,null,1,"w przedziale od 30 do 50 minut"]
[null,"gmina Kije","Kije","30-35",null,1,null,1,"w przedziale od 30 do 50 minut"]
[null,"gmina Klimontów","Klimontów","40-45",null,1,null,1,"w przedziale od 30 do 50 minut"]
[null,"gmina Kluczewsko","Kluczewsko","45-50",null,1,null,1,"w przedziale od 30 do 50 minut"]
[null,"gmina Końskie","Końskie","35-40",null,1,null,1,"w przedziale od 30 do 50 minut"]
[null,"gmina Koprzywnica","Koprzywnica","40-45",null,1,null,1,"w przedziale od 30 do 50 minut"]
[null,"gmina Krasocin","Krasocin","40-45",null,1,null,1,"w przedziale od 30 do 50 minut"]
[null,"gmina Kunów","Kunów","50-55",null,null,2,2,"większy niż 50 minut"]
[null,"gmina Lipnik","Lipnik","40-45",null,1,null,1,"w przedziale od 30 do 50 minut"]
[null,"gmina Łagów","Łagów","35-40",null,1,null,1,"w przedziale od 30 do 50 minut"]
[null,"gmina Łączna","Łączna","20-30",0,null,null,0,"mniejszy niż 30 minut"]
[null,"gmina Łoniów","Łoniów","40-45",null,1,null,1,"w przedziale od 30 do 50 minut"]
[null,"gmina Łopuszno","Łopuszno","35-40",null,1,null,1,"w przedziale od 30 do 50 minut"]
[null,"gmina Łubnice","Łubnice","55-60",null,null,2,2,"większy niż 50 minut"]
[null,"gmina Małogoszcz","Małogoszcz","35-40",null,1,null,1,"w przedziale od 30 do 50 minut"]
[null,"gmina Masłów","Masłów","20-30",0,null,null,0,"mniejszy niż 30 minut"]
[null,"gmina Michałów","Michałów","40-45",null,1,null,1,"w przedziale od 30 do 50 minut"]
[null,"gmina Miedziana Góra","Miedziana Góra","20-30",0,null,null,0,"mniejszy niż 30 minut"]
[null,"gmina Mirzec","Mirzec","40-45",null,1,null,1,"w przedziale od 30 do 50 minut"]
[null,"gmina Mniów","Mniów","30-35",null,1,null,1,"w przedziale od 30 do 50 minut"]
[null,"gmina Morawica","Morawica","20-30",0,null,null,0,"mniejszy niż 30 minut"]
[null,"gmina Moskorzew","Moskorzew","50-55",null,null,2,2,"większy niż 50 minut"]
[null,"gmina Nagłowice","Nagłowice","40-45",null,1,null,1,"w przedziale od 30 do 50 minut"]
[null,"gmina Nowa Słupia","Nowa Słupia","40-45",null,1,null,1,"w przedziale od 30 do 50 minut"]
[null,"gmina Nowy Korczyn","Nowy Korczyn","50-55",null,null,2,2,"większy niż 50 minut"]
[null,"gmina Obrazów","Obrazów","40-45",null,1,null,1,"w przedziale od 30 do 50 minut"]
[null,"gmina Oksa","Oksa","40-45",null,1,null,1,"w przedziale od 30 do 50 minut"]
[null,"gmina Oleśnica","Oleśnica","50-55",null,null,2,2,"większy niż 50 minut"]
[null,"gmina Opatowiec","Opatowiec","50-55",null,null,2,2,"większy niż 50 minut"]
[null,"gmina Opatów","Opatów","35-40",null,1,null,1,"w przedziale od 30 do 50 minut"]
[null,"gmina Osiek","Osiek","45-50",null,1,null,1,"w przedziale od 30 do 50 minut"]
[null,"gmina Ostrowiec Świętokrzyski","Ostrowiec Świętokrzyski","45-50",null,1,null,1,"w przedziale od 30 do 50 minut"]
[null,"gmina Ożarów","Ożarów","50-55",null,null,2,2,"większy niż 50 minut"]
[null,"gmina Pacanów","Pacanów","50-55",null,null,2,2,"większy niż 50 minut"]
[null,"gmina Pawłów","Pawłów","40-45",null,1,null,1,"w przedziale od 30 do 50 minut"]
[null,"gmina Piekoszów","Piekoszów","20-30",0,null,null,0,"mniejszy niż 30 minut"]
[null,"gmina Pierzchnica","Pierzchnica","30-35",null,1,null,1,"w przedziale od 30 do 50 minut"]
[null,"gmina Pińczów","Pińczów","40-45",null,1,null,1,"w przedziale od 30 do 50 minut"]
[null,"gmina Połaniec","Połaniec","50-55",null,null,2,2,"większy niż 50 minut"]
[null,"gmina Radków","Radków","45-50",null,1,null,1,"w przedziale od 30 do 50 minut"]
[null,"gmina Radoszyce","Radoszyce","35-40",null,1,null,1,"w przedziale od 30 do 50 minut"]
[null,"gmina Raków","Raków","35-40",null,1,null,1,"w przedziale od 30 do 50 minut"]
[null,"gmina Ruda Maleniecka","Ruda Maleniecka","35-40",null,1,null,1,"w przedziale od 30 do 50 minut"]
[null,"gmina Rytwiany","Rytwiany","45-50",null,1,null,1,"w przedziale od 30 do 50 minut"]
[null,"gmina Sadowie","Sadowie","40-45",null,1,null,1,"w przedziale od 30 do 50 minut"]
[null,"gmina Samborzec","Samborzec","40-45",null,1,null,1,"w przedziale od 30 do 50 minut"]
[null,"gmina Sandomierz","Sandomierz","40-45",null,1,null,1,"w przedziale od 30 do 50 minut"]
[null,"gmina Secemin","Secemin","50-55",null,null,2,2,"większy niż 50 minut"]
[null,"gmina Sędziszów","Sędziszów","50-55",null,null,2,2,"większy niż 50 minut"]
[null,"gmina Nowiny","Nowiny","20-30",0,null,null,0,"mniejszy niż 30 minut"]
[null,"gmina Skalbmierz","Skalbmierz","45-50",null,1,null,1,"w przedziale od 30 do 50 minut"]
[null,"gmina Skarżysko Kościelne","Skarżysko Kościelne","40-45",null,1,null,1,"w przedziale od 30 do 50 minut"]
[null,"gmina Skarżysko-Kamienna","Skarżysko-Kamienna","30-35",null,1,null,1,"w przedziale od 30 do 50 minut"]
[null,"gmina Słupia Jędrzejowska","Słupia Jędrzejowska","50-55",null,null,2,2,"większy niż 50 minut"]
[null,"gmina Słupia Konecka","Słupia Konecka","40-45",null,1,null,1,"w przedziale od 30 do 50 minut"]
[null,"gmina Smyków","Smyków","30-35",null,1,null,1,"w przedziale od 30 do 50 minut"]
[null,"gmina Sobków","Sobków","20-30",0,null,null,0,"mniejszy niż 30 minut"]
[null,"gmina Solec-Zdrój","Solec-Zdrój","50-55",null,null,2,2,"większy niż 50 minut"]
[null,"gmina Starachowice","Starachowice","40-45",null,1,null,1,"w przedziale od 30 do 50 minut"]
[null,"gmina Staszów","Staszów","40-45",null,1,null,1,"w przedziale od 30 do 50 minut"]
[null,"gmina Stąporków","Stąporków","35-40",null,1,null,1,"w przedziale od 30 do 50 minut"]
[null,"gmina Stopnica","Stopnica","45-50",null,1,null,1,"w przedziale od 30 do 50 minut"]
[null,"gmina Strawczyn","Strawczyn","30-35",null,1,null,1,"w przedziale od 30 do 50 minut"]
[null,"gmina Suchedniów","Suchedniów","30-35",null,1,null,1,"w przedziale od 30 do 50 minut"]
[null,"gmina Szydłów","Szydłów","40-45",null,1,null,1,"w przedziale od 30 do 50 minut"]
[null,"gmina Tarłów","Tarłów","60-65",null,null,2,2,"większy niż 50 minut"]
[null,"gmina Tuczępy","Tuczępy","45-50",null,1,null,1,"w przedziale od 30 do 50 minut"]
[null,"gmina Waśniów","Waśniów","40-45",null,1,null,1,"w przedziale od 30 do 50 minut"]
[null,"gmina Wąchock","Wąchock","35-40",null,1,null,1,"w przedziale od 30 do 50 minut"]
[null,"gmina Wilczyce","Wilczyce","45-50",null,1,null,1,"w przedziale od 30 do 50 minut"]
[null,"gmina Wiślica","Wiślica","45-50",null,1,null,1,"w przedziale od 30 do 50 minut"]
[null,"gmina Włoszczowa","Włoszczowa","45-50",null,1,null,1,"w przedziale od 30 do 50 minut"]
[null,"gmina Wodzisław","Wodzisław","40-45",null,1,null,1,"w przedziale od 30 do 50 minut"]
[null,"gmina Wojciechowice","Wojciechowice","45-50",null,1,null,1,"w przedziale od 30 do 50 minut"]
[null,"gmina Zagnańsk","Zagnańsk","20-30",0,null,null,0,"mniejszy niż 30 minut"]
[null,"gmina Zawichost","Zawichost","50-55",null,null,2,2,"większy niż 50 minut"]
[null,"gmina Złota","Złota","50-55",null,null,2,2,"większy niż 50 minut"]

{"sheet":"DANE - K4 lit.B","index":6,"n_rows":107,"n_cols":16,"rows_kept":107,"cut":false,"hidden":false,"merged":[[3,5,3,8],[3,9,3,12],[1,1,1,4]]}
[null,"DANE DO WNIOSKU"]
[null,"Kryterium 4 lit. B — Miasta województwa świętokrzyskiego ujęte w pakiecie dla średnich miast uznanych za zagrożone utratą funkcji społeczno - gospodarczych (na podstawie Analizy Instytutu Geografii i Przestrzennego Zagospodarowania PAN)"]
[]
[null,null,null,null,null,2023,null,null,null,2024]
[null,"powiat","gmina","JST","średnie miasta uznane za zagrożone utratą funkcji społeczno-gospodarczych (na podstawie Analizy Instytutu Geografii i Przestrzennego Zagospodarowania PAN) ","Teryt\nTERC","typ JST","SKRÓT - typ JST","uwagi","Teryt\nTERC","typ JST","SKRÓT - typ JST","uwagi"]
[null,"buski","Busko-Zdrój","gmina Busko-Zdrój","TAK",2601013,"gmina miejsko-wiejska","GM-W","",2601013,"gmina miejsko-wiejska","GM-W",""]
[null,"buski","Gnojno","gmina Gnojno","NIE",2601022,"gmina wiejska","GW","",2601022,"gmina wiejska","GW","",null,null,""]
[null,"buski","Nowy Korczyn","gmina Nowy Korczyn","NIE",2601033,"gmina miejsko-wiejska","GM-W","",2601033,"gmina miejsko-wiejska","GM-W","",null,null,""]
[null,"buski","Pacanów","gmina Pacanów","NIE",2601043,"gmina miejsko-wiejska","GM-W","",2601043,"gmina miejsko-wiejska","GM-W","",null,null,""]
[null,"buski","Solec-Zdrój","gmina Solec-Zdrój","NIE",2601052,"gmina wiejska","GW","",2601052,"gmina wiejska","GW","",null,null,""]
[null,"buski","Stopnica","gmina Stopnica","NIE",2601063,"gmina miejsko-wiejska","GM-W","",2601063,"gmina miejsko-wiejska","GM-W","",null,null,""]
[null,"buski","Tuczępy","gmina Tuczępy","NIE",2601072,"gmina wiejska","GW","",2601072,"gmina wiejska","GW","",null,null,""]
[null,"buski","Wiślica","gmina Wiślica","NIE",2601083,"gmina miejsko-wiejska","GM-W","",2601083,"gmina miejsko-wiejska","GM-W","",null,null,""]
[null,"jędrzejowski","Imielno","gmina Imielno","NIE",2602012,"gmina wiejska","GW","",2602012,"gmina wiejska","GW","",null,null,""]
[null,"jędrzejowski","Jędrzejów","gmina Jędrzejów","TAK",2602023,"gmina miejsko-wiejska","GM-W","",2602023,"gmina miejsko-wiejska","GM-W",""]
[null,"jędrzejowski","Małogoszcz","gmina Małogoszcz","NIE",2602033,"gmina miejsko-wiejska","GM-W","",2602033,"gmina miejsko-wiejska","GM-W","",null,null,""]
[null,"jędrzejowski","Nagłowice","gmina Nagłowice","NIE",2602042,"gmina wiejska","GW","",2602042,"gmina wiejska","GW","",null,null,""]
[null,"jędrzejowski","Oksa","gmina Oksa","NIE",2602052,"gmina wiejska","GW","",2602052,"gmina wiejska","GW","",null,null,""]
[null,"jędrzejowski","Sędziszów","gmina Sędziszów","NIE",2602063,"gmina miejsko-wiejska","GM-W","",2602063,"gmina miejsko-wiejska","GM-W","",null,null,""]
[null,"jędrzejowski","Słupia Jędrzejowska","gmina Słupia Jędrzejowska","NIE",2602072,"gmina wiejska","GW","",2602072,"gmina wiejska","GW","",null,null,""]
[null,"jędrzejowski","Sobków","gmina Sobków","NIE",2602082,"gmina wiejska","GW","",2602082,"gmina wiejska","GW","",null,null,""]
[null,"jędrzejowski","Wodzisław","gmina Wodzisław","NIE",2602093,"gmina miejsko-wiejska","GM-W","",2602093,"gmina miejsko-wiejska","GM-W","",null,null,""]
[null,"kazimierski","Bejsce","gmina Bejsce","NIE",2603012,"gmina wiejska","GW","",2603012,"gmina wiejska","GW","",null,null,""]
[null,"kazimierski","Czarnocin","gmina Czarnocin","NIE",2603022,"gmina wiejska","GW","",2603022,"gmina wiejska","GW","",null,null,""]
[null,"kazimierski","Kazimierza Wielka","gmina Kazimierza Wielka","NIE",2603033,"gmina miejsko-wiejska","GM-W","",2603033,"gmina miejsko-wiejska","GM-W","",null,null,""]
[null,"kazimierski","Opatowiec","gmina Opatowiec","NIE",2603043,"gmina miejsko-wiejska","GM-W","",2603043,"gmina miejsko-wiejska","GM-W","",null,null,""]
[null,"kazimierski","Skalbmierz","gmina Skalbmierz","NIE",2603053,"gmina miejsko-wiejska","GM-W","",2603053,"gmina miejsko-wiejska","GM-W","",null,null,""]
[null,"kielecki","Bieliny","gmina Bieliny","NIE",2604012,"gmina wiejska","GW","",2604012,"gmina wiejska","GW","",null,null,""]
[null,"kielecki","Bodzentyn","gmina Bodzentyn","NIE",2604023,"gmina miejsko-wiejska","GM-W","",2604023,"gmina miejsko-wiejska","GM-W","",null,null,""]
[null,"kielecki","Chęciny","gmina Chęciny","NIE",2604033,"gmina miejsko-wiejska","GM-W","",2604033,"gmina miejsko-wiejska","GM-W","",null,null,""]
[null,"kielecki","Chmielnik","gmina Chmielnik","NIE",2604043,"gmina miejsko-wiejska","GM-W","",2604043,"gmina miejsko-wiejska","GM-W","",null,null,""]
[null,"kielecki","Daleszyce","gmina Daleszyce","NIE",2604053,"gmina miejsko-wiejska","GM-W","",2604053,"gmina miejsko-wiejska","GM-W","",null,null,""]
[null,"kielecki","Górno","gmina Górno","NIE",2604062,"gmina wiejska","GW","",2604062,"gmina wiejska","GW","",null,null,""]
[null,"kielecki","Kielce","gmina Kielce","NIE",{"$error":"#N/A"},{"$error":"#N/A"},{"$error":"#N/A"},"",{"$error":"#N/A"},{"$error":"#N/A"},{"$error":"#N/A"},"",null,null,""]
[null,"kielecki","Łagów","gmina Łagów","NIE",2604073,"gmina miejsko-wiejska","GM-W","",2604073,"gmina miejsko-wiejska","GM-W","",null,null,""]
[null,"kielecki","Łopuszno","gmina Łopuszno","NIE",2604082,"gmina wiejska","GW","zmiana od 2023 \n(stary teryt 2604082 - gmina wiejska; \n nowy teryt 2604083 - gmina miejsko-wiejska) \nZMIANA NIE ZOSTAŁA UWZGLĘDNIONA na listach z 2023 oraz na liście z 2024",2604083,"gmina miejsko-wiejska","GM-W","zmiana od 2023 \n(stary teryt 2604082 - gmina wiejska; \n nowy teryt 2604083 - gmina miejsko-wiejska) \nZMIANA NIE ZOSTAŁA UWZGLĘDNIONA na listach z 2023 oraz na liście z 2024",null,null,""]
[null,"kielecki","Masłów","gmina Masłów","NIE",2604092,"gmina wiejska","GW","",2604092,"gmina wiejska","GW","",null,null,""]
[null,"kielecki","Miedziana Góra","gmina Miedziana Góra","NIE",2604102,"gmina wiejska","GW","",2604102,"gmina wiejska","GW","",null,null,""]
[null,"kielecki","Mniów","gmina Mniów","NIE",2604112,"gmina wiejska","GW","",2604112,"gmina wiejska","GW","",null,null,""]
[null,"kielecki","Morawica","gmina Morawica","NIE",2604123,"gmina miejsko-wiejska","GM-W","",2604123,"gmina miejsko-wiejska","GM-W","",null,null,""]
[null,"kielecki","Nowa Słupia","gmina Nowa Słupia","NIE",2604133,"gmina miejsko-wiejska","GM-W","",2604133,"gmina miejsko-wiejska","GM-W","",null,null,""]
[null,"kielecki","Nowiny","gmina Nowiny","NIE",2604172,"gmina wiejska","GW","",2604172,"gmina wiejska","GW","",null,null,""]
[null,"kielecki","Piekoszów","gmina Piekoszów","NIE",2604142,"gmina wiejska","GW","zmiana od 2023 \n(stary teryt 2604142 - gmina wiejska; \n nowy teryt 2604143 - gmina miejsko-wiejska) \nZMIANA NIE ZOSTAŁA UWZGLĘDNIONA na listach z 2023 oraz na liście z 2024",2604143,"gmina miejsko-wiejska","GM-W","zmiana od 2023 \n(stary teryt 2604142 - gmina wiejska; \n nowy teryt 2604143 - gmina miejsko-wiejska) \nZMIANA NIE ZOSTAŁA UWZGLĘDNIONA na listach z 2023 oraz na liście z 2024",null,null,""]
[null,"kielecki","Pierzchnica","gmina Pierzchnica","NIE",2604153,"gmina miejsko-wiejska","GM-W","",2604153,"gmina miejsko-wiejska","GM-W","",null,null,""]
[null,"kielecki","Raków","gmina Raków","NIE",2604162,"gmina wiejska","GW","",2604162,"gmina wiejska","GW","",null,null,""]
[null,"kielecki","Strawczyn","gmina Strawczyn","NIE",2604182,"gmina wiejska","GW","",2604182,"gmina wiejska","GW","",null,null,""]
[null,"kielecki","Zagnańsk","gmina Zagnańsk","NIE",2604192,"gmina wiejska","GW","",2604192,"gmina wiejska","GW","",null,null,""]
[null,"konecki","Fałków","gmina Fałków","NIE",2605012,"gmina wiejska","GW","",2605012,"gmina wiejska","GW","",null,null,""]
[null,"konecki","Gowarczów","gmina Gowarczów","NIE",2605022,"gmina wiejska","GW","będzie zmiana od 2024",2605023,"gmina miejsko-wiejska","GM-W","zmiana od 2024 \n(stary teryt 2605022 - gmina wiejska;\nnowy teryt 2605022 - gmina miejsko-wiejska) \nZMIANA NIE ZOSTAŁA UWZGLĘDNIONA na liście z 2024",null,null,""]
[null,"konecki","Końskie","gmina Końskie","TAK",2605033,"gmina miejsko-wiejska","GM-W","",2605033,"gmina miejsko-wiejska","GM-W",""]
[null,"konecki","Radoszyce","gmina Radoszyce","NIE",2605043,"gmina miejsko-wiejska","GM-W","",2605043,"gmina miejsko-wiejska","GM-W","",null,null,""]
[null,"konecki","Ruda Maleniecka","gmina Ruda Maleniecka","NIE",2605052,"gmina wiejska","GW","",2605052,"gmina wiejska","GW","",null,null,""]
[null,"konecki","Słupia Konecka","gmina Słupia Konecka","NIE",2605062,"gmina wiejska","GW","",2605062,"gmina wiejska","GW","",null,null,""]
[null,"konecki","Smyków","gmina Smyków","NIE",2605072,"gmina wiejska","GW","",2605072,"gmina wiejska","GW","",null,null,""]
[null,"konecki","Stąporków","gmina Stąporków","NIE",2605083,"gmina miejsko-wiejska","GM-W","",2605083,"gmina miejsko-wiejska","GM-W","",null,null,""]
[null,"opatowski","Baćkowice","gmina Baćkowice","NIE",2606012,"gmina wiejska","GW","",2606012,"gmina wiejska","GW","",null,null,""]
[null,"opatowski","Iwaniska","gmina Iwaniska","NIE",2606022,"gmina wiejska","GW","zmiana od 2022 (stary teryt 2606022) \n(stary teryt 2606022 - gmina wiejska; \n nowy teryt 2606023 - gmina miejsko-wiejska) \nZMIANA NIE ZOSTAŁA UWZGLĘDNIONA na listach z 2022 i 2023 oraz na liście z 2024 \n\nZmiana nie została również uwzględniona w załączniku dowiadomości e-mail z MI z dnia 27.10.2022 dotyczącej dochodów podatkowych RFRD 2023",2606023,"gmina miejsko-wiejska","GM-W","zmiana od 2022 \n(stary teryt 2606022 - gmina wiejska; \n nowy teryt 2606023 - gmina miejsko-wiejska) \nZMIANA NIE ZOSTAŁA UWZGLĘDNIONA na listach z 2022 i 2023 oraz na liście z 2024\n\nZmiana nie została również uwzględniona w załączniku do widomości e-mail z MI z dnia 27.10.2022 dotyczącego dochodów podatkowych RFRD 2023",null,null,""]
[null,"opatowski","Lipnik","gmina Lipnik","NIE",2606032,"gmina wiejska","GW","",2606032,"gmina wiejska","GW","",null,null,""]
[null,"opatowski","Opatów","gmina Opatów","NIE",2606043,"gmina miejsko-wiejska","GM-W","",2606043,"gmina miejsko-wiejska","GM-W","",null,null,""]
[null,"opatowski","Ożarów","gmina Ożarów","NIE",2606053,"gmina miejsko-wiejska","GM-W","",2606053,"gmina miejsko-wiejska","GM-W","",null,null,""]
[null,"opatowski","Sadowie","gmina Sadowie","NIE",2606062,"gmina wiejska","GW","",2606062,"gmina wiejska","GW","",null,null,""]
[null,"opatowski","Tarłów","gmina Tarłów","NIE",2606072,"gmina wiejska","GW","",2606072,"gmina wiejska","GW","",null,null,""]
[null,"opatowski","Wojciechowice","gmina Wojciechowice","NIE",2606082,"gmina wiejska","GW","",2606082,"gmina wiejska","GW","",null,null,""]
[null,"ostrowiecki","Bałtów","gmina Bałtów","NIE",2607022,"gmina wiejska","GW","",2607022,"gmina wiejska","GW","",null,null,""]
[null,"ostrowiecki","Bodzechów","gmina Bodzechów","NIE",2607032,"gmina wiejska","GW","",2607032,"gmina wiejska","GW","",null,null,""]
[null,"ostrowiecki","Ćmielów","gmina Ćmielów","NIE",2607043,"gmina miejsko-wiejska","GM-W","",2607043,"gmina miejsko-wiejska","GM-W","",null,null,""]
[null,"ostrowiecki","Kunów","gmina Kunów","NIE",2607053,"gmina miejsko-wiejska","GM-W","",2607053,"gmina miejsko-wiejska","GM-W","",null,null,""]
[null,"ostrowiecki","Ostrowiec Świętokrzyski","gmina Ostrowiec Świętokrzyski","TAK",2607011,"gmina miejska","GM","",2607011,"gmina miejska","GM",""]
[null,"ostrowiecki","Waśniów","gmina Waśniów","NIE",2607062,"gmina wiejska","GW","",2607062,"gmina wiejska","GW","",null,null,""]
[null,"pińczowski","Działoszyce","gmina Działoszyce","NIE",2608013,"gmina miejsko-wiejska","GM-W","",2608013,"gmina miejsko-wiejska","GM-W","",null,null,""]
[null,"pińczowski","Kije","gmina Kije","NIE",2608022,"gmina wiejska","GW","",2608022,"gmina wiejska","GW","",null,null,""]
[null,"pińczowski","Michałów","gmina Michałów","NIE",2608032,"gmina wiejska","GW","",2608032,"gmina wiejska","GW","",null,null,""]
[null,"pińczowski","Pińczów","gmina Pińczów","NIE",2608043,"gmina miejsko-wiejska","GM-W","",2608043,"gmina miejsko-wiejska","GM-W","",null,null,""]
[null,"pińczowski","Złota","gmina Złota","NIE",2608052,"gmina wiejska","GW","",2608052,"gmina wiejska","GW","",null,null,""]
[null,"sandomierski","Dwikozy","gmina Dwikozy","NIE",2609022,"gmina wiejska","GW","",2609022,"gmina wiejska","GW","",null,null,""]
[null,"sandomierski","Klimontów","gmina Klimontów","NIE",2609033,"gmina miejsko-wiejska","GM-W","",2609033,"gmina miejsko-wiejska","GM-W","",null,null,""]
[null,"sandomierski","Koprzywnica","gmina Koprzywnica","NIE",2609043,"gmina miejsko-wiejska","GM-W","",2609043,"gmina miejsko-wiejska","GM-W","",null,null,""]
[null,"sandomierski","Łoniów","gmina Łoniów","NIE",2609052,"gmina wiejska","GW","",2609052,"gmina wiejska","GW","",null,null,""]
[null,"sandomierski","Obrazów","gmina Obrazów","NIE",2609062,"gmina wiejska","GW","",2609062,"gmina wiejska","GW","",null,null,""]
[null,"sandomierski","Samborzec","gmina Samborzec","NIE",2609072,"gmina wiejska","GW","",2609072,"gmina wiejska","GW","",null,null,""]
[null,"sandomierski","Sandomierz","gmina Sandomierz","TAK",2609011,"gmina miejska","GM","",2609011,"gmina miejska","GM",""]
[null,"sandomierski","Wilczyce","gmina Wilczyce","NIE",2609082,"gmina wiejska","GW","",2609082,"gmina wiejska","GW","",null,null,""]
[null,"sandomierski","Zawichost","gmina Zawichost","NIE",2609093,"gmina miejsko-wiejska","GM-W","",2609093,"gmina miejsko-wiejska","GM-W","",null,null,""]
[null,"skarżyski","Bliżyn","gmina Bliżyn","NIE",2610022,"gmina wiejska","GW","",2610022,"gmina wiejska","GW","",null,null,""]
[null,"skarżyski","Łączna","gmina Łączna","NIE",2610032,"gmina wiejska","GW","",2610032,"gmina wiejska","GW","",null,null,""]
[null,"skarżyski","Skarżysko-Kamienna","gmina Skarżysko-Kamienna","TAK",2610011,"gmina miejska","GM","",2610011,"gmina miejska","GM",""]
[null,"skarżyski","Skarżysko Kościelne","gmina Skarżysko Kościelne","NIE",2610042,"gmina wiejska","GW","",2610042,"gmina wiejska","GW","",null,null,""]
[null,"skarżyski","Suchedniów","gmina Suchedniów","NIE",2610053,"gmina miejsko-wiejska","GM-W","",2610053,"gmina miejsko-wiejska","GM-W","",null,null,""]
[null,"starachowicki","Brody","gmina Brody","NIE",2611022,"gmina wiejska","GW","",2611022,"gmina wiejska","GW","",null,null,""]
[null,"starachowicki","Mirzec","gmina Mirzec","NIE",2611032,"gmina wiejska","GW","",2611032,"gmina wiejska","GW","",null,null,""]
[null,"starachowicki","Pawłów","gmina Pawłów","NIE",2611042,"gmina wiejska","GW","",2611042,"gmina wiejska","GW","",null,null,""]
[null,"starachowicki","Starachowice","gmina Starachowice","TAK",2611011,"gmina miejska","GM","",2611011,"gmina miejska","GM",""]
[null,"starachowicki","Wąchock","gmina Wąchock","NIE",2611053,"gmina miejsko-wiejska","GM-W","",2611053,"gmina miejsko-wiejska","GM-W","",null,null,""]
[null,"staszowski","Bogoria","gmina Bogoria","NIE",2612012,"gmina wiejska","GW","będzie zmiana od 2024",2612013,"gmina miejsko-wiejska","GM-W","zmiana od 2024 \n(stary teryt 2612012 - gmina wiejska;\nnowy teryt 2612013 - gmina miejsko-wiejska) \nZMIANA NIE ZOSTAŁA UWZGLĘDNIONA na liście z 2024",null,null,""]
[null,"staszowski","Łubnice","gmina Łubnice","NIE",2612022,"gmina wiejska","GW","",2612022,"gmina wiejska","GW","",null,null,""]
[null,"staszowski","Oleśnica","gmina Oleśnica","NIE",2612033,"gmina miejsko-wiejska","GM-W","",2612033,"gmina miejsko-wiejska","GM-W","",null,null,""]
[null,"staszowski","Osiek","gmina Osiek","NIE",2612043,"gmina miejsko-wiejska","GM-W","",2612043,"gmina miejsko-wiejska","GM-W","",null,null,""]
[null,"staszowski","Połaniec","gmina Połaniec","NIE",2612053,"gmina miejsko-wiejska","GM-W","",2612053,"gmina miejsko-wiejska","GM-W","",null,null,""]
[null,"staszowski","Rytwiany","gmina Rytwiany","NIE",2612062,"gmina wiejska","GW","",2612062,"gmina wiejska","GW","",null,null,""]
[null,"staszowski","Staszów","gmina Staszów","TAK",2612073,"gmina miejsko-wiejska","GM-W","",2612073,"gmina miejsko-wiejska","GM-W",""]
[null,"staszowski","Szydłów","gmina Szydłów","NIE",2612083,"gmina miejsko-wiejska","GM-W","",2612083,"gmina miejsko-wiejska","GM-W","",null,null,""]
[null,"włoszczowski","Kluczewsko","gmina Kluczewsko","NIE",2613012,"gmina wiejska","GW","",2613012,"gmina wiejska","GW","",null,null,""]
[null,"włoszczowski","Krasocin","gmina Krasocin","NIE",2613022,"gmina wiejska","GW","",2613022,"gmina wiejska","GW","",null,null,""]
[null,"włoszczowski","Moskorzew","gmina Moskorzew","NIE",2613032,"gmina wiejska","GW","",2613032,"gmina wiejska","GW","",null,null,""]
[null,"włoszczowski","Radków","gmina Radków","NIE",2613042,"gmina wiejska","GW","",2613042,"gmina wiejska","GW","",null,null,""]
[null,"włoszczowski","Secemin","gmina Secemin","NIE",2613052,"gmina wiejska","GW","",2613052,"gmina wiejska","GW","",null,null,""]
[null,"włoszczowski","Włoszczowa","gmina Włoszczowa","NIE",2613063,"gmina miejsko-wiejska","GM-W","",2613063,"gmina miejsko-wiejska","GM-W","",null,null,""]

{"sheet":"DANE - pkt 9","index":7,"n_rows":119,"n_cols":7,"rows_kept":119,"cut":false,"hidden":false,"merged":[[2,3,2,4],[58,1,58,2],[64,1,64,5],[69,1,69,4],[80,1,80,4],[77,1,77,4],[54,1,54,5],[55,1,55,5],[20,1,20,5],[21,1,21,5],[23,1,23,5],[39,1,39,5],[40,1,40,5],[24,1,24,5],[46,1,46,4],[11,3,11,6],[41,1,41,5],[42,1,42,5],[43,1,43,5],[26,1,26,5],[108,1,108,4],[100,1,100,5],[101,1,101,5],[90,1,90,4],[87,1,87,4]]}
[]
[]
[null,"KATEGORIA DROGI",null,"RODZAJ DROGI w zależności od jej klasy"]
[null,"gminna",null,"KLASA DROGI","RODZAJ DROGI"]
[null,"powiatowa",null,"D - dojazdowa","ulica, droga zamiejska"]
[null,null,null,"L - lokalna","ulica, droga zamiejska"]
[null,null,null,"Z - zbiorcza","ulica, droga zamiejska"]
[null,"RODZAJ DROGI",null,"G - główna","ulica, droga zamiejska"]
[null,"ulica",null,"GP - główna ruchu przyspieszonego","ulica, droga zamiejska"]
[null,"droga zamiejska"]
[]
[null,null,null,"KLASA DROGI w zależności od jej kategorii"]
[null,"KLASA DROGI",null,"KATEGORIA DROGI","KLASA DROGI \n(standardowa)","KLASA DROGI \n(dopuszczalna)","KLASA DROGI \n(w trudnych warunkach)"]
[null,"D - dojazdowa",null,"gminna","D, L","Z, G, GP","-"]
[null,"L - lokalna",null,"powiatowa","Z","G, GP","L"]
[null,"Z - zbiorcza"]
[null,"G - główna"]
[null,"GP - główna ruchu przyspieszonego"]
[]
[]
[null,"ulica - droga klasy GP, G, Z, L lub D otoczona terenami zabudowy lub terenami przeznaczonymi pod zabudowę, pełniąca oprócz funkcji komunikacyjnej także inne funkcje, w szczególności związane z jej otoczeniem (§ 4 pkt 24 rozporządzenia Ministra Infrastruktury w sprawie przepisów techniczno-budowlanych dotyczących dróg publicznych)"]
[null,"droga zamiejska -  droga nie będąca ulicą (§ 4 pkt 3 rozporządzenia Ministra Infrastruktury w sprawie przepisów techniczno-budowlanych dotyczących dróg publicznych)"]
[]
[null,"trudne warunki - warunki wynikające z istniejącego ukształtowania lub zagospodarowania terenu, ze stopnia złożoności warunków gruntowo-wodnych lub z konieczności ograniczenia oddziaływania drogi na środowisko, które przy zachowaniu podstawowych warunków, o których mowa w dziale II, uniemożliwiają zastosowanie rozwiązania standardowego lub powodują, że koszty zastosowania rozwiązania standardowego lub powodują, że koszty zastosowania rozwiązania standardowego w cyklu życia drogi byłoby rażąco wysokie względem rozwiązania alternatywnego (§ 4 pkt 22 rozporządzenia Ministra Infrastruktury w sprawie przepisów techniczno-budowlanych dotyczących dróg publicznych)"]
[null,"trudne warunki (zastosowanie) - zastosowanie przepisów, które odnoszą się do trudnych warunków, wymaga pisemnego uzasadnienia potwierdzającego brak możliwości lub rażąco wysokie koszty zastosowania rozwiązania standardowego względem rozwiązania alternatywnego, które dołącza się do dokumentacji projektowej (§ 2 pkt 5 rozporządzenia Ministra Infrastruktury w sprawie przepisów techniczno-budowlanych dotyczących dróg publicznych)"]
[]
[null,"PRZEKRÓJ n/m \ngdzie: \nn - liczba jezdni głównych,\nm - liczba pasów ruchu na jezdni głównej"]
[null,"RODZAJ DROGI","KLASA DROGI","PRZEKRÓJ \n(standardowy)","PRZEKRÓJ \n(dopuszczony)","PRZEKRÓJ \n(w trudnych warunkach)"]
[null,"ulica","D - dojazdowa","dwukierunkowy 1/2","dwukierunkowy 1/1*,  \n2/1, \njednokierunkowy 1/1, \njednokierunkowy 1/2, ","-"]
[null,"ulica","L - lokalna","dwukierunkowy 1/2","dwukierunkowy 1/2+0, \n2/1, \n2/2, \njednokierunkowy 1/1, \njednokierunkowy 1/2, ","-"]
[null,"ulica","Z - zbiorcza","dwukierunkowy 1/2","dwukierunkowy 1/2+0, \n2/1, \n2/2, \n2/3,  \njednokierunkowy 1/1, \njednokierunkowy 1/2, \njednokierunkowy 1/3, ","-"]
[null,"ulica","G - główna","dwukierunkowy 1/2","dwukierunkowy 1/2+0, \n2/2, \n2/3, \n2/4, \njednokierunkowy 1/1, \njednokierunkowy 1/2, \njednokierunkowy 1/3, \njednokierunkowy 1/4, ","-"]
[null,"ulica","GP - główna ruchu przyspieszonego","2/2","2/3, \n2/4, \ndwukierunkowy 1/2+0, \ndwukierunkowy 1/2","-"]
[null,"droga zamiejska","D - dojazdowa","dwukierunkowy 1/2**","dwukierunkowy 1/2-1, \ndwukierunkowy 1/1","dwukierunkowy 1/2** (bez możliwości wyprzedzania)"]
[null,"droga zamiejska","L - lokalna","dwukierunkowy 1/2**","dwukierunkowy 1/2-1","dwukierunkowy 1/2** (bez możliwości wyprzedzania)"]
[null,"droga zamiejska","Z - zbiorcza","dwukierunkowy 1/2**","2/2","dwukierunkowy 1/2** (bez możliwości wyprzedzania)"]
[null,"droga zamiejska","G - główna","dwukierunkowy 1/2**","dwukierunkowy 1/2+1, \n2/2,\n2/3","dwukierunkowy 1/2** (bez możliwości wyprzedzania)"]
[null,"droga zamiejska","GP - główna ruchu przyspieszonego","2/2","2/3, \ndwukierunkowy 1/2**, \ndwukierunkowy 1/2+1","dwukierunkowy 1/2** (bez możliwości wyprzedzania)"]
[]
[null,"dwukierunkowy 1/2+0 - oznacza przekrój ulicy ze środkowym pasem wielofunkcyjnym, który jest przeznaczony do ruchu pojazdów wyjeżdżających z ulicy lub wjeżdżających na ulicę (§ 15 ust. 5 rozporządzenia Ministra Infrastruktury w sprawie przepisów techniczno-budowlanych dotyczących dróg publicznych)"]
[null,"dwukierunkowy 1/1* - na ulicy o tym przekroju projektuje się odcinki o przekroju dwukierunkowym 1/2 umożliwiające wyminięcie się pojazdów (§ 15 ust. 6 rozporządzenia Ministra Infrastruktury w sprawie przepisów techniczno-budowlanych dotyczących dróg publicznych)"]
[null,"dwukierunkowy 1/2+1 - oznacza przekrój drogi zamiejskiej z zespołem naprzemiennych dodatkowych pasów ruchu do wyprzedzania (§ 15 ust. 2 rozporządzenia Ministra Infrastruktury w sprawie przepisów techniczno-budowlanych dotyczących dróg publicznych)"]
[null,"dwukierunkowy 1/2** - droga zamiejska o tym przekroju powinna mieć odcinki z możliwością wyprzedzania, które zapewniają niezbędne warunki widoczności, lub dodatkowe pasy ruchu do wyprzedzania. W trudnych warunkach dopuszcza się odcinki bez możliwości wyprzedzania (§ 15 ust. 2 rozporządzenia Ministra Infrastruktury w sprawie przepisów techniczno-budowlanych dotyczących dróg publicznych)"]
[null,"dwukierunkowy 1/2-1 - oznacza przekrój drogi ze środkowym pasem przeznaczonym do dwukierunkowego ruchu pojazdów (z wyjątkiem rowerów, hulajnóg elektrycznych i urządzeń transportu osobistego) oraz pasami usytuowanymi po obu stronach pasa środkowego, które są przeznaczone do jednokierunkowego ruchu pieszych, rowerów, hulajnóg elektrycznych i urządzeń transportu osobistego, a także do ruchu pozostałych pojazdów w trakcie wymijania, na której prędkość dopuszczalna wynosi nie więcej niż 50 km/h (§ 15 ust. 3 rozporządzenia Ministra Infrastruktury w sprawie przepisów techniczno-budowlanych dotyczących dróg publicznych)"]
[]
[]
[null,"SZEROKOŚĆ PASA RUCHU w zależności od klasy drogi "]
[null,"KLASA DROGI","SZEROKOŚĆ PASA RUCHU \n(standardowa)","SZEROKOŚĆ PASA RUCHU \n(dopuszczalna)","SZEROKOŚĆ PASA RUCHU \n(w trudnych warunkach)"]
[null,"D - dojazdowa","2,50 m","2,75 m, 3,00 m, 3,25 m, 3,50 m","2,25 m"]
[null,"L - lokalna","2,75 m","3,00 m, 3,25 m, 3,50 m","2,50 m"]
[null,"Z - zbiorcza","3,00 m","3,25 m, 3,50 m","2,75 m"]
[null,"G - główna","3,50 m","-","3,25 m, 3,00 m"]
[null,"GP - główna ruchu przyspieszonego","3,50 m","-","3,25 m"]
[]
[null,"Szerokość pasa ruchu na jezdni  z jednym pasem ruchu powinna być mniejsza niż suma szerokości dwóch pasów ruchu, ale nie mniejsza niż 3,50 m (§ 17 ust. 3 rozporządzenia Ministra Infrastruktury w sprawie przepisów techniczno-budowlanych dotyczących dróg publicznych)"]
[null,"W miejscu zastosowania rozwiązania w celu uspokojenia ruchu, dopuszcza się zmniejszenie szerokości pasa ruchu do nie mniej niż 2,25 m (§ 17 ust. 4 rozporządzenia Ministra Infrastruktury w sprawie przepisów techniczno-budowlanych dotyczących dróg publicznych)"]
[]
[]
[null,"POBOCZA  w zależności od rodzaju drogi"]
[null,"RODZAJ DROGI","POBOCZA",null,"KLASA DROGI","POBOCZE"]
[null,"doga zamiejska o jednej jezdni głównej","pobocza po obu stronach jezdni",null,"GP","częściowo o nawierzchni twardej, jako opaska zewnętrzna, częściowo o nawierzchni gruntowej"]
[null,"droga zamiejska o dwóch jezdniach głównych","pobocze z prawej strony i opaska wewnętrzna z lewej strony każdej jezdni (opaski wewnętrznej nie projektuje się na drogach klasy L lub D)",null,"G, Z","częściowo o nawierzchni twardej, jako opaska zewnętrzna, częściowo o nawierzchni gruntowej \nlub \nw całości o nawierzchni gruntowej"]
[null,null,null,null,"L,D","w całości o nawierzchni gruntowej"]
[]
[null,"Na ulicy projektuje się pobocza albo pobocze i opaskę wewnętrzną w taki sposób, jak na drodze zamiejskiej. Jeżeli jezdnia ulicy jest ograniczona wyniesionym krawężnikiem, a ruch pieszych odbywa się po drodze dla pieszych lub drodze dla pieszych i rowerów albo na ulicy obowiązuje zakaz ruchu pieszych, dopuszcza się inne rozwiązania w zakresie poboczy lub opasek wewnętrznych (§23 ust. 4 rozporządzenia Ministra Infrastruktury w sprawie przepisów techniczno-budowlanych dotyczących dróg publicznych)"]
[]
[]
[]
[]
[null,"POBOCZA O NAWIERZCHNI TWARDEJ w postaci opaski zewnętrznej w zależności od klasy drogi"]
[null,"KLASA DROGI","SZEROKOŚĆ POBOCZA \n(standardowa)","SZEROKOŚĆ POBOCZA \n(dopuszczalna)","SZEROKOŚĆ POBOCZA \n(w trudnych warunkach)"]
[null,"D - dojazdowa","-","-","-"]
[null,"L - lokalna","-","-","-"]
[null,"Z - zbiorcza","0,50 m","-","-"]
[null,"G - główna","0,50 m","-","-"]
[null,"GP - główna ruchu przyspieszonego o jednej jezdni głównej","0,75 m","-","nie mniej niż 0,50 m"]
[null,"GP - główna ruchu przyspieszonego o dwóch jezdniach głównych","0,75 m","1,50 m","-"]
[null,"Dopuszcza się zwiększenie do 1,50 m szerokości pobocza o nawierzchni twardej, w postaci opaski zewnętrznej w miejscu istotnym ze względu na bezpieczeństwo ruchu"]
[]
[]
[null,"POBOCZA O NAWIERZCHNI TWARDEJ w postaci opaski wewnętrznej w zależności od klasy drogi"]
[null,"KLASA DROGI","SZEROKOŚĆ POBOCZA \n(standardowa)","SZEROKOŚĆ POBOCZA \n(dopuszczalna)","SZEROKOŚĆ POBOCZA \n(w trudnych warunkach)"]
[null,"D - dojazdowa"]
[null,"L - lokalna"]
[null,"Z - zbiorcza","0,50 m"]
[null,"G - główna","0,50 m"]
[null,"GP - główna ruchu przyspieszonego","0,75 m",null,"nie mniej niż 0,50 m"]
[null,"Dopuszcza się zwiększenie do 1,50 m szerokości pobocza o nawierzchni twardej, w postaci opaski zewnętrznej w miejscu istotnym ze względu na bezpieczeństwo ruchu"]
[]
[]
[null,"POBOCZA O NAWIERZCHNI GRUNTOWEJ w zależności od klasy drogi"]
[null,"KLASA DROGI","SZEROKOŚĆ POBOCZA \n(standardowa)","SZEROKOŚĆ POBOCZA \n(dopuszczalna)","SZEROKOŚĆ POBOCZA \n(w trudnych warunkach)"]
[null,"D - dojazdowa","0,75 m","-","nie mniej niż 0,50 m"]
[null,"L - lokalna","0,75 m","-","nie mniej niż 0,50 m"]
[null,"Z - zbiorcza","1,00 m","-","nie mniej niż 0,50 m"]
[null,"G - główna","1,25 m","-","nie mniej niż 0,50 m"]
[null,"GP - główna ruchu przyspieszonego","-","-","-"]
[null,"część pobocza przyległa do opaski zewnętrznej","0,75 m","-","nie mniej niż 0,50 m"]
[null,"część pobocza przyległa do pasa awaryjnego","1,25 m","-","nie mniej niż 0,75 m"]
[]
[null,"nawierzchnia gruntowa - nawierzchnię z gruntu rodzimego lub nasypowego, ulepszonego mechanicznie lub chemicznie, w której dopuszcza się wykonanie wierzchniej warstwy z kruszywa naturalnego, sztucznego lub pochodzącego z recyklingu (§ 4 pkt 2 lit. a rozporządzenia Ministra Infrastruktury w sprawie przepisów techniczno-budowlanych dotyczących dróg publicznych)"]
[null,"nawierzchnia twarda - nawierzchnia niebędąca nawierzchnią gruntową (§ 4 pkt 2 lit. b rozporządzenia Ministra Infrastruktury w sprawie przepisów techniczno-budowlanych dotyczących dróg publicznych)"]
[]
[]
[null,"SZEROKOŚĆ CHODNIKA \n(standardowa)","SZEROKOŚĆ CHODNIKA \n(w trudnych warunkach)","(§ 29 ust. 1, 2 rozporządzenia Ministra Infrastruktury w sprawie przepisów techniczno-budowlanych dotyczących dróg publicznych)"]
[null,"nie mniejsza niż 1,80 m","nie mniejsza niż 1,00 m pod warunkiem zaprojektowania miejsc do wymijania się osób ze szczególnymi potrzebami o długości nie mniejszej niż 2,00 m i szerokości nie mniejszej niż 1,80 m"]
[]
[]
[null,"RUCH PIESZYCH i ROWERÓW"]
[null,"RODZAJ URZĄDZENIA RUCHU","SZEROKOŚĆ \n(standardowa)","SZEROKOŚĆ \n(w trudnych warunkach)","Dodatkowe informacje"]
[null,"Chodnik","nie mniejsza niż 1,80 m","nie mniejsza niż 1,00 m pod warunkiem zaprojektowania miejsc do wymijania się osób ze szczególnymi potrzebami o długości nie mniejszej niż 2,00 m i szerokości nie mniejszej niż 1,80 m","(§ 29 ust. 1, 2 rozporządzenia Ministra Infrastruktury w sprawie przepisów techniczno-budowlanych dotyczących dróg publicznych)"]
[null,"Przejście dla pieszych","nie mniejsza niż 4,00 m i nie większa niż 16,00 m","zmniejszenie szerokości do 2,50 m na ulicy w trudnych warunkach w obszarze skrzyżowania, na wlocie ulicy podporządkowanej, w przypadku połączenia z przejazdem dla rowerów","(§ 35 rozporządzenia Ministra Infrastruktury w sprawie przepisów techniczno-budowlanych dotyczących dróg publicznych)"]
[null,"Strefa oczekiwania (związana z przejściem dla pieszych)","szerokość równa szerokości przejścia i długości nie mniejszej niż 2,50 m","szerokość równa szerokości przejścia i długości nie mniejszej niż 2,00 m","(§ 36 rozporządzenia Ministra Infrastruktury w sprawie przepisów techniczno-budowlanych dotyczących dróg publicznych)"]
[null,"Jednokierunkowa droga dla rowerów","nie mniejsza 1,50 m","1,20 m (w trudnych warunkach, na moście lub wiadukcie),\n1,00 m na odcinku nie dłuższym niż 20 m (konieczność zapewnienia segregacji kierunków ruchu)","(§ 42 ust. 2 rozporządzenia Ministra Infrastruktury w sprawie przepisów techniczno-budowlanych dotyczących dróg publicznych)"]
[null,"Dwukierunkowa droga dla rowerów","nie mniejsza niż 2,50 m","2,00 m (w trudnych warunkach, na moście lub wiadukcie)","(§ 42 ust. 3 rozporządzenia Ministra Infrastruktury w sprawie przepisów techniczno-budowlanych dotyczących dróg publicznych)"]
[null,"Droga dla pieszych i rowerów","nie mniejsza niż 3,00 m","2,50 m (w trudnych warunkach, na moście lub wiadukcie)","(§ 42 ust. 4 rozporządzenia Ministra Infrastruktury w sprawie przepisów techniczno-budowlanych dotyczących dróg publicznych)"]
[null,"Pas lub kontrapas ruchu dla rowerów","nie mniejsza niż 1,50 m i mniejsza niż 2,25 m","nie mniejsza niż 1,25 m (na moście lub wiadukcie lub braku krawężnika), \nnie mniejsza niż 1,00 m (w trudnych warunkach)","(§ 42 ust. 5 rozporządzenia Ministra Infrastruktury w sprawie przepisów techniczno-budowlanych dotyczących dróg publicznych)"]
[null,"Przejazd dla rowerów","nie mniejsza niż szerokość drogi dla rowerów przed przejazdem i nie mniejsza niż 1,80 m (przejazdu jednokierunkowego) i 3,00 m (przejazdu dwukierunkowego)",null,"(§ 45 ust. 2 rozporządzenia Ministra Infrastruktury w sprawie przepisów techniczno-budowlanych dotyczących dróg publicznych)"]
[null,"Strefa oczekiwania (związana z przejazdem dla rowerów)","szerokość równa szerokości przejazdów i długości nie mniejszej niż 2,50 m","szerokość równa szerokości przejazdów i długości nie mniejszej niż 2,00 m","(§ 45 ust. 3 rozporządzenia Ministra Infrastruktury w sprawie przepisów techniczno-budowlanych dotyczących dróg publicznych)"]

{"sheet":"INSTRUKCJA","index":8,"n_rows":0,"n_cols":0,"rows_kept":0,"cut":false,"hidden":true,"merged":[]}