{"text_format":"1","workbook":"xlsx","n_sheets":3,"sheets":["Budowa","Remont","DANE"],"not_rendered":{"charts":0,"images":0,"macros":1,"external_links":0,"defined_names":4,"comments":0,"pivot_tables":0},"unopened":[],"bounds":{"document_bytes":16777216,"sheet_cells":100000,"rows_first":2000,"rows_last":500,"rows_between":2000,"halvings":0,"cell_chars":16384,"cell_head_chars":4096},"cells_cut":0,"cells_raw":0,"read":"whole","date_system":"1900"}

{"sheet":"Budowa","index":0,"n_rows":139,"n_cols":37,"rows_kept":139,"cut":false,"hidden":false,"merged":[[69,5,69,25],[70,5,70,25],[71,5,71,25],[72,5,72,25],[66,1,66,25],[82,1,82,9],[83,0,83,1],[83,2,83,9],[84,1,84,9],[85,0,85,1],[85,2,85,9],[75,0,76,11],[75,16,76,16],[75,21,76,21],[77,1,77,9],[78,1,78,9],[79,1,79,9],[80,1,80,9],[81,2,81,9],[81,0,81,1],[111,23,111,25],[102,1,102,25],[103,2,103,22],[104,2,104,22],[105,2,105,22],[107,2,107,22],[108,2,108,22],[109,2,109,22],[110,2,110,22],[108,23,108,25],[89,0,89,25],[90,22,90,23],[91,22,91,23],[92,22,92,23],[90,2,90,21],[91,2,91,21],[92,2,92,21],[106,2,106,25],[128,2,128,25],[97,1,97,9],[97,10,97,16],[97,17,97,25],[100,1,100,25],[101,0,101,25],[98,1,98,9],[98,10,98,16],[98,17,98,25],[99,1,99,9],[99,10,99,16],[99,17,99,25],[104,23,104,25],[105,23,105,25],[103,23,103,25],[107,23,107,25],[121,1,121,22],[121,23,121,25],[122,0,122,25],[123,1,123,22],[123,23,123,25],[118,0,118,25],[113,1,113,25],[114,1,114,25],[115,1,115,25],[87,12,87,14],[87,17,87,19],[87,22,87,24],[86,0,87,9],[86,10,87,11],[84,10,84,11],[85,10,85,11],[88,1,88,25],[84,17,84,19],[85,22,85,24],[17,2,17,9],[18,2,18,9],[17,0,18,1],[34,0,34,25],[53,1,53,2],[53,3,53,25],[54,10,54,12],[54,14,54,16],[54,18,54,20],[54,22,54,24],[54,1,54,8],[45,0,46,0],[48,0,54,0],[21,18,21,25],[22,18,22,25],[23,18,23,25],[49,2,49,4],[49,5,49,7],[49,8,49,11],[49,12,49,17],[49,18,49,25],[37,13,38,19],[22,10,22,17],[23,10,23,17],[82,10,82,11],[83,10,83,11],[77,12,77,14],[78,12,78,14],[82,17,82,19],[83,17,83,19],[81,12,81,14],[82,12,82,14],[83,12,83,14],[76,17,76,20],[77,17,77,19],[78,17,78,19],[79,17,79,19],[80,17,80,19],[81,17,81,19],[21,1,21,9],[68,1,68,25],[74,1,74,25],[77,10,77,11],[78,10,78,11],[79,10,79,11],[80,10,80,11],[81,10,81,11],[69,0,69,4],[70,0,70,4],[71,0,71,4],[72,0,72,4],[76,22,76,25],[77,22,77,24],[78,22,78,24],[79,22,79,24],[80,22,80,24],[81,22,81,24],[82,22,82,24],[83,22,83,24],[84,22,84,24],[0,1,0,3],[0,4,0,25],[1,0,1,3],[1,4,1,25],[2,0,2,25],[3,0,3,25],[47,23,47,25],[44,1,44,22],[47,1,47,22],[45,18,45,25],[46,18,46,25],[45,12,45,17],[46,12,46,17],[45,8,45,11],[46,8,46,11],[45,5,45,7],[46,5,46,7],[45,2,45,4],[46,2,46,4],[8,21,8,25],[4,0,4,25],[13,1,13,25],[14,15,15,15],[14,17,14,21],[14,22,14,25],[14,0,15,14],[5,17,6,25],[7,1,7,25],[11,1,11,25],[9,0,9,2],[9,3,9,25],[10,0,10,2],[10,3,10,25],[5,0,6,2],[5,3,6,14],[5,15,6,16],[8,0,8,2],[8,3,8,6],[8,7,8,9],[8,10,8,17],[8,18,8,20],[12,0,12,25],[15,22,15,25],[15,17,15,21],[37,20,38,25],[38,3,38,7],[38,8,38,12],[37,0,38,2],[32,1,32,3],[32,4,32,25],[33,1,33,19],[33,20,33,25],[35,1,35,25],[36,0,36,25],[37,3,37,12],[39,0,39,2],[51,8,51,11],[30,1,30,3],[30,4,30,25],[31,1,31,19],[31,20,31,25],[51,12,51,17],[51,18,51,25],[52,2,52,4],[52,5,52,7],[52,8,52,11],[52,12,52,17],[52,18,52,25],[39,3,39,7],[48,2,48,4],[48,5,48,7],[48,8,48,11],[48,12,48,17],[43,1,43,25],[44,23,44,25],[48,18,48,25],[39,8,39,12],[39,13,39,19],[39,20,39,25],[26,1,26,25],[27,1,27,19],[27,20,27,25],[28,1,28,3],[28,4,28,25],[19,1,19,25],[18,10,18,17],[18,18,18,25],[22,1,22,9],[24,18,24,25],[20,18,20,25],[20,10,20,17],[20,1,20,9],[21,10,21,17],[24,10,24,17],[25,10,25,25],[17,10,17,17],[17,18,17,25],[76,12,76,15],[75,22,75,25],[16,1,16,25],[79,12,79,14],[80,12,80,14],[24,0,24,9],[25,0,25,9],[29,1,29,19],[29,20,29,25],[23,1,23,9],[40,0,40,2],[40,3,40,7],[40,8,40,12],[40,13,40,19],[40,20,40,25],[55,1,55,25],[56,0,57,0],[56,1,57,11],[56,12,57,19],[56,20,56,25],[57,20,57,21],[57,22,57,23],[57,24,57,25],[41,0,41,2],[41,3,41,7],[41,8,41,12],[41,13,41,19],[41,20,41,25],[42,0,42,2],[42,3,42,12],[42,13,42,19],[42,20,42,25],[50,2,50,4],[50,5,50,7],[50,8,50,11],[50,12,50,17],[50,18,50,25],[51,2,51,4],[51,5,51,7],[62,1,62,25],[64,1,64,25],[60,1,60,11],[60,12,60,19],[60,20,60,21],[60,22,60,23],[60,24,60,25],[61,1,61,22],[61,23,61,25],[63,0,63,25],[58,1,58,11],[58,12,58,19],[58,20,58,21],[58,22,58,23],[58,24,58,25],[59,1,59,11],[59,12,59,19],[59,20,59,21],[59,22,59,23],[59,24,59,25],[65,1,65,4],[65,6,65,25],[67,0,67,25],[96,1,96,9],[96,10,96,16],[96,17,96,25],[90,24,90,25],[91,24,91,25],[92,24,92,25],[93,24,93,25],[93,1,93,23],[94,24,94,25],[94,2,94,23],[73,1,73,4],[73,6,73,25],[86,12,86,14],[86,17,86,19],[86,22,86,24],[85,17,85,19],[85,12,85,14],[75,12,75,15],[75,17,75,20],[84,12,84,14],[95,1,95,25],[138,0,138,25],[139,0,139,25],[133,0,133,25],[134,1,134,25],[136,0,136,25],[109,23,109,25],[110,23,110,25],[116,1,116,25],[124,2,124,25],[125,2,125,25],[126,2,126,25],[127,2,127,25],[137,1,137,25],[129,2,129,25],[130,2,130,25],[131,2,131,25],[132,0,132,25],[111,2,111,22],[112,2,112,22],[112,23,112,25],[117,0,117,25],[119,23,119,25],[119,1,119,22],[120,0,120,25]]}
["!"," UWAGA: ",null,null,"PRZED WYPEŁNIENIEM WNIOSKU NALEŻY ZAPOZNAĆ SIĘ Z INSTRUKCJĄ."]
[null,null,null,null,"PLIK ZOSTAŁ ZABEZPIECZONY PRZED EDYTOWANIEM. \nPROSZĘ NIE USUWAĆ ZABEZPIECZEŃ I SAMODZIELNIE NIE EDYTOWAĆ PLIKU."]
["WNIOSEK O DOFINANSOWANIE W RAMACH RZĄDOWEGO FUNDUSZU ROZWOJU DRÓG"]
["zadań mających na celu poprawę bezpieczeństwa niechronionych uczestników ruchu, \npolegających w szczególności na budowie, przebudowie lub remoncie dróg dla pieszych, dróg dla pieszych i rowerów, dróg dla rowerów, przejść dla pieszych, przejazdów dla rowerów, peronów przystankowych wraz z dojściami do tych peronów"]
["BUDOWA / ROZBUDOWA / PRZEBUDOWA"]
["PIECZĘĆ WPŁYWU \nDO URZĘDU \nWOJEWÓDZKIEGO",null,null,null,null,null,null,null,null,null,null,null,null,null,null,"NR EWIDENCYJNY \nWNIOSKU"]
[]
["1. ","NAZWA I ADRES JEDNOSTKI SAMORZĄDU TERYTORIALNEGO"]
["POWIAT ",null,null,null,null,null,null,"GMINA ",null,null,null,null,null,null,null,null,null,null,"NR TERC ",null,null,{"$f":"IFERROR(VLOOKUP(CONCATENATE(D9&K9),DANE!$A$70:$J$184,6,FALSE),\"\")","v":""}]
["NAZWA ",null,null,null,null,null,null,null,null,null,null,null,null,null,null,null,null,null,null,null,null,null,null,null,null,null,{"$f":"LEN(D10)","v":0},"z",90]
["ADRES ",null,null,null,null,null,null,null,null,null,null,null,null,null,null,null,null,null,null,null,null,null,null,null,null,null,{"$f":"LEN(D11)","v":0},"z",90]
["2. ","TYTUŁ ZADANIA "]
[null,null,null,null,null,null,null,null,null,null,null,null,null,null,null,null,null,null,null,null,null,null,null,null,null,null,{"$f":"LEN(A13)","v":0},"z",300]
["3. ","PRZEWIDYWANY OKRES REALIZACJI ZADANIA (rozpoczęcie i zakończenie realizacji zadania)"]
["zadanie jednoroczne realizowane    ",null,null,null,null,null,null,null,null,null,null,null,null,null,null,null,"od",null,null,null,null,null,2023,null,null,null,null,null,null,null,null,null,null,null,{"$f":"IF(R15=\"stycznia\",1,IF(R15=\"lutego\",2,IF(R15=\"marca\",3,IF(R15=\"kwietnia\",4,IF(R15=\"maja\",5,IF(R15=\"czerwca\",6,IF(R15=\"lipca\",7,IF(R15=\"sierpnia\",8,IF(R15=\"września\",9,IF(R15=\"października\",10,IF(R15=\"listopada\",11,IF(R15=\"grudnia\",12,\"\"))))))))))))","v":""},{"$f":"DATE(W15,AI15,1)","v":{"$error":"#VALUE!"}},{"$f":"DATEDIF(AJ15,AJ16,\"m\")","v":{"$error":"#VALUE!"}}]
[null,null,null,null,null,null,null,null,null,null,null,null,null,null,null,null,"do",null,null,null,null,null,null,null,null,null,null,null,null,null,null,null,null,null,{"$f":"IF(R16=\"stycznia\",1,IF(R16=\"lutego\",2,IF(R16=\"marca\",3,IF(R16=\"kwietnia\",4,IF(R16=\"maja\",5,IF(R16=\"czerwca\",6,IF(R16=\"lipca\",7,IF(R16=\"sierpnia\",8,IF(R16=\"września\",9,IF(R16=\"października\",10,IF(R16=\"listopada\",11,IF(R16=\"grudnia\",12,\"\"))))))))))))","v":""},{"$f":"DATE(W16,AI16,1)","v":{"$error":"#VALUE!"}},{"$f":"IFERROR(IF(AK15<12,\"OK\",\"BŁĄD\"),\"liczba\")","v":"liczba"}]
["4. ","RODZAJ ROBÓT (klasyfikacja wydatków w zależności od rodzaju robót)",null,null,null,null,null,null,null,null,null,null,null,null,null,null,null,null,null,null,null,null,null,null,null,null,null,null,null,null,null,null,null,null,"BUDOWA / ROZBUDOWA / PRZEBUDOWA"]
[null,null,"BUDOWA",null,null,null,null,null,null,null,"ROZBUDOWA",null,null,null,null,null,null,null,"PRZEBUDOWA",null,null,null,null,null,null,null,null,null,null,null,null,null,null,null,{"$f":"IF(AI17=\"REMONT\",\"REMONT\",\"BRP\")","v":"BRP"}]
[null,null,"TAK"]
["5. ","PRZEWIDYWANY HARMONOGRAM RZECZOWO-FINANSOWY REALIZACJI ZADANIA"]
["Lp.","ELEMENTY I RODZAJE ROBÓT",null,null,null,null,null,null,null,null,"KOSZT KWALIFIKOWALNY\n [zł]",null,null,null,null,null,null,null,"KOSZT NIEKWALIFIKOWALNY\n [zł]"]
["1.","Roboty budowlane"]
["2.","Nadzór inwestorski (wszystkie branże)"]
["3.","Tablice informacyjne"]
["SUMA ",null,null,null,null,null,null,null,null,null,{"$f":"SUM(K22:O24)","v":0},null,null,null,null,null,null,null,{"$f":"SUM(S22:X24)","v":0}]
["OGÓŁEM ",null,null,null,null,null,null,null,null,null,{"$f":"SUM(K25:U25)","v":0}]
["6. ","PRZEWIDYWANE KOSZTY REALIZACJI ZADANIA BRUTTO - WYDATKI KWALIFIKOWALNE [zł] 1\n"]
["A.","ŁĄCZNY KOSZT REALIZACJI ZADANIA [zł]",null,null,null,null,null,null,null,null,null,null,null,null,null,null,null,null,null,null,{"$f":"IF(K25=0,\"\",K25)","v":""}]
[null,"SŁOWNIE :",null,null,{"$f":"IF(OR(U28=0,U28=\"\"),\"\",Slownie(U28))","v":""}]
["B.","KWOTA WNIOSKOWANEGO DOFINANSOWANIA [zł]",null,null,null,null,null,null,null,null,null,null,null,null,null,null,null,null,null,null,{"$f":"IF(OR(U28=\"\",U34=\"\"),\"\",FLOOR((U28*U34),1))","v":""}]
[null,"SŁOWNIE :",null,null,{"$f":"IF(OR(U30=0,U30=\"\"),\" \",Slownie(U30))","v":" "}]
["C.","KWOTA WKŁADU WŁASNEGO [zł]",null,null,null,null,null,null,null,null,null,null,null,null,null,null,null,null,null,null,{"$f":"IF(OR(U28=\"\",U34=\"\"),\"\",U28-U30)","v":""}]
[null,"SŁOWNIE :",null,null,{"$f":"IF(OR(U32=0,U32=\"\"),\" \",Slownie(U32))","v":" "}]
["D.","UDZIAŁ DOFINANSOWANIA W KOSZTACH KWALIFIKOWALNYCH ZADANIA [%]",null,null,null,null,null,null,null,null,null,null,null,null,null,null,null,null,null,null,{"$f":"IFERROR(VLOOKUP(CONCATENATE(D9&K9),DANE!$A$70:$J$184,10,FALSE),\"\")","v":""}]
["1WYDATKI KWALIFIKOWALNE [zł]\nw tym: koszty związane z przebudową jezdni w obszarze oddziaływania przejść dla pieszych/przejazdów dla rowerów (usunięcie kolizji z sieciami, przebudowa skrzyżowania, zatoki autobusowej lub przystanku), koszty budowy/przebudowy przejść dla pieszych/przejazdów dla rowerów (budowa/przebudowa sieci, osłon przeciwhałasowych, tablicy informującej o prędkości/fotoradaru, oświetlenia ulicznego), koszt nadzoru inwestorskiego (jeśli wymagają tego przepisy) oraz koszt monitoringu przejścia dla pieszych/przejazdu dla rowerów/drogi."]
["7. ","PRZEWIDYWANY TERMIN DOKONYWANIA WYPŁAT NA RZECZ WYKONAWCY ZADANIA"]
["KWOTA DO WYPŁATY W DANYM ROKU NA RZECZ WYKONAWCY ZADANIA "]
["ROK",null,null,"KWALIFIKOWALNE",null,null,null,null,null,null,null,null,null,"NIEKWALIFIKOWALNE",null,null,null,null,null,null,"OGÓŁEM"]
[null,null,null,"DOFINANSOWANIE",null,null,null,null,"ŚRODKI WŁASNE"]
[2023,null,null,null,null,null,null,null,null,null,null,null,null,null,null,null,null,null,null,null,{"$f":"IF(AND(D40=\"\",I40=\"\",N40=\"\"),\"\",SUM(D40:T40))","v":""}]
{"$rows_left_out":100}
{"sheet":"Remont","index":1,"n_rows":138,"n_cols":37,"rows_kept":138,"cut":false,"hidden":false,"merged":[[138,0,138,25],[19,1,19,9],[19,10,19,17],[19,18,19,25],[20,1,20,9],[20,10,20,17],[20,18,20,25],[21,10,21,17],[21,18,21,25],[22,10,22,17],[22,18,22,25],[23,0,23,9],[23,10,23,17],[23,18,23,25],[24,10,24,25],[88,0,88,25],[89,2,89,21],[89,22,89,23],[90,2,90,21],[90,22,90,23],[91,2,91,21],[91,22,91,23],[124,2,124,25],[125,2,125,25],[126,2,126,25],[115,1,115,25],[116,0,116,25],[117,0,117,25],[118,1,118,22],[118,23,118,25],[119,0,119,25],[120,1,120,22],[120,23,120,25],[121,0,121,25],[122,1,122,22],[122,23,122,25],[123,2,123,25],[137,0,137,25],[127,2,127,25],[128,2,128,25],[129,2,129,25],[130,2,130,25],[131,0,131,25],[132,0,132,25],[133,1,133,25],[135,0,135,25],[136,1,136,25],[113,1,113,25],[114,1,114,25],[106,2,106,22],[106,23,106,25],[107,2,107,22],[107,23,107,25],[102,2,102,22],[102,23,102,25],[103,2,103,22],[103,23,103,25],[104,2,104,22],[104,23,104,25],[105,2,105,25],[111,2,111,22],[111,23,111,25],[108,2,108,22],[108,23,108,25],[109,2,109,22],[109,23,109,25],[110,2,110,22],[110,23,110,25],[112,1,112,25],[98,1,98,9],[98,10,98,16],[98,17,98,25],[99,1,99,25],[100,0,100,25],[101,1,101,25],[96,1,96,9],[96,10,96,16],[96,17,96,25],[97,1,97,9],[97,10,97,16],[97,17,97,25],[92,1,92,23],[92,24,92,25],[93,2,93,23],[93,24,93,25],[94,1,94,25],[95,1,95,9],[95,10,95,16],[95,17,95,25],[87,1,87,25],[89,24,89,25],[90,24,90,25],[91,24,91,25],[85,0,86,9],[85,10,86,11],[85,12,85,14],[86,12,86,14],[84,0,84,1],[84,2,84,9],[84,10,84,11],[84,12,84,14],[83,1,83,9],[83,10,83,11],[83,12,83,14],[81,10,81,11],[81,12,81,14],[82,0,82,1],[82,2,82,9],[82,10,82,11],[82,12,82,14],[80,0,80,1],[80,2,80,9],[80,10,80,11],[80,12,80,14],[73,1,73,25],[74,0,75,11],[74,12,74,15],[75,12,75,15],[70,0,70,4],[70,5,70,25],[71,0,71,4],[71,5,71,25],[72,1,72,4],[72,6,72,25],[74,16,86,25],[78,1,78,9],[78,10,78,11],[78,12,78,14],[79,1,79,9],[79,10,79,11],[79,12,79,14],[76,1,76,9],[76,10,76,11],[76,12,76,14],[77,1,77,9],[77,10,77,11],[77,12,77,14],[81,1,81,9],[66,0,66,25],[67,1,67,25],[68,0,68,4],[68,5,68,25],[69,0,69,4],[69,5,69,25],[61,1,61,25],[62,0,62,25],[63,1,63,25],[64,1,64,4],[64,6,64,25],[65,1,65,25],[59,1,59,11],[59,12,59,19],[59,20,59,21],[59,22,59,23],[59,24,59,25],[60,1,60,22],[60,23,60,25],[57,1,57,11],[57,12,57,19],[57,20,57,21],[57,22,57,23],[57,24,57,25],[58,1,58,11],[58,12,58,19],[58,20,58,21],[58,22,58,23],[58,24,58,25],[54,1,54,25],[55,0,56,0],[55,1,56,11],[55,12,56,19],[55,20,55,25],[56,20,56,21],[56,22,56,23],[56,24,56,25],[52,1,52,2],[52,3,52,25],[53,1,53,8],[53,10,53,12],[53,14,53,16],[53,18,53,20],[53,22,53,24],[47,0,53,0],[47,2,47,4],[47,5,47,7],[47,8,47,11],[47,12,47,17],[47,18,47,25],[48,2,48,4],[48,5,48,7],[48,8,48,11],[50,2,50,4],[50,5,50,7],[50,8,50,11],[50,12,50,17],[50,18,50,25],[51,2,51,4],[51,5,51,7],[51,8,51,11],[51,12,51,17],[51,18,51,25],[46,1,46,22],[46,23,46,25],[42,1,42,25],[43,1,43,22],[43,23,43,25],[48,18,48,25],[49,2,49,4],[49,5,49,7],[49,8,49,11],[49,12,49,17],[49,18,49,25],[48,12,48,17],[44,0,45,0],[44,2,44,4],[44,5,44,7],[44,8,44,11],[44,12,44,17],[44,18,44,25],[45,2,45,4],[40,0,40,2],[40,3,40,7],[40,8,40,12],[40,13,40,19],[40,20,40,25],[41,0,41,2],[41,3,41,12],[41,13,41,19],[41,20,41,25],[45,5,45,7],[45,8,45,11],[45,12,45,17],[45,18,45,25],[38,0,38,2],[38,3,38,7],[38,8,38,12],[38,13,38,19],[38,20,38,25],[39,0,39,2],[39,3,39,7],[39,8,39,12],[39,13,39,19],[39,20,39,25],[35,0,35,25],[36,0,37,2],[36,3,36,12],[36,13,37,19],[36,20,37,25],[37,3,37,7],[37,8,37,12],[31,1,31,3],[31,4,31,25],[32,1,32,19],[32,20,32,25],[33,0,33,25],[34,1,34,25],[28,1,28,19],[28,20,28,25],[29,1,29,3],[29,4,29,25],[30,1,30,19],[30,20,30,25],[25,1,25,25],[26,1,26,19],[26,20,26,25],[27,1,27,3],[27,4,27,25],[24,0,24,9],[21,1,21,9],[22,1,22,9],[18,1,18,25],[16,1,16,25],[17,2,17,9],[17,10,17,17],[17,18,17,25],[13,1,13,25],[14,0,15,14],[14,15,15,15],[14,17,14,21],[14,22,14,25],[15,17,15,21],[15,22,15,25],[9,0,9,2],[9,3,9,25],[10,0,10,2],[10,3,10,25],[11,1,11,25],[12,0,12,25],[0,1,0,3],[0,4,0,25],[1,0,1,3],[1,4,1,25],[2,0,2,25],[3,0,3,25],[8,0,8,2],[8,3,8,6],[8,7,8,9],[8,10,8,17],[8,18,8,20],[8,21,8,25],[4,0,4,25],[5,0,6,2],[5,3,6,14],[5,15,6,16],[5,17,6,25],[7,1,7,25]]}
["!"," UWAGA: ",null,null,"PRZED WYPEŁNIENIEM WNIOSKU NALEŻY ZAPOZNAĆ SIĘ Z INSTRUKCJĄ."]
[null,null,null,null,"PLIK ZOSTAŁ ZABEZPIECZONY PRZED EDYTOWANIEM. \nPROSZĘ NIE USUWAĆ ZABEZPIECZEŃ I SAMODZIELNIE NIE EDYTOWAĆ PLIKU."]
["WNIOSEK O DOFINANSOWANIE W RAMACH RZĄDOWEGO FUNDUSZU ROZWOJU DRÓG"]
["zadań mających na celu poprawę bezpieczeństwa niechronionych uczestników ruchu, \npolegających w szczególności na budowie, przebudowie lub remoncie dróg dla pieszych, dróg dla pieszych i rowerów, dróg dla rowerów, przejść dla pieszych, przejazdów dla rowerów, peronów przystankowych wraz z dojściami do tych peronów"]
["REMONT"]
["PIECZĘĆ WPŁYWU \nDO URZĘDU \nWOJEWÓDZKIEGO",null,null,null,null,null,null,null,null,null,null,null,null,null,null,"NR EWIDENCYJNY \nWNIOSKU"]
[]
["1. ","NAZWA I ADRES JEDNOSTKI SAMORZĄDU TERYTORIALNEGO"]
["POWIAT ",null,null,null,null,null,null,"GMINA ",null,null,null,null,null,null,null,null,null,null,"NR TERC ",null,null,{"$f":"IFERROR(VLOOKUP(CONCATENATE(D9&K9),DANE!$A$70:$J$184,6,FALSE),\"\")","v":""}]
["NAZWA ",null,null,null,null,null,null,null,null,null,null,null,null,null,null,null,null,null,null,null,null,null,null,null,null,null,{"$f":"LEN(D10)","v":0},"z",90]
["ADRES ",null,null,null,null,null,null,null,null,null,null,null,null,null,null,null,null,null,null,null,null,null,null,null,null,null,{"$f":"LEN(D11)","v":0},"z",90]
["2. ","TYTUŁ ZADANIA "]
[null,null,null,null,null,null,null,null,null,null,null,null,null,null,null,null,null,null,null,null,null,null,null,null,null,null,{"$f":"LEN(A13)","v":0},"z",300]
["3. ","PRZEWIDYWANY OKRES REALIZACJI ZADANIA (rozpoczęcie i zakończenie realizacji zadania)"]
["zadanie jednoroczne realizowane    ",null,null,null,null,null,null,null,null,null,null,null,null,null,null,null,"od",null,null,null,null,null,2023,null,null,null,null,null,null,null,null,null,null,null,{"$f":"IF(R15=\"stycznia\",1,IF(R15=\"lutego\",2,IF(R15=\"marca\",3,IF(R15=\"kwietnia\",4,IF(R15=\"maja\",5,IF(R15=\"czerwca\",6,IF(R15=\"lipca\",7,IF(R15=\"sierpnia\",8,IF(R15=\"września\",9,IF(R15=\"października\",10,IF(R15=\"listopada\",11,IF(R15=\"grudnia\",12,\"\"))))))))))))","v":""},{"$f":"DATE(W15,AI15,1)","v":{"$error":"#VALUE!"}},{"$f":"DATEDIF(AJ15,AJ16,\"m\")","v":{"$error":"#VALUE!"}}]
[null,null,null,null,null,null,null,null,null,null,null,null,null,null,null,null,"do",null,null,null,null,null,null,null,null,null,null,null,null,null,null,null,null,null,{"$f":"IF(R16=\"stycznia\",1,IF(R16=\"lutego\",2,IF(R16=\"marca\",3,IF(R16=\"kwietnia\",4,IF(R16=\"maja\",5,IF(R16=\"czerwca\",6,IF(R16=\"lipca\",7,IF(R16=\"sierpnia\",8,IF(R16=\"września\",9,IF(R16=\"października\",10,IF(R16=\"listopada\",11,IF(R16=\"grudnia\",12,\"\"))))))))))))","v":""},{"$f":"DATE(W16,AI16,1)","v":{"$error":"#VALUE!"}},{"$f":"IFERROR(IF(AK15<12,\"OK\",\"BŁĄD\"),\"liczba\")","v":"liczba"}]
["4. ","RODZAJ ROBÓT (klasyfikacja wydatków w zależności od rodzaju robót)",null,null,null,null,null,null,null,null,null,null,null,null,null,null,null,null,null,null,null,null,null,null,null,null,null,null,null,null,null,null,null,null,"BUDOWA / ROZBUDOWA / PRZEBUDOWA"]
[null,null,null,null,null,null,null,null,null,null,"REMONT",null,null,null,null,null,null,null,"TAK",null,null,null,null,null,null,null,null,null,null,null,null,null,null,null,{"$f":"IF(AI17=\"REMONT\",\"REMONT\",\"BRP\")","v":"BRP"}]
["5. ","PRZEWIDYWANY HARMONOGRAM RZECZOWO-FINANSOWY REALIZACJI ZADANIA"]
["Lp.","ELEMENTY I RODZAJE ROBÓT",null,null,null,null,null,null,null,null,"KOSZT KWALIFIKOWALNY\n [zł]",null,null,null,null,null,null,null,"KOSZT NIEKWALIFIKOWALNY\n [zł]"]
["1.","Roboty budowlane"]
["2.","Nadzór inwestorski (wszystkie branże)"]
["3.","Tablice informacyjne"]
["SUMA ",null,null,null,null,null,null,null,null,null,{"$f":"SUM(K21:O23)","v":0},null,null,null,null,null,null,null,{"$f":"SUM(S21:X23)","v":0}]
["OGÓŁEM ",null,null,null,null,null,null,null,null,null,{"$f":"SUM(K24:U24)","v":0}]
["6. ","PRZEWIDYWANE KOSZTY REALIZACJI ZADANIA BRUTTO - WYDATKI KWALIFIKOWALNE [zł] 1\n"]
["A.","ŁĄCZNY KOSZT REALIZACJI ZADANIA [zł]",null,null,null,null,null,null,null,null,null,null,null,null,null,null,null,null,null,null,{"$f":"IF(K25=0,\"\",K25)","v":""}]
[null,"SŁOWNIE :",null,null,{"$f":"IF(OR(U27=0,U27=\"\"),\"\",Slownie(U27))","v":""}]
["B.","KWOTA WNIOSKOWANEGO DOFINANSOWANIA [zł]",null,null,null,null,null,null,null,null,null,null,null,null,null,null,null,null,null,null,{"$f":"IF(OR(U27=\"\",U33=\"\"),\"\",FLOOR((U27*U33),1))","v":""}]
[null,"SŁOWNIE :",null,null,{"$f":"IF(OR(U29=0,U29=\"\"),\" \",Slownie(U29))","v":" "}]
["C.","KWOTA WKŁADU WŁASNEGO [zł]",null,null,null,null,null,null,null,null,null,null,null,null,null,null,null,null,null,null,{"$f":"IF(OR(U27=\"\",U33=\"\"),\"\",U27-U29)","v":""}]
[null,"SŁOWNIE :",null,null,{"$f":"IF(OR(U31=0,U31=\"\"),\" \",Slownie(U31))","v":" "}]
["D.","UDZIAŁ DOFINANSOWANIA W KOSZTACH KWALIFIKOWALNYCH ZADANIA [%]",null,null,null,null,null,null,null,null,null,null,null,null,null,null,null,null,null,null,{"$f":"IFERROR(VLOOKUP(CONCATENATE(D9&K9),DANE!$A$70:$J$184,10,FALSE),\"\")","v":""}]
["1WYDATKI KWALIFIKOWALNE [zł]\nw tym: koszty związane z przebudową jezdni w obszarze oddziaływania przejść dla pieszych/przejazdów dla rowerów (usunięcie kolizji z sieciami, przebudowa skrzyżowania, zatoki autobusowej lub przystanku), koszty budowy/przebudowy przejść dla pieszych/przejazdów dla rowerów (budowa/przebudowa sieci, osłon przeciwhałasowych, tablicy informującej o prędkości/fotoradaru, oświetlenia ulicznego), koszt nadzoru inwestorskiego (jeśli wymagają tego przepisy) oraz koszt monitoringu przejścia dla pieszych/przejazdu dla rowerów/drogi."]
["7. ","PRZEWIDYWANY TERMIN DOKONYWANIA WYPŁAT NA RZECZ WYKONAWCY ZADANIA"]
["KWOTA DO WYPŁATY W DANYM ROKU NA RZECZ WYKONAWCY ZADANIA "]
["ROK",null,null,"KWALIFIKOWALNE",null,null,null,null,null,null,null,null,null,"NIEKWALIFIKOWALNE",null,null,null,null,null,null,"OGÓŁEM"]
[null,null,null,"DOFINANSOWANIE",null,null,null,null,"ŚRODKI WŁASNE"]
[2023,null,null,null,null,null,null,null,null,null,null,null,null,null,null,null,null,null,null,null,{"$f":"IF(AND(D39=\"\",I39=\"\",N39=\"\"),\"\",SUM(D39:T39))","v":""}]
[2024,null,null,null,null,null,null,null,null,null,null,null,null,null,null,null,null,null,null,null,{"$f":"IF(AND(D40=\"\",I40=\"\",N40=\"\"),\"\",SUM(D40:T40))","v":""}]
{"$rows_left_out":99}
{"sheet":"DANE","index":2,"n_rows":311,"n_cols":15,"rows_kept":311,"cut":false,"hidden":true,"merged":[[186,3,188,3],[186,4,188,4],[186,6,186,8],[188,6,188,8],[294,5,294,7],[294,8,294,10],[294,11,294,13],[294,14,297,14],[295,4,297,4],[295,5,295,6],[295,7,297,7],[295,8,295,9],[295,10,297,10],[295,11,295,12],[295,13,297,13],[296,5,297,5],[296,6,297,6],[296,8,297,8],[296,9,297,9],[296,11,297,11],[296,12,297,12]]}
[null,"DANE DO WNIOSKU - proszę nic nie zmieniać w tym arkuszu"]
[]
[null,"KATEGORIA",null,"jednoroczne","wieloletnie",null,"Dzień","Miesiąc ","Rok","Kolumna1",null,"ROBOTY","R","BRP"]
[null,"gminna",null,2023,2024,null,1,"I",2000,2023,null,"REMONT","remont","budowa"]
[null,"powiatowa",null,2024,2025,null,2,"II",2001,2022,null,"BUDOWA / ROZBUDOWA / PRZEBUDOWA",null,"rozbudowa"]
[null,"bez kategorii",null,null,2026,null,3,"III",2002,2021,null,null,null,"przebudowa"]
[null,"TAK","TAK",null,2027,null,4,"IV",2003,2020]
[null,"NIE","NIE",null,2028,null,5,"V",2004,2019]
[null,null,"NIE DOTYCZY",null,2029,null,6,"VI",2005,2018,null,null,null,"jednej drogi publicznej odchodzącej od tego skrzyżowania (kontynuacja od skrzyżowania)"]
[null,null,null,null,2030,null,7,"VII",2006,2017,null,null,null,"dwóch dróg publicznych odchodzących od tego skrzyżowania (kontynuacja od skrzyżowania)"]
[null,null,null,null,null,null,8,"VIII",2007,2016,null,null,null,"trzech dróg publicznych odchodzących od tego skrzyżowania (kontynuacja od skrzyżowania)"]
[null,"Klasa drogi",null,"budowa",null,null,9,"IX",2008,2015,null,null,null,"czterech dróg publicznych odchodzących od tego skrzyżowania (kontynuacja od skrzyżowania)"]
[null,"D",null,"rozbudowa",null,null,10,"X",2009,2014]
[null,"L",null,"przebudowa",null,null,11,"XI",2010,2013]
[null,"Z",null,"remont",null,null,12,"XII",2011,2012]
[null,"G",null,null,null,null,13,null,2012,2011]
[null,"GP",null,"stycznia","styczeń",null,14,null,2013,2010]
[null,null,null,"lutego","luty",null,15,null,2014,2009]
[null,"Peryferyjność",null,"marca","marzec",null,16,null,2015,2008]
[null,"mniejszy niż 30 minut",null,"kwietnia","kwiecień",null,17,null,2016,2007]
[null,"w przedziale od 30 do 50 minut",null,"maja","maj",null,18,null,2017,2006]
[null,"większy niż 50 minut",null,"czerwca","czerwiec",null,19,null,2018,2005]
[null,null,null,"lipca","lipiec",null,20,null,2019,2004]
[null,null,null,"sierpnia","sierpień",null,21,null,2020,2003]
[null,"w całości",null,"września","wrzesień",null,22,null,2021,2002]
[null,"w części",null,"października","październik",null,23,null,2022,2001]
[null,null,null,"listopada","listopad",null,24,null,2023,2000]
[null,null,null,"grudnia","grudzień",null,25]
[null,null,null,null,null,null,26]
[null,null,null,null,null,null,27]
[null,"bezpośredni dojazd do:",null,null,null,null,28]
[null,"pośredni dojazd do:",null,null,null,null,29]
[null,"bezpośredni i pośredni dojazd do:",null,null,null,null,30]
[null,null,null,null,null,null,31]
[]
[]
[null,"POWIAT","Buski","Jędrzejowski","Kazimierski","Kielecki","Konecki","Opatowski","Ostrowiecki","Pińczowski","Sandomierski","Skarżyski","Starachowicki","Staszowski","Włoszczowski"]
[null,"Buski","Busko-Zdrój","Imielno","Bejsce","Bieliny","Fałków","Baćkowice","Bałtów","Działoszyce","Dwikozy","Bliżyn","Brody","Bogoria","Kluczewsko"]
[null,"Jędrzejowski","Gnojno","Jędrzejów","Czarnocin","Bodzentyn","Gowarczów","Iwaniska","Bodzechów","Kije","Klimontów","Łączna","Mirzec","Łubnice","Krasocin"]
[null,"Kazimierski","Nowy Korczyn","Małogoszcz","Kazimierza Wielka","Chęciny","Końskie","Lipnik","Ćmielów","Michałów","Koprzywnica","Skarżysko-Kamienna","Pawłów","Oleśnica","Moskorzew"]
{"$rows_left_out":271}