{"text_format":"1","workbook":"xlsx","n_sheets":3,"sheets":["Remont","DANE","Remont - przykładowy"],"not_rendered":{"charts":0,"images":0,"macros":1,"external_links":0,"defined_names":4,"comments":0,"pivot_tables":0},"unopened":[],"bounds":{"document_bytes":16777216,"sheet_cells":100000,"rows_first":2000,"rows_last":500,"rows_between":2000,"halvings":0,"cell_chars":16384,"cell_head_chars":4096},"cells_cut":0,"cells_raw":0,"read":"whole","date_system":"1900"}

{"sheet":"Remont","index":0,"n_rows":142,"n_cols":37,"rows_kept":142,"cut":false,"hidden":false,"merged":[[20,1,20,7],[20,9,20,15],[19,16,19,25],[20,16,20,24],[117,1,117,25],[118,1,118,9],[119,1,119,9],[120,1,120,9],[121,1,121,9],[118,10,118,16],[119,10,119,16],[120,10,120,16],[121,10,121,16],[27,0,27,9],[27,10,27,14],[27,15,27,20],[28,0,28,9],[28,10,28,20],[29,1,29,25],[42,0,42,2],[43,0,43,2],[31,1,31,3],[16,0,17,5],[1,0,1,3],[16,15,17,15],[27,21,28,25],[76,1,76,11],[77,1,77,11],[6,1,6,25],[44,0,44,2],[40,3,40,7],[41,3,41,7],[42,3,42,7],[43,3,43,7],[40,8,40,12],[41,8,41,12],[42,8,42,12],[43,8,43,12],[18,1,18,25],[8,0,8,2],[8,3,8,25],[9,0,9,2],[9,3,9,25],[13,1,13,25],[32,20,32,25],[19,0,19,15],[38,0,38,25],[39,0,40,2],[41,0,41,2],[43,13,43,19],[44,13,44,19],[43,20,43,25],[44,20,44,25],[14,0,14,25],[15,1,15,25],[16,17,16,21],[16,22,16,25],[17,17,17,21],[17,22,17,25],[16,6,17,14],[24,1,24,9],[30,1,30,19],[30,20,30,25],[26,10,26,14],[26,15,26,20],[26,21,26,23],[26,24,26,25],[25,1,25,9],[26,1,26,9],[25,10,25,14],[25,15,25,20],[25,21,25,23],[25,24,25,25],[24,10,24,14],[24,15,24,20],[24,21,24,23],[24,24,24,25],[31,4,31,25],[32,1,32,19],[10,1,10,25],[7,0,7,2],[7,3,7,6],[7,7,7,9],[7,10,7,17],[7,18,7,20],[7,21,7,25],[21,1,21,25],[22,10,23,14],[22,15,23,20],[22,21,22,25],[23,21,23,23],[23,24,23,25],[22,0,23,0],[22,1,23,9],[11,0,11,3],[12,0,12,3],[11,4,11,6],[12,4,12,6],[11,7,11,10],[12,7,12,10],[11,11,11,16],[12,11,12,16],[11,17,11,25],[0,1,0,3],[0,4,0,25],[1,4,1,25],[2,0,2,25],[3,0,3,25],[4,0,5,2],[4,3,5,14],[4,15,5,16],[4,17,5,25],[12,17,12,25],[53,1,53,25],[49,20,49,21],[49,22,49,23],[49,24,49,25],[45,1,45,25],[46,0,47,0],[33,1,33,3],[33,4,33,25],[34,1,34,19],[34,20,34,25],[35,1,35,3],[35,4,35,25],[36,1,36,19],[36,20,36,25],[37,1,37,25],[39,13,40,19],[41,13,41,19],[42,13,42,19],[39,20,40,25],[41,20,41,25],[42,20,42,25],[47,20,47,21],[52,1,52,25],[44,3,44,12],[39,3,39,12],[141,0,141,25],[142,0,142,25],[136,23,136,25],[137,23,137,25],[134,23,134,25],[135,23,135,25],[139,0,139,25],[140,1,140,25],[133,3,133,22],[134,3,134,22],[135,3,135,22],[136,3,136,22],[137,3,137,22],[118,17,118,25],[132,3,132,22],[133,23,133,25],[129,23,129,25],[130,3,130,22],[122,1,122,25],[132,23,132,25],[131,23,131,25],[119,17,119,25],[123,0,123,25],[124,2,124,25],[125,2,125,25],[126,2,126,25],[127,2,127,25],[128,2,128,25],[129,3,129,22],[131,3,131,22],[120,17,120,25],[121,17,121,25],[62,23,62,25],[60,23,60,25],[50,20,50,21],[61,1,61,22],[62,2,62,22],[46,1,47,11],[48,1,48,11],[49,1,49,11],[50,1,50,11],[46,12,47,19],[48,12,48,19],[50,22,50,23],[50,24,50,25],[51,1,51,22],[51,23,51,25],[47,22,47,23],[95,1,95,25],[96,4,96,7],[96,8,96,25],[91,1,91,4],[94,22,94,25],[92,22,92,25],[93,22,93,25],[92,1,93,21],[63,1,63,25],[64,2,64,22],[65,1,65,4],[65,6,65,25],[66,1,66,25],[64,23,64,25],[94,1,94,21],[67,1,67,9],[68,1,68,9],[67,10,67,12],[68,10,68,12],[67,13,67,25],[68,13,68,25],[70,1,70,12],[70,13,70,25],[84,1,84,25],[106,4,106,25],[104,1,104,3],[104,4,104,25],[103,1,103,25],[105,1,105,25],[96,1,97,3],[97,4,97,7],[97,8,97,25],[101,1,102,3],[102,4,102,7],[102,8,102,25],[106,1,106,3],[100,1,100,25],[101,4,101,7],[101,8,101,25],[98,1,98,25],[99,1,99,3],[112,4,112,7],[112,8,112,25],[109,4,109,7],[109,8,109,25],[114,1,114,25],[111,1,111,25],[109,1,110,3],[112,1,113,3],[115,1,116,3],[110,4,110,7],[113,4,113,7],[116,4,116,7],[110,8,110,25],[113,8,113,25],[116,8,116,25],[49,12,49,19],[50,12,50,19],[46,20,46,25],[61,23,61,25],[57,1,57,25],[58,2,58,22],[59,2,59,22],[60,2,60,22],[54,1,54,25],[55,1,55,25],[47,24,47,25],[48,20,48,21],[48,22,48,23],[48,24,48,25],[58,23,58,25],[59,23,59,25],[56,1,56,4],[56,6,56,25],[130,23,130,25],[92,0,93,0],[99,4,99,25],[72,0,72,25],[74,1,74,3],[74,4,74,25],[76,12,76,14],[77,12,77,14],[76,15,76,25],[77,15,77,25],[87,1,87,25],[81,1,81,3],[81,6,81,25],[83,1,83,3],[83,6,83,25],[86,1,86,3],[86,6,86,25],[89,22,89,25],[90,22,90,25],[108,1,108,25],[107,1,107,4],[107,6,107,25],[115,4,115,7],[115,8,115,25],[88,2,88,21],[89,2,89,21],[88,22,88,25],[90,2,90,21],[91,6,91,25],[85,2,85,25],[69,1,69,25],[71,1,71,25],[73,1,73,25],[75,1,75,25],[78,1,78,4],[78,6,78,25],[79,1,79,25],[80,2,80,25],[82,2,82,25]]}
["!"," UWAGA: ",null,null,"PRZED WYPEŁNIENIEM WNIOSKU NALEŻY ZAPOZNAĆ SIĘ Z INSTRUKCJĄ ."]
[null,null,null,null,"PLIK ZOSTAŁ ZABEZPIECZONY PRZED EDYTOWANIEM. \nPROSZĘ NIE USUWAĆ ZABEZPIECZEŃ I SAMODZIELNIE NIE EDYTOWAĆ PLIKU."]
["WNIOSEK O DOFINANSOWANIE W RAMACH RZĄDOWEGO FUNDUSZU ROZWOJU DRÓG"]
["REMONT"]
["PIECZĘĆ WPŁYWU \nDO URZĘDU \nWOJEWÓDZKIEGO",null,null,null,null,null,null,null,null,null,null,null,null,null,null,"NR EWIDENCYJNY \nWNIOSKU"]
[]
["1. ","NAZWA I ADRES JEDNOSTKI SAMORZĄDU TERYTORIALNEGO"]
["POWIAT ",null,null,null,null,null,null,"GMINA ",null,null,null,null,null,null,null,null,null,null,"NR TERC ",null,null,{"$f":"IFERROR(VLOOKUP(CONCATENATE(D8&K8),DANE!$A$70:$J$184,6,FALSE),\"\")","v":""}]
["NAZWA ",null,null,null,null,null,null,null,null,null,null,null,null,null,null,null,null,null,null,null,null,null,null,null,null,null,{"$f":"LEN(D9)","v":0},"z",90]
["ADRES ",null,null,null,null,null,null,null,null,null,null,null,null,null,null,null,null,null,null,null,null,null,null,null,null,null,{"$f":"LEN(D10)","v":0},"z",90]
["2. ","KATEGORIA, NUMER ORAZ LOKALIZACJA DROGI"]
["KATEGORIA",null,null,null,"NR DROGI",null,null,"POWIAT ",null,null,null,"GMINA",null,null,null,null,null,"MIEJSCOWOŚĆ"]
[]
["3. ","TYTUŁ ZADANIA "]
[null,null,null,null,null,null,null,null,null,null,null,null,null,null,null,null,null,null,null,null,null,null,null,null,null,null,{"$f":"LEN(A15)","v":0},"z",300]
["4. ","PRZEWIDYWANY OKRES REALIZACJI ZADANIA (rozpoczęcie i zakończenie realizacji zadania)"]
[null,null,null,null,null,null,"zadanie jednoroczne realizowane    ",null,null,null,null,null,null,null,null,null,"od",null,null,null,null,null,2023,null,null,null,null,null,null,null,null,null,null,null,{"$f":"IF(R17=\"stycznia\",1,IF(R17=\"lutego\",2,IF(R17=\"marca\",3,IF(R17=\"kwietnia\",4,IF(R17=\"maja\",5,IF(R17=\"czerwca\",6,IF(R17=\"lipca\",7,IF(R17=\"sierpnia\",8,IF(R17=\"września\",9,IF(R17=\"października\",10,IF(R17=\"listopada\",11,IF(R17=\"grudnia\",12,\"\"))))))))))))","v":""},{"$f":"DATE(W17,AI17,1)","v":{"$error":"#VALUE!"}},{"$f":"DATEDIF(AJ17,AJ18,\"m\")","v":{"$error":"#VALUE!"}}]
[null,null,null,null,null,null,null,null,null,null,null,null,null,null,null,null,"do",null,null,null,null,null,null,null,null,null,null,null,null,null,null,null,null,null,{"$f":"IF(R18=\"stycznia\",1,IF(R18=\"lutego\",2,IF(R18=\"marca\",3,IF(R18=\"kwietnia\",4,IF(R18=\"maja\",5,IF(R18=\"czerwca\",6,IF(R18=\"lipca\",7,IF(R18=\"sierpnia\",8,IF(R18=\"września\",9,IF(R18=\"października\",10,IF(R18=\"listopada\",11,IF(R18=\"grudnia\",12,\"\"))))))))))))","v":""},{"$f":"DATE(W18,AI18,1)","v":{"$error":"#VALUE!"}},{"$f":"IFERROR(IF(AK17<12,\"OK\",\"BŁĄD\"),\"liczba\")","v":"liczba"}]
["5. ","DŁUGOŚĆ ODCINKA DROGI OBJĘTEGO ZADANIEM, WG RODZAJU ROBÓT BUDOWLANYCH [km]"]
["RZECZYWISTY KILOMETRAŻ W KTÓRYM ZNAJDUJE SIĘ REMONTOWANY ODCINEK DROGI",null,null,null,null,null,null,null,null,null,null,null,null,null,null,null,"DŁUGOŚĆ ODCINKA DROGI OBJĘTEGO ZADANIEM - REMONT"]
["od",null,null,null,null,null,null,null,"do",null,null,null,null,null,null,null,null,null,null,null,null,null,null,null,null,"km"]
["6. ","PRZEWIDYWANY HARMONOGRAM RZECZOWO-FINANSOWY REALIZACJI ZADANIA"]
["Lp.","ELEMENTY I RODZAJE ROBÓT",null,null,null,null,null,null,null,null,"KOSZT KWALIFIKOWALNY\n [zł]",null,null,null,null,"KOSZT NIEKWALIFIKOWALNY\n [zł]",null,null,null,null,null,"ZAKOŃCZENIE REALIZACJI "]
[null,null,null,null,null,null,null,null,null,null,null,null,null,null,null,null,null,null,null,null,null,"miesiąc",null,null,"rok"]
["1.","Roboty budowlane"]
["2.","Nadzór inwestorski (wszystkie branże)"]
["3.","Tablice informacyjne"]
["SUMA ",null,null,null,null,null,null,null,null,null,{"$f":"SUM(K25:O27)","v":0},null,null,null,null,{"$f":"SUM(P25:U27)","v":0}]
["OGÓŁEM ",null,null,null,null,null,null,null,null,null,{"$f":"SUM(K28:U28)","v":0}]
["7. ","PRZEWIDYWANE KOSZTY REALIZACJI ZADANIA BRUTTO - WYDATKI KWALIFIKOWALNE [zł]"]
["A.","ŁĄCZNY KOSZT REALIZACJI ZADANIA [zł]",null,null,null,null,null,null,null,null,null,null,null,null,null,null,null,null,null,null,{"$f":"IF(K28=0,\"\",K28)","v":""}]
[null,"SŁOWNIE :",null,null,{"$f":"IF(OR(U31=0,U31=\"\"),\"\",Slownie(U31))","v":""}]
["B.","KWOTA WNIOSKOWANEGO DOFINANSOWANIA [zł]",null,null,null,null,null,null,null,null,null,null,null,null,null,null,null,null,null,null,{"$f":"IF(OR(U31=\"\",U37=\"\"),\"\",FLOOR((U31*U37),1))","v":""}]
[null,"SŁOWNIE :",null,null,{"$f":"IF(OR(U33=0,U33=\"\"),\" \",Slownie(U33))","v":" "}]
["C.","KWOTA WKŁADU WŁASNEGO [zł]",null,null,null,null,null,null,null,null,null,null,null,null,null,null,null,null,null,null,{"$f":"IF(OR(U31=\"\",U37=\"\"),\"\",U31-U33)","v":""}]
[null,"SŁOWNIE :",null,null,{"$f":"IF(OR(U35=0,U35=\"\"),\" \",Slownie(U35))","v":" "}]
["D.","UDZIAŁ DOFINANSOWANIA W KOSZTACH KWALIFIKOWALNYCH ZADANIA [%]",null,null,null,null,null,null,null,null,null,null,null,null,null,null,null,null,null,null,{"$f":"IFERROR(VLOOKUP(CONCATENATE(D8&K8),DANE!$A$70:$J$184,10,FALSE),\"\")","v":""}]
["8. ","PRZEWIDYWANY TERMIN DOKONYWANIA WYPŁAT NA RZECZ WYKONAWCY ZADANIA"]
["KWOTA DO WYPŁATY W DANYM ROKU NA RZECZ WYKONAWCY ZADANIA "]
["ROK",null,null,"KWALIFIKOWALNE",null,null,null,null,null,null,null,null,null,"NIEKWALIFIKOWALNE",null,null,null,null,null,null,"OGÓŁEM"]
{"$rows_left_out":103}
{"sheet":"DANE","index":1,"n_rows":184,"n_cols":15,"rows_kept":184,"cut":false,"hidden":true,"merged":[]}
[null,"DANE DO WNIOSKU - proszę nic nie zmieniać w tym arkuszu"]
[]
[null,"KATEGORIA",null,"jednoroczne","wieloletnie",null,"Dzień","Miesiąc ","Rok","Kolumna1"]
[null,"gminna",null,2023,2024,null,1,"I",2000,2023]
[null,"powiatowa",null,2024,2025,null,2,"II",2001,2022]
[null,null,null,null,2026,null,3,"III",2002,2021]
[null,"TAK","TAK",null,2027,null,4,"IV",2003,2020]
[null,"NIE","NIE",null,2028,null,5,"V",2004,2019]
[null,null,"NIE DOTYCZY",null,2029,null,6,"VI",2005,2018]
[null,null,null,null,2030,null,7,"VII",2006,2017]
[null,null,null,null,null,null,8,"VIII",2007,2016]
[null,"Klasa drogi",null,null,null,null,9,"IX",2008,2015]
[null,"D",null,null,null,null,10,"X",2009,2014]
[null,"L",null,null,null,null,11,"XI",2010,2013]
[null,"Z",null,null,null,null,12,"XII",2011,2012]
[null,"G",null,null,null,null,13,null,2012,2011]
[null,"GP",null,"stycznia","styczeń",null,14,null,2013,2010]
[null,null,null,"lutego","luty",null,15,null,2014,2009]
[null,"Peryferyjność",null,"marca","marzec",null,16,null,2015,2008]
[null,"mniejszy niż 30 minut",null,"kwietnia","kwiecień",null,17,null,2016,2007]
[null,"w przedziale od 30 do 50 minut",null,"maja","maj",null,18,null,2017,2006]
[null,"większy niż 50 minut",null,"czerwca","czerwiec",null,19,null,2018,2005]
[null,null,null,"lipca","lipiec",null,20,null,2019,2004]
[null,null,null,"sierpnia","sierpień",null,21,null,2020,2003]
[null,"w całości",null,"września","wrzesień",null,22,null,2021,2002]
[null,"w części",null,"października","październik",null,23,null,2022,2001]
[null,null,null,"listopada","listopad",null,24,null,2023,2000]
[null,null,null,"grudnia","grudzień",null,25]
[null,null,null,null,null,null,26]
[null,null,null,null,null,null,27]
[null,"bezpośredni dojazd do:",null,null,null,null,28]
[null,"pośredni dojazd do:",null,null,null,null,29]
[null,"bezpośredni i pośredni dojazd do:",null,null,null,null,30]
[null,null,null,null,null,null,31]
[]
[]
[null,"POWIAT","Buski","Jędrzejowski","Kazimierski","Kielecki","Konecki","Opatowski","Ostrowiecki","Pińczowski","Sandomierski","Skarżyski","Starachowicki","Staszowski","Włoszczowski"]
[null,"Buski","Busko-Zdrój","Imielno","Bejsce","Bieliny","Fałków","Baćkowice","Bałtów","Działoszyce","Dwikozy","Bliżyn","Brody","Bogoria","Kluczewsko"]
[null,"Jędrzejowski","Gnojno","Jędrzejów","Czarnocin","Bodzentyn","Gowarczów","Iwaniska","Bodzechów","Kije","Klimontów","Łączna","Mirzec","Łubnice","Krasocin"]
[null,"Kazimierski","Nowy Korczyn","Małogoszcz","Kazimierza Wielka","Chęciny","Końskie","Lipnik","Ćmielów","Michałów","Koprzywnica","Skarżysko-Kamienna","Pawłów","Oleśnica","Moskorzew"]
{"$rows_left_out":145}
{"sheet":"Remont - przykładowy","index":2,"n_rows":142,"n_cols":37,"rows_kept":142,"cut":false,"hidden":false,"merged":[[139,0,139,25],[140,1,140,25],[141,0,141,25],[142,0,142,25],[135,3,135,22],[135,23,135,25],[136,3,136,22],[136,23,136,25],[137,3,137,22],[137,23,137,25],[132,3,132,22],[132,23,132,25],[133,3,133,22],[133,23,133,25],[134,3,134,22],[134,23,134,25],[128,2,128,25],[129,3,129,22],[129,23,129,25],[130,3,130,22],[130,23,130,25],[131,3,131,22],[131,23,131,25],[122,1,122,25],[123,0,123,25],[124,2,124,25],[125,2,125,25],[126,2,126,25],[127,2,127,25],[120,1,120,9],[120,10,120,16],[120,17,120,25],[121,1,121,9],[121,10,121,16],[121,17,121,25],[117,1,117,25],[118,1,118,9],[118,10,118,16],[118,17,118,25],[119,1,119,9],[119,10,119,16],[119,17,119,25],[114,1,114,25],[115,1,116,3],[115,4,115,7],[115,8,115,25],[116,4,116,7],[116,8,116,25],[111,1,111,25],[112,1,113,3],[112,4,112,7],[112,8,112,25],[113,4,113,7],[113,8,113,25],[107,1,107,4],[107,6,107,25],[108,1,108,25],[109,1,110,3],[109,4,109,7],[109,8,109,25],[110,4,110,7],[110,8,110,25],[103,1,103,25],[104,1,104,3],[104,4,104,25],[105,1,105,25],[106,1,106,3],[106,4,106,25],[98,1,98,25],[99,1,99,3],[99,4,99,25],[100,1,100,25],[101,1,102,3],[101,4,101,7],[101,8,101,25],[102,4,102,7],[102,8,102,25],[95,1,95,25],[96,1,97,3],[96,4,96,7],[96,8,96,25],[97,4,97,7],[97,8,97,25],[92,0,93,0],[92,1,93,21],[92,22,92,25],[93,22,93,25],[94,1,94,21],[94,22,94,25],[89,2,89,21],[89,22,89,25],[90,2,90,21],[90,22,90,25],[91,1,91,4],[91,6,91,25],[84,1,84,25],[85,2,85,25],[86,1,86,3],[86,6,86,25],[87,1,87,25],[88,2,88,21],[88,22,88,25],[80,2,80,25],[81,1,81,3],[81,6,81,25],[82,2,82,25],[83,1,83,3],[83,6,83,25],[77,1,77,11],[77,12,77,14],[77,15,77,25],[78,1,78,4],[78,6,78,25],[79,1,79,25],[74,1,74,3],[74,4,74,25],[75,1,75,25],[76,1,76,11],[76,12,76,14],[76,15,76,25],[69,1,69,25],[70,1,70,12],[70,13,70,25],[71,1,71,25],[72,0,72,25],[73,1,73,25],[66,1,66,25],[67,1,67,9],[67,10,67,12],[67,13,67,25],[68,1,68,9],[68,10,68,12],[68,13,68,25],[62,2,62,22],[62,23,62,25],[63,1,63,25],[64,2,64,22],[64,23,64,25],[65,1,65,4],[65,6,65,25],[59,2,59,22],[59,23,59,25],[60,2,60,22],[60,23,60,25],[61,1,61,22],[61,23,61,25],[55,1,55,25],[56,1,56,4],[56,6,56,25],[57,1,57,25],[58,2,58,22],[58,23,58,25],[53,1,53,25],[54,1,54,25],[52,1,52,25],[50,1,50,11],[50,12,50,19],[50,20,50,21],[50,22,50,23],[50,24,50,25],[51,1,51,22],[51,23,51,25],[48,1,48,11],[48,12,48,19],[48,20,48,21],[48,22,48,23],[48,24,48,25],[49,1,49,11],[49,12,49,19],[49,20,49,21],[49,22,49,23],[49,24,49,25],[45,1,45,25],[46,0,47,0],[46,1,47,11],[46,12,47,19],[46,20,46,25],[47,20,47,21],[47,22,47,23],[47,24,47,25],[43,0,43,2],[43,3,43,7],[43,8,43,12],[43,13,43,19],[43,20,43,25],[44,0,44,2],[44,3,44,12],[44,13,44,19],[44,20,44,25],[41,0,41,2],[41,3,41,7],[41,8,41,12],[41,13,41,19],[41,20,41,25],[42,0,42,2],[42,3,42,7],[42,8,42,12],[42,13,42,19],[42,20,42,25],[39,0,40,2],[39,3,39,12],[39,13,40,19],[39,20,40,25],[40,3,40,7],[40,8,40,12],[35,1,35,3],[35,4,35,25],[36,1,36,19],[36,20,36,25],[37,1,37,25],[38,0,38,25],[32,1,32,19],[32,20,32,25],[33,1,33,3],[33,4,33,25],[34,1,34,19],[34,20,34,25],[28,10,28,20],[29,1,29,25],[30,1,30,19],[30,20,30,25],[31,1,31,3],[31,4,31,25],[26,1,26,9],[26,10,26,14],[26,15,26,20],[26,21,26,23],[26,24,26,25],[27,0,27,9],[27,10,27,14],[27,15,27,20],[27,21,28,25],[28,0,28,9],[24,1,24,9],[24,10,24,14],[24,15,24,20],[24,21,24,23],[24,24,24,25],[25,1,25,9],[25,10,25,14],[25,15,25,20],[25,21,25,23],[25,24,25,25],[21,1,21,25],[22,0,23,0],[22,1,23,9],[22,10,23,14],[22,15,23,20],[22,21,22,25],[23,21,23,23],[23,24,23,25],[18,1,18,25],[19,0,19,15],[19,16,19,25],[20,1,20,7],[20,9,20,15],[20,16,20,24],[13,1,13,25],[14,0,14,25],[15,1,15,25],[16,0,17,5],[16,6,17,14],[16,15,17,15],[16,17,16,21],[16,22,16,25],[17,17,17,21],[17,22,17,25],[11,0,11,3],[11,4,11,6],[11,7,11,10],[11,11,11,16],[11,17,11,25],[12,0,12,3],[12,4,12,6],[12,7,12,10],[12,11,12,16],[12,17,12,25],[9,0,9,2],[9,3,9,25],[10,1,10,25],[4,0,5,2],[4,3,5,14],[4,15,5,16],[4,17,5,25],[6,1,6,25],[7,0,7,2],[7,3,7,6],[7,7,7,9],[7,10,7,17],[7,18,7,20],[0,1,0,3],[0,4,0,25],[1,0,1,3],[1,4,1,25],[2,0,2,25],[3,0,3,25],[7,21,7,25],[8,0,8,2],[8,3,8,25]]}
["!"," UWAGA: ",null,null,"PRZED WYPEŁNIENIEM WNIOSKU NALEŻY ZAPOZNAĆ SIĘ Z INSTRUKCJĄ ."]
[null,null,null,null,"PLIK ZOSTAŁ ZABEZPIECZONY PRZED EDYTOWANIEM. \nPROSZĘ NIE USUWAĆ ZABEZPIECZEŃ I SAMODZIELNIE NIE EDYTOWAĆ PLIKU."]
["WNIOSEK O DOFINANSOWANIE W RAMACH RZĄDOWEGO FUNDUSZU ROZWOJU DRÓG"]
["REMONT"]
["PIECZĘĆ WPŁYWU \nDO URZĘDU \nWOJEWÓDZKIEGO",null,null,null,null,null,null,null,null,null,null,null,null,null,null,"NR EWIDENCYJNY \nWNIOSKU"]
[]
["1. ","NAZWA I ADRES JEDNOSTKI SAMORZĄDU TERYTORIALNEGO"]
["POWIAT ",null,null,"Buski",null,null,null,"GMINA ",null,null,"Busko-Zdrój",null,null,null,null,null,null,null,"NR TERC ",null,null,{"$f":"IFERROR(VLOOKUP(CONCATENATE(D8&K8),DANE!$A$70:$J$184,6,FALSE),\"\")","v":2601013}]
["NAZWA ",null,null,"Nazwa jednostki samorządu teryrorialnego ubiegająca się o dofinansowanie (90 znaków) ",null,null,null,null,null,null,null,null,null,null,null,null,null,null,null,null,null,null,null,null,null,null,{"$f":"LEN(D9)","v":85},"z",90]
["ADRES ",null,null,"Adres jednostki samorządu teryrorialnego ubiegająca się o dofinansowanie (90 znaków)",null,null,null,null,null,null,null,null,null,null,null,null,null,null,null,null,null,null,null,null,null,null,{"$f":"LEN(D10)","v":84},"z",90]
["2. ","KATEGORIA, NUMER ORAZ LOKALIZACJA DROGI"]
["KATEGORIA",null,null,null,"NR DROGI",null,null,"POWIAT ",null,null,null,"GMINA",null,null,null,null,null,"MIEJSCOWOŚĆ"]
["gminna",null,null,null,"123456T",null,null,"Buski",null,null,null,"Busko-Zdrój",null,null,null,null,null,"Busko-Zdrój"]
["3. ","TYTUŁ ZADANIA "]
["Remont drogi gminnej … (300 znaków) ",null,null,null,null,null,null,null,null,null,null,null,null,null,null,null,null,null,null,null,null,null,null,null,null,null,{"$f":"LEN(A15)","v":36},"z",300]
["4. ","PRZEWIDYWANY OKRES REALIZACJI ZADANIA (rozpoczęcie i zakończenie realizacji zadania)"]
[null,null,null,null,null,null,"zadanie jednoroczne realizowane    ",null,null,null,null,null,null,null,null,null,"od","kwietnia",null,null,null,null,2023,null,null,null,null,null,null,null,null,null,null,null,{"$f":"IF(R17=\"stycznia\",1,IF(R17=\"lutego\",2,IF(R17=\"marca\",3,IF(R17=\"kwietnia\",4,IF(R17=\"maja\",5,IF(R17=\"czerwca\",6,IF(R17=\"lipca\",7,IF(R17=\"sierpnia\",8,IF(R17=\"września\",9,IF(R17=\"października\",10,IF(R17=\"listopada\",11,IF(R17=\"grudnia\",12,\"\"))))))))))))","v":4},{"$f":"DATE(W17,AI17,1)","v":"2023-04-01"},{"$f":"DATEDIF(AJ17,AJ18,\"m\")","v":10}]
[null,null,null,null,null,null,null,null,null,null,null,null,null,null,null,null,"do","lutego",null,null,null,null,2024,null,null,null,null,null,null,null,null,null,null,null,{"$f":"IF(R18=\"stycznia\",1,IF(R18=\"lutego\",2,IF(R18=\"marca\",3,IF(R18=\"kwietnia\",4,IF(R18=\"maja\",5,IF(R18=\"czerwca\",6,IF(R18=\"lipca\",7,IF(R18=\"sierpnia\",8,IF(R18=\"września\",9,IF(R18=\"października\",10,IF(R18=\"listopada\",11,IF(R18=\"grudnia\",12,\"\"))))))))))))","v":2},{"$f":"DATE(W18,AI18,1)","v":"2024-02-01"},{"$f":"IFERROR(IF(AK17<12,\"OK\",\"BŁĄD\"),\"liczba\")","v":"OK"}]
["5. ","DŁUGOŚĆ ODCINKA DROGI OBJĘTEGO ZADANIEM, WG RODZAJU ROBÓT BUDOWLANYCH [km]"]
["RZECZYWISTY KILOMETRAŻ W KTÓRYM ZNAJDUJE SIĘ REMONTOWANY ODCINEK DROGI",null,null,null,null,null,null,null,null,null,null,null,null,null,null,null,"DŁUGOŚĆ ODCINKA DROGI OBJĘTEGO ZADANIEM - REMONT"]
["od","0+010",null,null,null,null,null,null,"do","0+850",null,null,null,null,null,null,0.86,null,null,null,null,null,null,null,null,"km"]
["6. ","PRZEWIDYWANY HARMONOGRAM RZECZOWO-FINANSOWY REALIZACJI ZADANIA"]
["Lp.","ELEMENTY I RODZAJE ROBÓT",null,null,null,null,null,null,null,null,"KOSZT KWALIFIKOWALNY\n [zł]",null,null,null,null,"KOSZT NIEKWALIFIKOWALNY\n [zł]",null,null,null,null,null,"ZAKOŃCZENIE REALIZACJI "]
[null,null,null,null,null,null,null,null,null,null,null,null,null,null,null,null,null,null,null,null,null,"miesiąc",null,null,"rok"]
["1.","Roboty budowlane",null,null,null,null,null,null,null,null,896354.23,null,null,null,null,79351.460000000006,null,null,null,null,null,"luty",null,null,2024]
["2.","Nadzór inwestorski (wszystkie branże)",null,null,null,null,null,null,null,null,5500,null,null,null,null,0,null,null,null,null,null,"luty",null,null,2024]
["3.","Tablice informacyjne",null,null,null,null,null,null,null,null,1500,null,null,null,null,0,null,null,null,null,null,"luty",null,null,2024]
["SUMA ",null,null,null,null,null,null,null,null,null,{"$f":"SUM(K25:O27)","v":903354.23},null,null,null,null,{"$f":"SUM(P25:U27)","v":79351.460000000006}]
["OGÓŁEM ",null,null,null,null,null,null,null,null,null,{"$f":"SUM(K28:U28)","v":982705.69}]
["7. ","PRZEWIDYWANE KOSZTY REALIZACJI ZADANIA BRUTTO - WYDATKI KWALIFIKOWALNE [zł]"]
["A.","ŁĄCZNY KOSZT REALIZACJI ZADANIA [zł]",null,null,null,null,null,null,null,null,null,null,null,null,null,null,null,null,null,null,{"$f":"IF(K28=0,\"\",K28)","v":903354.23}]
[null,"SŁOWNIE :",null,null,{"$f":"IF(OR(U31=0,U31=\"\"),\"\",Slownie(U31))","v":"dziewięćset trzy tysiące trzysta pięćdziesiąt cztery złote dwadzieścia trzy grosze"}]
["B.","KWOTA WNIOSKOWANEGO DOFINANSOWANIA [zł]",null,null,null,null,null,null,null,null,null,null,null,null,null,null,null,null,null,null,{"$f":"IF(OR(U31=\"\",U37=\"\"),\"\",FLOOR((U31*U37),1))","v":632347}]
[null,"SŁOWNIE :",null,null,{"$f":"IF(OR(U33=0,U33=\"\"),\" \",Slownie(U33))","v":"sześćset trzydzieści dwa tysiące trzysta czterdzieści siedem złotych zero groszy"}]
["C.","KWOTA WKŁADU WŁASNEGO [zł]",null,null,null,null,null,null,null,null,null,null,null,null,null,null,null,null,null,null,{"$f":"IF(OR(U31=\"\",U37=\"\"),\"\",U31-U33)","v":271007.23}]
[null,"SŁOWNIE :",null,null,{"$f":"IF(OR(U35=0,U35=\"\"),\" \",Slownie(U35))","v":"dwieście siedemdziesiąt jeden tysięcy siedem złotych dwadzieścia trzy grosze"}]
["D.","UDZIAŁ DOFINANSOWANIA W KOSZTACH KWALIFIKOWALNYCH ZADANIA [%]",null,null,null,null,null,null,null,null,null,null,null,null,null,null,null,null,null,null,{"$f":"IFERROR(VLOOKUP(CONCATENATE(D8&K8),DANE!$A$70:$J$184,10,FALSE),\"\")","v":0.7}]
["8. ","PRZEWIDYWANY TERMIN DOKONYWANIA WYPŁAT NA RZECZ WYKONAWCY ZADANIA"]
["KWOTA DO WYPŁATY W DANYM ROKU NA RZECZ WYKONAWCY ZADANIA "]
["ROK",null,null,"KWALIFIKOWALNE",null,null,null,null,null,null,null,null,null,"NIEKWALIFIKOWALNE",null,null,null,null,null,null,"OGÓŁEM"]
{"$rows_left_out":102}